{"text_format":"1","workbook":"xlsx","n_sheets":16,"sheets":["TOT-0516","LI-05 (1)","LI-05 (2)","LI-05 (3)","LI-05 (4)","LI-05 (5)","T-05 (1)","T-05 (2)","T-05 (3)","T-05 (4)","SA-05 (1)","SA-05 (2)","SA-05 (3)","RE-05 (1)","TASA FALLA","DATO"],"not_rendered":{"charts":0,"images":1,"macros":1,"external_links":1,"defined_names":26,"comments":0,"pivot_tables":0},"unopened":[],"bounds":{"document_bytes":16777216,"sheet_cells":100000,"rows_first":2000,"rows_last":500,"rows_between":2000,"halvings":0,"cell_chars":16384,"cell_head_chars":4096},"cells_cut":0,"cells_raw":0,"read":"whole","date_system":"1900"}

{"sheet":"TOT-0516","index":0,"n_rows":30,"n_cols":9,"rows_kept":30,"cut":false,"hidden":false,"merged":[]}
[]
[null,"ANEXO VI al Memorándum D.T.E.E. N°  243/2017"]
[]
[]
[]
[]
[null,"PRESTADOR DE LA FUNCIÓN TÉCNICA DE TRANSPORTE DE ENERGÍA ELÉCTRICA"]
[]
[null,"TRANSBA S.A."]
[]
[null,"TOTAL DE PENALIZACIONES A APLICAR"]
[]
[null,1,false]
[null,"Desde el 01 al 31 de mayo de 2016"]
[]
[null,"Sanciones duplicadas por tasa de falla > 4 Sal. x año/100km."]
[]
[null,null,"1.-","LÍNEAS",null,null,null,null,{"$f":"'LI-05 (5)'!AC42","v":41758.44}]
[]
[null,null,"2.-","CONEXIÓN"]
[]
[null,null,null,"2.1.-","Transformación",null,null,null,{"$f":"'T-05 (4)'!AC43","v":15071.85}]
[]
[null,null,null,"2.2.-","Salidas",null,null,null,{"$f":"'SA-05 (3)'!V43","v":13244.2}]
[]
[null,null,"3.-","Equipamiento propio Res. 01_03",null,null,null,null,{"$f":"'RE-05 (1)'!AD43","v":16.27}]
[]
[null,null,null,null,null,"TOTAL ",{"$f":"ROUND(SUM(I18:I26),2)","v":70090.759999999995}]
[]
[null,null,"Valores remuneratorios según Acuerdo SEE-ENRE-TRANSBA - 2016-2017"]

{"sheet":"LI-05 (1)","index":1,"n_rows":42,"n_cols":29,"rows_kept":42,"cut":false,"hidden":false,"merged":[]}
[]
[null,{"$f":"'TOT-0516'!B2","v":"ANEXO VI al Memorándum D.T.E.E. N°  243/2017"}]
[]
[]
[]
[]
[]
[null,null,null,null,null,"SISTEMA DE TRANSPORTE DE ENERGÍA ELÉCTRICA POR DISTRIBUCIÓN TRONCAL - TRANSBA S.A."]
[]
[null,null,null,null,null,"1.- LÍNEAS"]
[]
[null,{"$f":"+'TOT-0516'!B14","v":"Desde el 01 al 31 de mayo de 2016"}]
[]
[null,null,null,null,null,"$/100 km-h : LÍNEAS 220 kV ",392.94,null,null,null,null,"FACTOR DE PENALIZACIÓN (CLASE A)  K=",{"$f":"150*'TOT-0516'!B13","v":150},{"$f":"IF(M14=150,\" \",IF(M14=300,\"Coeficiente duplicado por tasa de falla >4 Sal. x año/100 km.\",\"REVISAR COEFICIENTE\"))","v":" "}]
[null,null,null,null,null,"$/100 km-h : LÍNEAS 132 kV ",375.48,null,null,null,null,"FACTOR DE PENALIZACIÓN (CLASE B)  K=",{"$f":"50*'TOT-0516'!B13","v":50},{"$f":"IF(M15=50,\" \",IF(M15=100,\"Coeficiente duplicado por tasa de falla >4 Sal. x año/100 km.\",\"REVISAR COEFICIENTE\"))","v":" "}]
[null,null,null,null,null,"$/100 km-h : LÍNEAS 66 kV ",375.48,null,null,null,null,"FACTOR DE PENALIZACIÓN (CLASE C)  K=",{"$f":"10*'TOT-0516'!B13","v":10},{"$f":"IF(M16=10,\" \",IF(M16=20,\"Coeficiente duplicado por tasa de falla >4 Sal. x año/100 km.\",\"REVISAR COEFICIENTE\"))","v":" "}]
[null,null,3,4,5,6,7,8,9,10,11,12,13,14,15,16,17,18,19,20,21,22,23,24,25,26,27,28,29]
[null,null,"N°","INDISP","ID EQUIPO","LÍNEAS","U\n[kV]","Long.\n[km]","CLASE","$/h","Salida","Entrada","Hs. \nIndisp","Minutos\nIndisp.","Tipo \nSal.(²)","C.R.\n%","K\n(CLASE)","PENALIZ.\nPROGRAM.","REDUCC.\nPROGRAM.","PENALIZACIÓN FORZADA\nPor Salida   1ras. 3 hs.   hs. Restantes",null,null,"REDUCC. FORZADA\nPor Salida   1ras. 3 hs.   hs. Restantes",null,null,"RESTANTE\nFORZADA","REDUCC.\nRESTANTE","Informó\nen Térm.","TOTAL\nPENALIZAC."]
[]
[]
[null,null,1,302046,1434,"9 DE JULIO - BRAGADO",66,60.939998626708984,"C",{"$f":"IF(G21=220,$G$14,IF(G21=132,$G$15,$G$16))*IF(H21>25,H21,25)/100","v":228.81750684356692},"2016-05-01T08:09:00","2016-05-01T17:22:00",{"$f":"IF(F21=\"\",\"\",(L21-K21)*24)","v":9.2166666666744277},{"$f":"IF(F21=\"\",\"\",ROUND((L21-K21)*24*60,0))","v":553},"P","0,000",{"$f":"IF(I21=\"A\",$M$14,IF(I21=\"B\",$M$15,$M$16))","v":10},{"$f":"IF(O21=\"P\",ROUND(N21/60,2)*J21*Q21*0.01,\"--\")","v":210.96974130976872},{"$f":"IF(O21=\"RP\",ROUND(N21/60,2)*J21*Q21*0.01*P21/100,\"--\")","v":"--"},{"$f":"IF(O21=\"F\",J21*Q21,\"--\")","v":"--"},{"$f":"IF(AND(N21>10,O21=\"F\"),J21*Q21*IF(N21>180,3,ROUND((N21)/60,2)),\"--\")","v":"--"},{"$f":"IF(AND(O21=\"F\",N21>180),(ROUND(N21/60,2)-3)*J21*Q21*0.1,\"--\")","v":"--"},{"$f":"IF(O21=\"R\",J21*Q21*P21/100,\"--\")","v":"--"},{"$f":"IF(AND(N21>10,O21=\"R\"),Q21*J21*P21/100*IF(N21>180,3,ROUND((N21)/60,2)),\"--\")","v":"--"},{"$f":"IF(AND(O21=\"R\",N21>180),(ROUND(N21/60,2)-3)*J21*Q21*0.1*P21/100,\"--\")","v":"--"},{"$f":"IF(O21=\"RF\",ROUND(N21/60,2)*J21*Q21*0.1,\"--\")","v":"--"},{"$f":"IF(O21=\"RR\",ROUND(N21/60,2)*J21*Q21*0.1*P21/100,\"--\")","v":"--"},"SI",{"$f":"IF(F21=\"\",\"\",SUM(R21:AA21)*IF(AB21=\"SI\",1,2))","v":210.96974130976872}]
[null,null,2,302337,2741,"RAMALLO - URBANA SAN NICOLAS",132,12.859999656677246,"C",93.87,"2016-05-02T09:03:00","2016-05-02T15:11:00",6.1333333334187046,368,"P","0,000",10,57.542310000000001,"--","--","--","--","--","--","--","--","--","SI",57.542310000000001]
[null,null,3,302338,4935,"LAS PALMAS - SAN PEDRO",132,67.300003051757813,"C",252.69805145874022,"2016-05-02T09:19:00","2016-05-02T15:23:00",6.0666666667093523,364,"P","0,000",10,153.38771723545534,"--","--","--","--","--","--","--","--","--","SI",153.38771723545534]
[null,null,4,302339,1444,"GRAL. MADARIAGA - LAS ARMAS",132,64.400001525878906,"C",241.80912572937012,"2016-05-03T08:49:00","2016-05-03T16:05:00",7.2666666667792015,436,"P","0,000",10,175.79523440525205,"--","--","--","--","--","--","--","--","--","SI",175.79523440525205]
[null,null,5,302341,2741,"RAMALLO - URBANA SAN NICOLAS",132,12.859999656677246,"C",93.87,"2016-05-03T08:54:00","2016-05-03T14:34:00",5.6666666666278616,340,"P","0,000",10,53.224290000000003,"--","--","--","--","--","--","--","--","--","SI",53.224290000000003]
[null,null,6,302342,4935,"LAS PALMAS - SAN PEDRO",132,67.300003051757813,"C",252.69805145874022,"2016-05-03T09:21:00","2016-05-03T15:44:00",6.3833333333604969,383,"P","0,000",10,161.22135683067629,"--","--","--","--","--","--","--","--","--","SI",161.22135683067629]
[null,null,7,302344,4074,"INDIO RICO - PRINGLES",132,44.400001525878906,"C",166.71312572937012,"2016-05-03T09:50:00","2016-05-03T18:03:00",8.2166666667326353,493,"P","0,000",10,137.03818934954225,"--","--","--","--","--","--","--","--","--","SI",137.03818934954225]
[null,null,8,302348,4935,"LAS PALMAS - SAN PEDRO",132,67.300003051757813,"C",252.69805145874022,"2016-05-04T08:42:00","2016-05-04T15:42:00",6.9999999999417923,420,"P","0,000",10,176.88863602111815,"--","--","--","--","--","--","--","--","--","SI",176.88863602111815]
[null,null,9,302349,1444,"GRAL. MADARIAGA - LAS ARMAS",132,64.400001525878906,"C",241.80912572937012,"2016-05-04T08:53:00","2016-05-04T15:58:00",7.0833333333721384,425,"P","0,000",10,171.20086101639404,"--","--","--","--","--","--","--","--","--","SI",171.20086101639404]
[null,null,10,302351,4074,"INDIO RICO - PRINGLES",132,44.400001525878906,"C",166.71312572937012,"2016-05-04T09:28:00","2016-05-04T17:31:00",8.0500000000465661,483,"P","0,000",10,134.20406621214295,"--","--","--","--","--","--","--","--","--","SI",134.20406621214295]
[null,null,11,302353,1444,"GRAL. MADARIAGA - LAS ARMAS",132,64.400001525878906,"C",241.80912572937012,"2016-05-05T08:24:00","2016-05-05T15:40:00",7.2666666667792015,436,"P","0,000",10,175.79523440525205,"--","--","--","--","--","--","--","--","--","SI",175.79523440525205]
[null,null,12,302354,1416,"LINCOLN - BRAGADO",132,109.40000152587891,"C",410.77512572937013,"2016-05-05T08:44:00","2016-05-05T15:19:00",6.5833333333139308,395,"P","0,000",10,270.29003272992554,"--","--","--","--","--","--","--","--","--","SI",270.29003272992554]
[null,null,13,302355,1436,"TRENQUE LAUQUEN - PEHUAJO",66,80.099998474121094,"B",300.75947427062988,"2016-05-05T09:18:00","2016-05-05T15:10:00",5.8666666667559184,352,"P","0,000",50,882.72905698429872,"--","--","--","--","--","--","--","--","--","SI",882.72905698429872]
[null,null,14,302358,4074,"INDIO RICO - PRINGLES",132,44.400001525878906,"C",166.71312572937012,"2016-05-05T09:41:00","2016-05-05T17:26:00",7.7500000001164153,465,"P","0,000",10,129.20267244026184,"--","--","--","--","--","--","--","--","--","SI",129.20267244026184]
[null,null,15,302362,1444,"GRAL. MADARIAGA - LAS ARMAS",132,64.400001525878906,"C",241.80912572937012,"2016-05-06T08:19:00","2016-05-06T15:54:00",7.5833333332557231,455,"P","0,000",10,183.29131730286255,"--","--","--","--","--","--","--","--","--","SI",183.29131730286255]
[null,null,16,302363,1416,"LINCOLN - BRAGADO",132,109.40000152587891,"C",410.77512572937013,"2016-05-06T08:57:00","2016-05-06T14:29:00",5.53333333338378,332,"P","0,000",10,227.15864452834171,"--","--","--","--","--","--","--","--","--","SI",227.15864452834171]
[null,null,17,302365,4074,"INDIO RICO - PRINGLES",132,44.400001525878906,"C",166.71312572937012,"2016-05-06T10:20:00","2016-05-06T17:08:00",6.7999999999883585,408,"P","0,000",10,113.36492549597168,"--","--","--","--","--","--","--","--","--","SI",113.36492549597168]
[null,null,18,302366,1516,"GONZALEZ CHAVEZ - NECOCHEA",132,138.86000061035156,"A",521.39153029174804,"2016-05-07T07:54:00","2016-05-07T17:49:00",9.9166666665114462,595,"P","0,000",150,7758.3059707412112,"--","--","--","--","--","--","--","--","--","SI",7758.3059707412112]
[null,null,19,302369,1410,"MERCEDES B.A. - LUJAN",132,41.299999237060547,"B",155.07323713531497,"2016-05-08T06:55:00","2016-05-08T18:06:00",11.183333333290648,671,"P","0,000",50,866.85939558641076,"--","--","--","--","--","--","--","--","--","SI",866.85939558641076]
[null,null,null,null,null,null,null,null,null,93.87,null,null,"","",null,{"$f":"IF(F40=\"\",\"\",\"--\")","v":""},10,{"$f":"IF(O40=\"P\",ROUND(N40/60,2)*J40*Q40*0.01,\"--\")","v":"--"},"--","--","--","--","--","--","--","--","--",{"$f":"IF(F40=\"\",\"\",\"SI\")","v":""},""]
[]
[null,null,"(²)","P - PROGRAMADA",null,null,null,null,null,null,null,null,null,null,null,null,null,{"$f":"SUM(R19:R41)","v":12038.469652594886},0,0,0,0,0,0,0,0,0,null,{"$f":"ROUND(SUM(AC19:AC41),2)","v":12038.47}]

{"sheet":"LI-05 (2)","index":2,"n_rows":42,"n_cols":29,"rows_kept":42,"cut":false,"hidden":false,"merged":[]}
[]
[null,{"$f":"'TOT-0516'!B2","v":"ANEXO VI al Memorándum D.T.E.E. N°  243/2017"}]
[]
[]
[]
[]
[]
[null,null,null,null,null,"SISTEMA DE TRANSPORTE DE ENERGÍA ELÉCTRICA POR DISTRIBUCIÓN TRONCAL - TRANSBA S.A."]
[]
[null,null,null,null,null,"1.- LÍNEAS"]
[]
[null,{"$f":"+'TOT-0516'!B14","v":"Desde el 01 al 31 de mayo de 2016"}]
[]
[null,null,null,null,null,"$/100 km-h : LÍNEAS 220 kV ",392.94,null,null,null,null,"FACTOR DE PENALIZACIÓN (CLASE A)  K=",{"$f":"150*'TOT-0516'!B13","v":150},{"$f":"IF(M14=150,\" \",IF(M14=300,\"Coeficiente duplicado por tasa de falla >4 Sal. x año/100 km.\",\"REVISAR COEFICIENTE\"))","v":" "}]
[null,null,null,null,null,"$/100 km-h : LÍNEAS 132 kV ",375.48,null,null,null,null,"FACTOR DE PENALIZACIÓN (CLASE B)  K=",{"$f":"50*'TOT-0516'!B13","v":50},{"$f":"IF(M15=50,\" \",IF(M15=100,\"Coeficiente duplicado por tasa de falla >4 Sal. x año/100 km.\",\"REVISAR COEFICIENTE\"))","v":" "}]
[null,null,null,null,null,"$/100 km-h : LÍNEAS 66 kV ",375.48,null,null,null,null,"FACTOR DE PENALIZACIÓN (CLASE C)  K=",{"$f":"10*'TOT-0516'!B13","v":10},{"$f":"IF(M16=10,\" \",IF(M16=20,\"Coeficiente duplicado por tasa de falla >4 Sal. x año/100 km.\",\"REVISAR COEFICIENTE\"))","v":" "}]
[null,null,3,4,5,6,7,8,9,10,11,12,13,14,15,16,17,18,19,20,21,22,23,24,25,26,27,28,29]
[null,null,"N°","INDISP","ID EQUIPO","LÍNEAS","U\n[kV]","Long.\n[km]","CLASE","$/h","Salida","Entrada","Hs. \nIndisp","Minutos\nIndisp.","Tipo \nSal.(²)","C.R.\n%","K\n(CLASE)","PENALIZ.\nPROGRAM.","REDUCC.\nPROGRAM.","PENALIZACIÓN FORZADA\nPor Salida   1ras. 3 hs.   hs. Restantes",null,null,"REDUCC. FORZADA\nPor Salida   1ras. 3 hs.   hs. Restantes",null,null,"RESTANTE\nFORZADA","REDUCC.\nRESTANTE","Informó\nen Térm.","TOTAL\nPENALIZAC."]
[null,null,null,null,null,null,null,null,null,null,null,null,null,null,null,null,null,null,null,null,null,null,null,null,null,null,null,null,{"$f":"'LI-05 (1)'!AC42","v":12038.47}]
[]
[null,null,20,302370,1516,"GONZALEZ CHAVEZ - NECOCHEA",132,138.86000061035156,"A",{"$f":"IF(G21=220,$G$14,IF(G21=132,$G$15,$G$16))*IF(H21>25,H21,25)/100","v":521.39153029174804},"2016-05-08T07:55:00","2016-05-08T17:50:00",{"$f":"IF(F21=\"\",\"\",(L21-K21)*24)","v":9.9166666666860692},{"$f":"IF(F21=\"\",\"\",ROUND((L21-K21)*24*60,0))","v":595},"P","0,000",{"$f":"IF(I21=\"A\",$M$14,IF(I21=\"B\",$M$15,$M$16))","v":150},{"$f":"IF(O21=\"P\",ROUND(N21/60,2)*J21*Q21*0.01,\"--\")","v":7758.3059707412112},{"$f":"IF(O21=\"RP\",ROUND(N21/60,2)*J21*Q21*0.01*P21/100,\"--\")","v":"--"},{"$f":"IF(O21=\"F\",J21*Q21,\"--\")","v":"--"},{"$f":"IF(AND(N21>10,O21=\"F\"),J21*Q21*IF(N21>180,3,ROUND((N21)/60,2)),\"--\")","v":"--"},{"$f":"IF(AND(O21=\"F\",N21>180),(ROUND(N21/60,2)-3)*J21*Q21*0.1,\"--\")","v":"--"},{"$f":"IF(O21=\"R\",J21*Q21*P21/100,\"--\")","v":"--"},{"$f":"IF(AND(N21>10,O21=\"R\"),Q21*J21*P21/100*IF(N21>180,3,ROUND((N21)/60,2)),\"--\")","v":"--"},{"$f":"IF(AND(O21=\"R\",N21>180),(ROUND(N21/60,2)-3)*J21*Q21*0.1*P21/100,\"--\")","v":"--"},{"$f":"IF(O21=\"RF\",ROUND(N21/60,2)*J21*Q21*0.1,\"--\")","v":"--"},{"$f":"IF(O21=\"RR\",ROUND(N21/60,2)*J21*Q21*0.1*P21/100,\"--\")","v":"--"},"SI",{"$f":"IF(F21=\"\",\"\",SUM(R21:AA21)*IF(AB21=\"SI\",1,2))","v":7758.3059707412112}]
[null,null,21,302376,2714,"VILLA LIA \"T\" - NUEVA CAMPANA",132,35,"C",131.41800000000001,"2016-05-08T08:54:00","2016-05-08T17:25:00",8.5166666666627862,511,"P","0,000",10,111.96813600000002,"--","--","--","--","--","--","--","--","--","SI",111.96813600000002]
[null,null,22,302375,2715,"VILLA LIA \"T\" - SAN ANTONIO DE ARECO",132,18.399999618530273,"C",93.87,"2016-05-08T08:54:00","2016-05-08T17:25:00",8.5166666666627862,511,"P","0,000",10,79.977239999999995,"--","--","--","--","--","--","--","--","--","SI",79.977239999999995]
[null,null,23,302377,2713,"VILLA LIA \"T\" - VILLA LÍA",132,8,"C",93.87,"2016-05-08T08:54:00","2016-05-08T17:25:00",8.5166666666627862,511,"P","0,000",10,79.977239999999995,"--","--","--","--","--","--","--","--","--","SI",79.977239999999995]
[null,null,24,302666,1439,"SAN CLEMENTE - DOLORES",132,102.59999847412109,"C",385.24247427062988,"2016-05-09T08:57:00","2016-05-09T17:19:00",8.3666666666977108,502,"P","0,000",10,322.44795096451713,"--","--","--","--","--","--","--","--","--","SI",322.44795096451713]
[null,null,25,302667,3483,"BAHIA BLANCA - PETROQ. BAHIA BLANCA 3",132,29.799999237060547,"C",111.89303713531496,"2016-05-09T09:09:00","2016-05-09T18:43:00",9.5666666667675599,574,"P","0,000",10,107.08163653849643,"--","--","--","--","--","--","--","--","--","SI",107.08163653849643]
[null,null,26,302668,1534,"BAHIA BLANCA - NORTE II",132,19,"C",93.87,"2016-05-09T09:24:00","2016-05-09T18:04:00",8.6666666666278616,520,"P","0,000",10,81.385289999999998,"--","--","--","--","--","--","--","--","--","SI",81.385289999999998]
[]
[null,null,28,302673,1534,"BAHIA BLANCA - NORTE II",132,19,"C",93.87,"2016-05-10T08:20:00","2016-05-10T18:25:00",10.083333333372138,605,"P","0,000",10,94.620959999999997,"--","--","--","--","--","--","--","--","--","SI",94.620959999999997]
[null,null,29,302674,1439,"SAN CLEMENTE - DOLORES",132,102.59999847412109,"C",385.24247427062988,"2016-05-10T08:24:00","2016-05-10T17:14:00",8.8333333333139308,530,"P","0,000",10,340.16910478096622,"--","--","--","--","--","--","--","--","--","SI",340.16910478096622]
[null,null,30,302677,3483,"BAHIA BLANCA - PETROQ. BAHIA BLANCA 3",132,29.799999237060547,"C",111.89303713531496,"2016-05-10T08:44:00","2016-05-10T18:19:00",9.5833333333139308,575,"P","0,000",10,107.19352957563173,"--","--","--","--","--","--","--","--","--","SI",107.19352957563173]
[null,null,31,302678,5280,"BAHÍA BLANCA MONTE HERMOSO 1","0,00","0,00",null,0,"2016-05-10T09:03:00","2016-05-10T18:16:00",9.2166666666744277,553,"P","0,000",10,0,"--","--","--","--","--","--","--","--","--","SI",0]
[null,null,32,302689,1439,"SAN CLEMENTE - DOLORES",132,102.59999847412109,"C",385.24247427062988,"2016-05-11T08:53:00","2016-05-11T17:16:00",8.3833333334187046,503,"P","0,000",10,322.83319343878787,"--","--","--","--","--","--","--","--","--","SI",322.83319343878787]
[null,null,33,302690,5280,"BAHÍA BLANCA MONTE HERMOSO 1","0,00","0,00",null,0,"2016-05-11T08:57:00","2016-05-11T17:27:00",8.4999999999417923,510,"P","0,000",10,0,"--","--","--","--","--","--","--","--","--","SI",0]
[null,null,34,302691,1401,"HENDERSON - CNEL. SUAREZ",132,126.90000152587891,"C",476.48412572937013,"2016-05-11T08:59:00","2016-05-11T14:35:00",5.6000000000931323,336,"P","0,000",10,266.83111040844722,"--","--","--","--","--","--","--","--","--","SI",266.83111040844722]
[null,null,35,302697,1439,"SAN CLEMENTE - DOLORES",132,102.59999847412109,"C",385.24247427062988,"2016-05-12T08:19:00","2016-05-12T17:17:00",8.9666666665580124,538,"P","0,000",10,345.56249942075505,"--","--","--","--","--","--","--","--","--","SI",345.56249942075505]
[null,null,36,302698,5280,"BAHÍA BLANCA MONTE HERMOSO 1","0,00","0,00",null,0,"2016-05-12T08:27:00","2016-05-12T17:31:00",9.0666666667093523,544,"P","0,000",10,0,"--","--","--","--","--","--","--","--","--","SI",0]
[null,null,37,302700,3797,"S. A. ARECO - LUJAN",66,49.799999237060547,"C",186.98903713531493,"2016-05-12T08:52:00","2016-05-12T15:14:00",6.3666666668141261,382,"P","0,000",10,119.11201665519562,"--","--","--","--","--","--","--","--","--","SI",119.11201665519562]
[null,null,38,302703,1418,"ROJAS - JUNIN",132,47.700000762939453,"C",179.10396286468506,"2016-05-12T09:19:00","2016-05-12T14:36:00",5.2833333332673647,317,"P","0,000",10,94.566892392553711,"--","--","--","--","--","--","--","--","--","SI",94.566892392553711]
[null,null,39,302712,5280,"BAHÍA BLANCA MONTE HERMOSO 1","0,00","0,00",null,0,"2016-05-13T08:39:00","2016-05-13T11:09:00",2.4999999999417923,150,"P","0,000",10,{"$f":"IF(O40=\"P\",ROUND(N40/60,2)*J40*Q40*0.01,\"--\")","v":0},"--","--","--","--","--","--","--","--","--","SI",0]
[]
[null,null,"(²)","P - PROGRAMADA  ; F - FORZADA",null,null,null,null,null,null,null,null,null,null,null,null,null,{"$f":"SUM(R19:R41)","v":10232.032770916563},0,0,0,0,0,0,0,0,0,null,{"$f":"ROUND(SUM(AC19:AC41),2)","v":22270.5}]

{"sheet":"LI-05 (3)","index":3,"n_rows":41,"n_cols":29,"rows_kept":41,"cut":false,"hidden":false,"merged":[]}
[]
[null,{"$f":"'TOT-0516'!B2","v":"ANEXO VI al Memorándum D.T.E.E. N°  243/2017"}]
[]
[]
[]
[]
[]
[null,null,null,null,null,"SISTEMA DE TRANSPORTE DE ENERGÍA ELÉCTRICA POR DISTRIBUCIÓN TRONCAL - TRANSBA S.A."]
[]
[null,null,null,null,null,"1.- LÍNEAS"]
[]
[null,{"$f":"+'TOT-0516'!B14","v":"Desde el 01 al 31 de mayo de 2016"}]
[]
[null,null,null,null,null,"$/100 km-h : LÍNEAS 220 kV ",392.94,null,null,null,null,"FACTOR DE PENALIZACIÓN (CLASE A)  K=",{"$f":"150*'TOT-0516'!B13","v":150},{"$f":"IF(M14=150,\" \",IF(M14=300,\"Coeficiente duplicado por tasa de falla >4 Sal. x año/100 km.\",\"REVISAR COEFICIENTE\"))","v":" "}]
[null,null,null,null,null,"$/100 km-h : LÍNEAS 132 kV ",375.48,null,null,null,null,"FACTOR DE PENALIZACIÓN (CLASE B)  K=",{"$f":"50*'TOT-0516'!B13","v":50},{"$f":"IF(M15=50,\" \",IF(M15=100,\"Coeficiente duplicado por tasa de falla >4 Sal. x año/100 km.\",\"REVISAR COEFICIENTE\"))","v":" "}]
[null,null,null,null,null,"$/100 km-h : LÍNEAS 66 kV ",375.48,null,null,null,null,"FACTOR DE PENALIZACIÓN (CLASE C)  K=",{"$f":"10*'TOT-0516'!B13","v":10},{"$f":"IF(M16=10,\" \",IF(M16=20,\"Coeficiente duplicado por tasa de falla >4 Sal. x año/100 km.\",\"REVISAR COEFICIENTE\"))","v":" "}]
[null,null,3,4,5,6,7,8,9,10,11,12,13,14,15,16,17,18,19,20,21,22,23,24,25,26,27,28,29]
[null,null,"N°","INDISP","ID EQUIPO","LÍNEAS","U\n[kV]","Long.\n[km]","CLASE","$/h","Salida","Entrada","Hs. \nIndisp","Minutos\nIndisp.","Tipo \nSal.(²)","C.R.\n%","K\n(CLASE)","PENALIZ.\nPROGRAM.","REDUCC.\nPROGRAM.","PENALIZACIÓN FORZADA\nPor Salida   1ras. 3 hs.   hs. Restantes",null,null,"REDUCC. FORZADA\nPor Salida   1ras. 3 hs.   hs. Restantes",null,null,"RESTANTE\nFORZADA","REDUCC.\nRESTANTE","Informó\nen Térm.","TOTAL\nPENALIZAC."]
[null,null,null,null,null,null,null,null,null,null,null,null,null,null,null,null,null,null,null,null,null,null,null,null,null,null,null,null,{"$f":"'LI-05 (2)'!AC42","v":22270.5}]
[]
[null,null,40,302714,1439,"SAN CLEMENTE - DOLORES",132,102.59999847412109,"C",{"$f":"IF(G21=220,$G$14,IF(G21=132,$G$15,$G$16))*IF(H21>25,H21,25)/100","v":385.24247427062988},"2016-05-13T09:08:00","2016-05-13T16:35:00",{"$f":"IF(F21=\"\",\"\",(L21-K21)*24)","v":7.4499999998370185},{"$f":"IF(F21=\"\",\"\",ROUND((L21-K21)*24*60,0))","v":447},"P","0,000",{"$f":"IF(I21=\"A\",$M$14,IF(I21=\"B\",$M$15,$M$16))","v":10},{"$f":"IF(O21=\"P\",ROUND(N21/60,2)*J21*Q21*0.01,\"--\")","v":287.0056433316193},{"$f":"IF(O21=\"RP\",ROUND(N21/60,2)*J21*Q21*0.01*P21/100,\"--\")","v":"--"},{"$f":"IF(O21=\"F\",J21*Q21,\"--\")","v":"--"},{"$f":"IF(AND(N21>10,O21=\"F\"),J21*Q21*IF(N21>180,3,ROUND((N21)/60,2)),\"--\")","v":"--"},{"$f":"IF(AND(O21=\"F\",N21>180),(ROUND(N21/60,2)-3)*J21*Q21*0.1,\"--\")","v":"--"},{"$f":"IF(O21=\"R\",J21*Q21*P21/100,\"--\")","v":"--"},{"$f":"IF(AND(N21>10,O21=\"R\"),Q21*J21*P21/100*IF(N21>180,3,ROUND((N21)/60,2)),\"--\")","v":"--"},{"$f":"IF(AND(O21=\"R\",N21>180),(ROUND(N21/60,2)-3)*J21*Q21*0.1*P21/100,\"--\")","v":"--"},{"$f":"IF(O21=\"RF\",ROUND(N21/60,2)*J21*Q21*0.1,\"--\")","v":"--"},{"$f":"IF(O21=\"RR\",ROUND(N21/60,2)*J21*Q21*0.1*P21/100,\"--\")","v":"--"},"SI",{"$f":"IF(F21=\"\",\"\",SUM(R21:AA21)*IF(AB21=\"SI\",1,2))","v":287.0056433316193}]
[null,null,41,302720,3483,"BAHIA BLANCA - PETROQ. BAHIA BLANCA 3",132,29.799999237060547,"C",111.89303713531496,"2016-05-14T07:38:00","2016-05-14T17:44:00",10.099999999918509,606,"P","0,000",10,113.01196750666811,"--","--","--","--","--","--","--","--","--","SI",113.01196750666811]
[null,null,42,302721,1534,"BAHIA BLANCA - NORTE II",132,19,"C",93.87,"2016-05-14T07:53:00","2016-05-14T18:41:00",10.799999999930151,648,"P","0,000",10,101.37960000000001,"--","--","--","--","--","--","--","--","--","SI",101.37960000000001]
[null,null,43,302724,1534,"BAHIA BLANCA - NORTE II",132,19,"C",93.87,"2016-05-15T07:16:00","2016-05-15T19:27:00",12.183333333407063,731,"P","0,000",10,114.33366000000002,"--","--","--","--","--","--","--","--","--","SI",114.33366000000002]
[null,null,44,302725,3483,"BAHIA BLANCA - PETROQ. BAHIA BLANCA 3",132,29.799999237060547,"C",111.89303713531496,"2016-05-15T07:36:00","2016-05-15T19:22:00",11.766666666604578,706,"P","0,000",10,131.6981047082657,"--","--","--","--","--","--","--","--","--","SI",131.6981047082657]
[null,null,45,302728,1529,"MIRAMAR - NECOCHEA",132,103.29000091552734,"A",387.8332954376221,"2016-05-15T08:20:00","2016-05-15T17:26:00",9.1000000001513399,546,"P","0,000",150,5293.9244827235407,"--","--","--","--","--","--","--","--","--","SI",5293.9244827235407]
[null,null,46,302958,4889,"CAMPANA III - MATHEU",132,21,"C",93.87,"2016-05-16T08:24:00","2016-05-16T15:15:00",6.8499999999767169,411,"P","0,000",10,64.30095,"--","--","--","--","--","--","--","--","--","SI",0]
[null,null,47,302960,4070,"CHILLAR - GONZALES CHAVEZ ",132,89.139999389648438,"C",334.70286970825197,"2016-05-16T09:06:00","2016-05-16T17:29:00",8.3833333334187046,503,"P","0,000",10,280.48100481551518,"--","--","--","--","--","--","--","--","--","SI",280.48100481551518]
[null,null,48,302974,3482,"BAHIA BLANCA - PETROQ. BAHIA BLANCA 2",132,29.799999237060547,"C",111.89303713531496,"2016-05-17T10:52:00","2016-05-17T15:55:00",5.0500000000465661,303,"P","0,000",10,56.505983753334057,"--","--","--","--","--","--","--","--","--","SI",56.505983753334057]
[null,null,49,302976,3482,"BAHIA BLANCA - PETROQ. BAHIA BLANCA 2",132,29.799999237060547,"C",111.89303713531496,"2016-05-18T09:13:00","2016-05-18T17:00:00",7.78333333338378,467,"P","0,000",10,87.052782891275044,"--","--","--","--","--","--","--","--","--","SI",87.052782891275044]
[null,null,50,302982,5043,"RAMALLO - SIDERAR  1",132,6.75,"C",93.87,"2016-05-18T11:26:00","2016-05-18T17:42:00",6.2666666666627862,376,"P","0,000",10,58.856489999999994,"--","--","--","--","--","--","--","--","--","SI",0]
[null,null,51,302983,1446,"OLAVARRIA - HENDERSON",132,139.89999389648437,"C",525.29649708251952,"2016-05-18T13:20:00","2016-05-18T15:18:00",1.96666666661622,118,"P","0,000",10,103.48340992525635,"--","--","--","--","--","--","--","--","--","SI",103.48340992525635]
[null,null,52,302984,1416,"LINCOLN - BRAGADO",132,109.40000152587891,"C",410.77512572937013,"2016-05-19T07:48:00","2016-05-19T17:26:00",9.6333333334769122,578,"P","0,000",10,395.57644607738348,"--","--","--","--","--","--","--","--","--","SI",395.57644607738348]
[null,null,53,302986,3483,"BAHIA BLANCA - PETROQ. BAHIA BLANCA 3",132,29.799999237060547,"C",111.89303713531496,"2016-05-19T08:10:00","2016-05-19T15:45:00",7.5833333332557231,455,"P","0,000",10,84.814922148568726,"--","--","--","--","--","--","--","--","--","SI",84.814922148568726]
[null,null,54,302987,1441,"PERGAMINO - ARRECIFES",66,43.799999237060547,"B",164.46023713531497,"2016-05-19T08:18:00","2016-05-19T08:35:00",0.28333333338377997,17,"P","0,000",50,23.024433198944099,"--","--","--","--","--","--","--","--","--","SI",23.024433198944099]
[null,null,55,302988,1441,"PERGAMINO - ARRECIFES",66,43.799999237060547,"B",164.46023713531497,"2016-05-19T08:50:00","2016-05-19T18:10:00",9.3333333333721384,560,"P","0,000",50,767.20700623624441,"--","--","--","--","--","--","--","--","--","SI",767.20700623624441]
[null,null,56,302990,5043,"RAMALLO - SIDERAR  1",132,6.75,"C",93.87,"2016-05-19T09:34:00","2016-05-19T13:27:00",3.8833333334187046,233,"P","0,000",10,36.421559999999999,"--","--","--","--","--","--","--","--","--","SI",0]
[null,null,57,302991,1519,"TANDIL - NECOCHEA",132,149.19999694824219,"C",560.21614854125983,"2016-05-20T07:49:00","2016-05-20T09:24:00",1.5833333334303461,95,"P","0,000",10,88.514151469519064,"--","--","--","--","--","--","--","--","--","SI",88.514151469519064]
[null,null,58,302992,1416,"LINCOLN - BRAGADO",132,109.40000152587891,"C",410.77512572937013,"2016-05-20T08:15:00","2016-05-20T17:50:00",9.5833333333139308,575,"P","0,000",10,{"$f":"IF(O39=\"P\",ROUND(N39/60,2)*J39*Q39*0.01,\"--\")","v":393.52257044873659},"--","--","--","--","--","--","--","--","--","SI",393.52257044873659]
[]
[null,null,"(²)","P - PROGRAMADA",null,null,null,null,null,null,null,null,null,null,null,null,null,{"$f":"SUM(R19:R40)","v":8481.1151692348722},0,0,0,0,0,0,0,0,0,null,{"$f":"ROUND(SUM(AC19:AC40),2)","v":30592.04}]

{"sheet":"LI-05 (4)","index":4,"n_rows":42,"n_cols":29,"rows_kept":42,"cut":false,"hidden":false,"merged":[]}
[]
[null,{"$f":"'TOT-0516'!B2","v":"ANEXO VI al Memorándum D.T.E.E. N°  243/2017"}]
[]
[]
[]
[]
[]
[null,null,null,null,null,"SISTEMA DE TRANSPORTE DE ENERGÍA ELÉCTRICA POR DISTRIBUCIÓN TRONCAL - TRANSBA S.A."]
[]
[null,null,null,null,null,"1.- LÍNEAS"]
[]
[null,{"$f":"+'TOT-0516'!B14","v":"Desde el 01 al 31 de mayo de 2016"}]
[]
[null,null,null,null,null,"$/100 km-h : LÍNEAS 220 kV ",392.94,null,null,null,null,"FACTOR DE PENALIZACIÓN (CLASE A)  K=",{"$f":"150*'TOT-0516'!B13","v":150},{"$f":"IF(M14=150,\" \",IF(M14=300,\"Coeficiente duplicado por tasa de falla >4 Sal. x año/100 km.\",\"REVISAR COEFICIENTE\"))","v":" "}]
[null,null,null,null,null,"$/100 km-h : LÍNEAS 132 kV ",375.48,null,null,null,null,"FACTOR DE PENALIZACIÓN (CLASE B)  K=",{"$f":"50*'TOT-0516'!B13","v":50},{"$f":"IF(M15=50,\" \",IF(M15=100,\"Coeficiente duplicado por tasa de falla >4 Sal. x año/100 km.\",\"REVISAR COEFICIENTE\"))","v":" "}]
[null,null,null,null,null,"$/100 km-h : LÍNEAS 66 kV ",375.48,null,null,null,null,"FACTOR DE PENALIZACIÓN (CLASE C)  K=",{"$f":"10*'TOT-0516'!B13","v":10},{"$f":"IF(M16=10,\" \",IF(M16=20,\"Coeficiente duplicado por tasa de falla >4 Sal. x año/100 km.\",\"REVISAR COEFICIENTE\"))","v":" "}]
[null,null,3,4,5,6,7,8,9,10,11,12,13,14,15,16,17,18,19,20,21,22,23,24,25,26,27,28,29]
[null,null,"N°","INDISP","ID EQUIPO","LÍNEAS","U\n[kV]","Long.\n[km]","CLASE","$/h","Salida","Entrada","Hs. \nIndisp","Minutos\nIndisp.","Tipo \nSal.(²)","C.R.\n%","K\n(CLASE)","PENALIZ.\nPROGRAM.","REDUCC.\nPROGRAM.","PENALIZACIÓN FORZADA\nPor Salida   1ras. 3 hs.   hs. Restantes",null,null,"REDUCC. FORZADA\nPor Salida   1ras. 3 hs.   hs. Restantes",null,null,"RESTANTE\nFORZADA","REDUCC.\nRESTANTE","Informó\nen Térm.","TOTAL\nPENALIZAC."]
[null,null,null,null,null,null,null,null,null,null,null,null,null,null,null,null,null,null,null,null,null,null,null,null,null,null,null,null,{"$f":"'LI-05 (3)'!AC41","v":30592.04}]
[]
[null,null,59,302994,1441,"PERGAMINO - ARRECIFES",66,43.799999237060547,"B",{"$f":"IF(G21=220,$G$14,IF(G21=132,$G$15,$G$16))*IF(H21>25,H21,25)/100","v":164.46023713531497},"2016-05-20T08:26:00","2016-05-20T16:20:00",{"$f":"IF(F21=\"\",\"\",(L21-K21)*24)","v":7.8999999999068677},{"$f":"IF(F21=\"\",\"\",ROUND((L21-K21)*24*60,0))","v":474},"P","0,000",{"$f":"IF(I21=\"A\",$M$14,IF(I21=\"B\",$M$15,$M$16))","v":50},{"$f":"IF(O21=\"P\",ROUND(N21/60,2)*J21*Q21*0.01,\"--\")","v":649.61793668449411},{"$f":"IF(O21=\"RP\",ROUND(N21/60,2)*J21*Q21*0.01*P21/100,\"--\")","v":"--"},{"$f":"IF(O21=\"F\",J21*Q21,\"--\")","v":"--"},{"$f":"IF(AND(N21>10,O21=\"F\"),J21*Q21*IF(N21>180,3,ROUND((N21)/60,2)),\"--\")","v":"--"},{"$f":"IF(AND(O21=\"F\",N21>180),(ROUND(N21/60,2)-3)*J21*Q21*0.1,\"--\")","v":"--"},{"$f":"IF(O21=\"R\",J21*Q21*P21/100,\"--\")","v":"--"},{"$f":"IF(AND(N21>10,O21=\"R\"),Q21*J21*P21/100*IF(N21>180,3,ROUND((N21)/60,2)),\"--\")","v":"--"},{"$f":"IF(AND(O21=\"R\",N21>180),(ROUND(N21/60,2)-3)*J21*Q21*0.1*P21/100,\"--\")","v":"--"},{"$f":"IF(O21=\"RF\",ROUND(N21/60,2)*J21*Q21*0.1,\"--\")","v":"--"},{"$f":"IF(O21=\"RR\",ROUND(N21/60,2)*J21*Q21*0.1*P21/100,\"--\")","v":"--"},"SI",{"$f":"IF(F21=\"\",\"\",SUM(R21:AA21)*IF(AB21=\"SI\",1,2))","v":649.61793668449411}]
[null,null,60,302995,1382,"URBANA SAN NICOLAS - SAN NICOLAS",132,6.5,"C",93.87,"2016-05-20T08:41:00","2016-05-20T15:29:00",6.7999999999883585,408,"P","0,000",10,63.831600000000002,"--","--","--","--","--","--","--","--","--","SI",63.831600000000002]
[null,null,61,302996,3483,"BAHIA BLANCA - PETROQ. BAHIA BLANCA 3",132,29.799999237060547,"C",111.89303713531496,"2016-05-20T09:07:00","2016-05-20T14:16:00",5.1500000000232831,309,"P","0,000",10,57.624914124687216,"--","--","--","--","--","--","--","--","--","SI",57.624914124687216]
[]
[null,null,63,302999,3483,"BAHIA BLANCA - PETROQ. BAHIA BLANCA 3",132,29.799999237060547,"C",111.89303713531496,"2016-05-21T07:37:00","2016-05-21T17:20:00",9.7166666665580124,583,"P","0,000",10,108.76003209552616,"--","--","--","--","--","--","--","--","--","SI",108.76003209552616]
[null,null,64,303000,1534,"BAHIA BLANCA - NORTE II",132,19,"C",93.87,"2016-05-21T07:45:00","2016-05-21T17:25:00",9.6666666667442769,580,"P","0,000",10,90.772289999999998,"--","--","--","--","--","--","--","--","--","SI",90.772289999999998]
[null,null,65,303001,1416,"LINCOLN - BRAGADO",132,109.40000152587891,"C",410.77512572937013,"2016-05-21T08:04:00","2016-05-21T16:29:00",8.4166666666860692,505,"P","0,000",10,345.87265586412963,"--","--","--","--","--","--","--","--","--","SI",345.87265586412963]
[null,null,66,303002,3483,"BAHIA BLANCA - PETROQ. BAHIA BLANCA 3",132,29.799999237060547,"C",111.89303713531496,"2016-05-22T07:44:00","2016-05-22T16:36:00",8.8666666665812954,532,"P","0,000",10,99.249123939024358,"--","--","--","--","--","--","--","--","--","SI",99.249123939024358]
[null,null,67,303004,1534,"BAHIA BLANCA - NORTE II",132,19,"C",93.87,"2016-05-22T07:54:00","2016-05-22T17:04:00",9.1666666665114462,550,"P","0,000",10,86.078790000000012,"--","--","--","--","--","--","--","--","--","SI",86.078790000000012]
[null,null,68,303008,4277,"SAN PEDRO - RAMALLO INDUSTRIAL",132,58,"C",217.7784,"2016-05-22T09:03:00","2016-05-22T17:23:00",8.3333333334303461,500,"P","0,000",10,181.40940720000003,"--","--","--","--","--","--","--","--","--","SI",181.40940720000003]
[null,null,69,303009,1449,"OLAVARRIA - TANDIL",132,133.19999694824219,"A",500.13934854125984,"2016-05-22T10:16:00","2016-05-22T17:38:00",7.3666666667559184,442,"P","0,000",150,5529.0404981236279,"--","--","--","--","--","--","--","--","--","SI",5529.0404981236279]
[null,null,70,303172,1537,"CNEL. SUAREZ - PIGUE",132,47.599998474121094,"C",178.72847427062987,"2016-05-23T08:29:00","2016-05-23T17:16:00",8.7833333333255723,527,"P","0,000",10,156.92360040961304,"--","--","--","--","--","--","--","--","--","SI",156.92360040961304]
[null,null,71,303173,4696,"SIDERCA - CAMPANA",132,"0,38","C",1.4268240000000001,"2016-05-23T08:49:00","2016-05-23T14:12:00",5.3833333334187046,323,"P","0,000",10,0.76763131200000001,"--","--","--","--","--","--","--","--","--","SI",0.76763131200000001]
[null,null,72,303177,1537,"CNEL. SUAREZ - PIGUE",132,47.599998474121094,"C",178.72847427062987,"2016-05-24T08:31:00","2016-05-24T17:26:00",8.9166666667442769,535,"P","0,000",10,159.42579904940186,"--","--","--","--","--","--","--","--","--","SI",159.42579904940186]
[null,null,73,303181,3796,"C. SARMIENTO - S. A. ARECO",66,31.5,"C",118.2762,"2016-05-24T10:19:00","2016-05-24T13:38:00",3.3166666668257676,199,"P","0,000",10,39.2676984,"--","--","--","--","--","--","--","--","--","SI",39.2676984]
[null,null,74,303182,1537,"CNEL. SUAREZ - PIGUE",132,47.599998474121094,"C",178.72847427062987,"2016-05-26T08:45:00","2016-05-26T17:23:00",8.6333333333604969,518,"P","0,000",10,154.2426732955536,"--","--","--","--","--","--","--","--","--","SI",154.2426732955536]
[null,null,75,303184,4702,"CHACABUCO IND. - SALTO   1",132,48.599998474121094,"C",182.48327427062989,"2016-05-26T09:17:00","2016-05-26T15:07:00",5.8333333333139308,350,"P","0,000",10,106.38774889977724,"--","--","--","--","--","--","--","--","--","SI",106.38774889977724]
[null,null,76,303186,1445,"VILLA GESELL - GRAL. MADARIAGA",132,35,"C",131.41800000000001,"2016-05-26T09:48:00","2016-05-26T23:17:00",13.483333333279006,809,"P","0,000",10,177.151464,"--","--","--","--","--","--","--","--","--","SI",177.151464]
[null,null,77,303190,2713,"VILLA LIA \"T\" - VILLA LÍA",132,8,"C",93.87,"2016-05-26T10:51:00","2016-05-26T15:09:00",4.3000000000465661,258,"P","0,000",10,40.364100000000001,"--","--","--","--","--","--","--","--","--","SI",40.364100000000001]
[null,null,78,303191,1409,"CHIVILCOY - MERCEDES B.A.",132,69.099998474121094,"C",259.45667427062989,"2016-05-26T22:01:00","2016-05-26T22:03:00",3.3333333267364651E-2,2,"F","0,000",10,{"$f":"IF(O40=\"P\",ROUND(N40/60,2)*J40*Q40*0.01,\"--\")","v":"--"},"--",2594.566742706299,"--","--","--","--","--","--","--","SI",2594.566742706299]
[]
[null,null,"(²)","P - PROGRAMADA  ; F - FORZADA",null,null,null,null,null,null,null,null,null,null,null,null,null,{"$f":"SUM(R19:R41)","v":8046.7879633978337},0,2594.566742706299,0,0,0,0,0,0,0,null,{"$f":"ROUND(SUM(AC19:AC41),2)","v":41233.39}]

{"sheet":"LI-05 (5)","index":5,"n_rows":42,"n_cols":29,"rows_kept":42,"cut":false,"hidden":false,"merged":[]}
[]
[null,{"$f":"'TOT-0516'!B2","v":"ANEXO VI al Memorándum D.T.E.E. N°  243/2017"}]
[]
[]
[]
[]
[]
[null,null,null,null,null,"SISTEMA DE TRANSPORTE DE ENERGÍA ELÉCTRICA POR DISTRIBUCIÓN TRONCAL - TRANSBA S.A."]
[]
[null,null,null,null,null,"1.- LÍNEAS"]
[]
[null,{"$f":"+'TOT-0516'!B14","v":"Desde el 01 al 31 de mayo de 2016"}]
[]
[null,null,null,null,null,"$/100 km-h : LÍNEAS 220 kV ",392.94,null,null,null,null,"FACTOR DE PENALIZACIÓN (CLASE A)  K=",{"$f":"150*'TOT-0516'!B13","v":150},{"$f":"IF(M14=150,\" \",IF(M14=300,\"Coeficiente duplicado por tasa de falla >4 Sal. x año/100 km.\",\"REVISAR COEFICIENTE\"))","v":" "}]
[null,null,null,null,null,"$/100 km-h : LÍNEAS 132 kV ",375.48,null,null,null,null,"FACTOR DE PENALIZACIÓN (CLASE B)  K=",{"$f":"50*'TOT-0516'!B13","v":50},{"$f":"IF(M15=50,\" \",IF(M15=100,\"Coeficiente duplicado por tasa de falla >4 Sal. x año/100 km.\",\"REVISAR COEFICIENTE\"))","v":" "}]
[null,null,null,null,null,"$/100 km-h : LÍNEAS 66 kV ",375.48,null,null,null,null,"FACTOR DE PENALIZACIÓN (CLASE C)  K=",{"$f":"10*'TOT-0516'!B13","v":10},{"$f":"IF(M16=10,\" \",IF(M16=20,\"Coeficiente duplicado por tasa de falla >4 Sal. x año/100 km.\",\"REVISAR COEFICIENTE\"))","v":" "}]
[null,null,3,4,5,6,7,8,9,10,11,12,13,14,15,16,17,18,19,20,21,22,23,24,25,26,27,28,29]
[null,null,"N°","INDISP","ID EQUIPO","LÍNEAS","U\n[kV]","Long.\n[km]","CLASE","$/h","Salida","Entrada","Hs. \nIndisp","Minutos\nIndisp.","Tipo \nSal.(²)","C.R.\n%","K\n(CLASE)","PENALIZ.\nPROGRAM.","REDUCC.\nPROGRAM.","PENALIZACIÓN FORZADA\nPor Salida   1ras. 3 hs.   hs. Restantes",null,null,"REDUCC. FORZADA\nPor Salida   1ras. 3 hs.   hs. Restantes",null,null,"RESTANTE\nFORZADA","REDUCC.\nRESTANTE","Informó\nen Térm.","TOTAL\nPENALIZAC."]
[null,null,null,null,null,null,null,null,null,null,null,null,null,null,null,null,null,null,null,null,null,null,null,null,null,null,null,null,{"$f":"'LI-05 (4)'!AC42","v":41233.39}]
[]
[null,null,79,303192,1537,"CNEL. SUAREZ - PIGUE",132,47.599998474121094,"C",{"$f":"IF(G21=220,$G$14,IF(G21=132,$G$15,$G$16))*IF(H21>25,H21,25)/100","v":178.72847427062987},"2016-05-27T08:12:00","2016-05-27T15:48:00",{"$f":"IF(F21=\"\",\"\",(L21-K21)*24)","v":7.5999999999767169},{"$f":"IF(F21=\"\",\"\",ROUND((L21-K21)*24*60,0))","v":456},"P","0,000",{"$f":"IF(I21=\"A\",$M$14,IF(I21=\"B\",$M$15,$M$16))","v":10},{"$f":"IF(O21=\"P\",ROUND(N21/60,2)*J21*Q21*0.01,\"--\")","v":135.8336404456787},{"$f":"IF(O21=\"RP\",ROUND(N21/60,2)*J21*Q21*0.01*P21/100,\"--\")","v":"--"},{"$f":"IF(O21=\"F\",J21*Q21,\"--\")","v":"--"},{"$f":"IF(AND(N21>10,O21=\"F\"),J21*Q21*IF(N21>180,3,ROUND((N21)/60,2)),\"--\")","v":"--"},{"$f":"IF(AND(O21=\"F\",N21>180),(ROUND(N21/60,2)-3)*J21*Q21*0.1,\"--\")","v":"--"},{"$f":"IF(O21=\"R\",J21*Q21*P21/100,\"--\")","v":"--"},{"$f":"IF(AND(N21>10,O21=\"R\"),Q21*J21*P21/100*IF(N21>180,3,ROUND((N21)/60,2)),\"--\")","v":"--"},{"$f":"IF(AND(O21=\"R\",N21>180),(ROUND(N21/60,2)-3)*J21*Q21*0.1*P21/100,\"--\")","v":"--"},{"$f":"IF(O21=\"RF\",ROUND(N21/60,2)*J21*Q21*0.1,\"--\")","v":"--"},{"$f":"IF(O21=\"RR\",ROUND(N21/60,2)*J21*Q21*0.1*P21/100,\"--\")","v":"--"},"SI",{"$f":"IF(F21=\"\",\"\",SUM(R21:AA21)*IF(AB21=\"SI\",1,2))","v":135.8336404456787}]
[null,null,80,303196,2713,"VILLA LIA \"T\" - VILLA LÍA",132,8,"C",93.87,"2016-05-27T09:10:00","2016-05-27T13:39:00",4.4833333332790062,269,"P","0,000",10,42.053760000000004,"--","--","--","--","--","--","--","--","--","SI",42.053760000000004]
[null,null,81,303199,1409,"CHIVILCOY - MERCEDES B.A.",132,69.099998474121094,"C",259.45667427062989,"2016-05-28T08:28:00","2016-05-28T11:43:00",3.2499999999417923,195,"P","0,000",10,84.323419137954716,"--","--","--","--","--","--","--","--","--","SI",84.323419137954716]
[null,null,82,303249,1445,"VILLA GESELL - GRAL. MADARIAGA",132,35,"C",131.41800000000001,"2016-05-30T10:52:00","2016-05-30T17:13:00",6.3500000000931323,381,"P","0,000",10,83.450429999999997,"--","--","--","--","--","--","--","--","--","SI",83.450429999999997]
[null,null,83,303252,1445,"VILLA GESELL - GRAL. MADARIAGA",132,35,"C",131.41800000000001,"2016-05-31T09:12:00","2016-05-31T17:21:00",8.1500000000232831,489,"P","0,000",10,107.10567000000002,"--","--","--","--","--","--","--","--","--","SI",107.10567000000002]
[null,null,84,303253,4831,"NORTE II - LOS CHAÑARES",132,15.729999542236328,"C",93.87,"2016-05-31T09:43:00","2016-05-31T17:25:00",7.6999999999534339,462,"P","0,000",10,72.279900000000012,"--","--","--","--","--","--","--","--","--","SI",72.279900000000012]
[null,null,null,null,null,null,null,null,null,93.87,null,null,"","",null,{"$f":"IF(F27=\"\",\"\",\"--\")","v":""},10,"--","--","--","--","--","--","--","--","--","--",{"$f":"IF(F27=\"\",\"\",\"SI\")","v":""},""]
[null,null,null,null,null,null,null,null,null,93.87,null,null,"","",null,"",10,"--","--","--","--","--","--","--","--","--","--","",""]
[null,null,null,null,null,null,null,null,null,93.87,null,null,"","",null,"",10,"--","--","--","--","--","--","--","--","--","--","",""]
[null,null,null,null,null,null,null,null,null,93.87,null,null,"","",null,"",10,"--","--","--","--","--","--","--","--","--","--","",""]
[null,null,null,null,null,null,null,null,null,93.87,null,null,"","",null,"",10,"--","--","--","--","--","--","--","--","--","--","",""]
[null,null,null,null,null,null,null,null,null,93.87,null,null,"","",null,"",10,"--","--","--","--","--","--","--","--","--","--","",""]
[null,null,null,null,null,null,null,null,null,93.87,null,null,"","",null,"",10,"--","--","--","--","--","--","--","--","--","--","",""]
[null,null,null,null,null,null,null,null,null,93.87,null,null,"","",null,"",10,"--","--","--","--","--","--","--","--","--","--","",""]
[null,null,null,null,null,null,null,null,null,93.87,null,null,"","",null,"",10,"--","--","--","--","--","--","--","--","--","--","",""]
[null,null,null,null,null,null,null,null,null,93.87,null,null,"","",null,"",10,"--","--","--","--","--","--","--","--","--","--","",""]
[null,null,null,null,null,null,null,null,null,93.87,null,null,"","",null,"",10,"--","--","--","--","--","--","--","--","--","--","",""]
[null,null,null,null,null,null,null,null,null,93.87,null,null,"","",null,"",10,"--","--","--","--","--","--","--","--","--","--","",""]
[null,null,null,null,null,null,null,null,null,93.87,null,null,"","",null,"",10,"--","--","--","--","--","--","--","--","--","--","",""]
[null,null,null,null,null,null,null,null,null,93.87,null,null,"","",null,"",10,{"$f":"IF(O40=\"P\",ROUND(N40/60,2)*J40*Q40*0.01,\"--\")","v":"--"},"--","--","--","--","--","--","--","--","--","",""]
[]
[null,null,"(²)","P - PROGRAMADA",null,null,null,null,null,null,null,null,null,null,null,null,null,{"$f":"SUM(R19:R41)","v":525.04681958363346},0,0,0,0,0,0,0,0,0,null,{"$f":"ROUND(SUM(AC19:AC41),2)","v":41758.44}]

{"sheet":"T-05 (1)","index":6,"n_rows":43,"n_cols":29,"rows_kept":43,"cut":false,"hidden":false,"merged":[]}
[]
[null,{"$f":"'TOT-0516'!B2","v":"ANEXO VI al Memorándum D.T.E.E. N°  243/2017"}]
[]
[]
[]
[]
[]
[null,null,null,null,null,"SISTEMA DE TRANSPORTE DE ENERGÍA ELÉCTRICA POR DISTRIBUCIÓN TRONCAL - TRANSBA S.A."]
[]
[null,null,null,null,null,"2.- CONEXIÓN"]
[]
[null,null,null,null,null,"2.1.- Transformación"]
[]
[null,{"$f":"'TOT-0516'!B14","v":"Desde el 01 al 31 de mayo de 2016"}]
[]
[null,null,null,null,null,"Por Transformador por MVA    $ =",null,null,1.31]
[null,null,null,null,null,"Coeficiente de penalización por salida forzada   =",null,null,{"$f":"60*'TOT-0516'!B13","v":60},null,{"$f":"IF(I17=60,\" \",IF(I17=120,\"    Coeficiente duplicado por tasa de falla >4 Sal. x año/100 km.\",\"    REVISAR COEFICIENTE\"))","v":" "}]
[null,null,3,4,5,6,7,8,9,10,11,12,13,14,15,16,17,18,19,20,21,22,23,24,25,26,27,28,29]
[null,null,"N°","INDISP","ID EQUIPO","ESTACIÓN \nTRANSFORMADORA","EQUIPO","POT.\n[MVA]","U\n[kV]","$/h","Salida","Entrada","Hs\nIndisp.","Minutos.\nIndisp.","Tipo \nSal.(²)","AUT.","C.R.\n%","E.N.S.","K (P y ENS)","PENALIZ.\nPROGRAM.","REDUCC.\nPROGRAM.","PENALIZACIÓN FORZADA\nPor Salida   hs. Restantes",null,"REDUCC. FORZADA\nPor Salida   hs. Restantes",null,"RESTANTE\nFORZADA","REDUCC.\nRESTANTE","Informó \nen Térm.","TOTAL\nPENALIZAC."]
[]
[null,null,85,301984,2564,"PRINGLES","T1CF",10,"132/13,2/13,2",{"$f":"H21*$I$16","v":13.100000000000001},"2016-05-01","2016-05-03T17:41:00",{"$f":"IF(F21=\"\",\"\",(L21-K21)*24)","v":65.683333333348855},{"$f":"IF(F21=\"\",\"\",ROUND((L21-K21)*24*60,0))","v":3941},"P",{"$f":"IF(F21=\"\",\"\",IF(OR(O21=\"P\",O21=\"RP\"),\"--\",\"NO\"))","v":"--"},"0,000","NO",{"$f":"$I$17*IF(OR(O21=\"P\",O21=\"RP\"),0.1,1)*IF(R21=\"SI\",1,0.1)","v":0.60000000000000009},{"$f":"IF(O21=\"P\",J21*S21*ROUND(N21/60,2),\"--\")","v":516.24480000000017},{"$f":"IF(O21=\"RP\",J21*S21*ROUND(N21/60,2)*Q21/100,\"--\")","v":"--"},{"$f":"IF(AND(O21=\"F\",P21=\"NO\"),J21*S21,\"--\")","v":"--"},{"$f":"IF(O21=\"F\",J21*S21*ROUND(N21/60,2),\"--\")","v":"--"},{"$f":"IF(AND(O21=\"R\",P21=\"NO\"),J21*S21*Q21/100,\"--\")","v":"--"},{"$f":"IF(O21=\"R\",J21*S21*ROUND(N21/60,2)*Q21/100,\"--\")","v":"--"},{"$f":"IF(O21=\"RF\",J21*S21*ROUND(N21/60,2),\"--\")","v":"--"},{"$f":"IF(O21=\"RR\",J21*S21*ROUND(N21/60,2)*Q21/100,\"--\")","v":"--"},{"$f":"IF(F21=\"\",\"\",\"SI\")","v":"SI"},{"$f":"IF(F21=\"\",\"\",SUM(T21:AA21)*IF(AB21=\"SI\",1,2)*IF(AND(Q21<>\"0,000\",O21=\"RF\"),Q21/100,1))","v":516.24480000000017}]
[null,null,86,302343,2296,"OLAVARRIA VIEJA","T1OA",30,"132/33/13,2",39.300000000000004,"2016-05-03T09:27:00","2016-05-03T11:09:00",{"$f":"IF(F22=\"\",\"\",(L22-K22)*24)","v":1.6999999999534339},{"$f":"IF(F22=\"\",\"\",ROUND((L22-K22)*24*60,0))","v":102},"P",{"$f":"IF(F22=\"\",\"\",IF(OR(O22=\"P\",O22=\"RP\"),\"--\",\"NO\"))","v":"--"},"0,000","NO",{"$f":"$I$17*IF(OR(O22=\"P\",O22=\"RP\"),0.1,1)*IF(R22=\"SI\",1,0.1)","v":0.60000000000000009},{"$f":"IF(O22=\"P\",J22*S22*ROUND(N22/60,2),\"--\")","v":40.086000000000006},{"$f":"IF(O22=\"RP\",J22*S22*ROUND(N22/60,2)*Q22/100,\"--\")","v":"--"},{"$f":"IF(AND(O22=\"F\",P22=\"NO\"),J22*S22,\"--\")","v":"--"},{"$f":"IF(O22=\"F\",J22*S22*ROUND(N22/60,2),\"--\")","v":"--"},{"$f":"IF(AND(O22=\"R\",P22=\"NO\"),J22*S22*Q22/100,\"--\")","v":"--"},{"$f":"IF(O22=\"R\",J22*S22*ROUND(N22/60,2)*Q22/100,\"--\")","v":"--"},{"$f":"IF(O22=\"RF\",J22*S22*ROUND(N22/60,2),\"--\")","v":"--"},{"$f":"IF(O22=\"RR\",J22*S22*ROUND(N22/60,2)*Q22/100,\"--\")","v":"--"},{"$f":"IF(F22=\"\",\"\",\"SI\")","v":"SI"},{"$f":"IF(F22=\"\",\"\",SUM(T22:AA22)*IF(AB22=\"SI\",1,2)*IF(AND(Q22<>\"0,000\",O22=\"RF\"),Q22/100,1))","v":40.086000000000006}]
[null,null,87,302345,2320,"G. CHAVES","Trafo 1",10,"132/33/13,2",13.100000000000001,"2016-05-03T10:13:00","2016-05-03T17:50:00",7.6166666666977108,457,"P",{"$f":"IF(F23=\"\",\"\",IF(OR(O23=\"P\",O23=\"RP\"),\"--\",\"NO\"))","v":"--"},"0,000","NO",0.60000000000000009,59.893200000000014,"--","--","--","--","--","--","--",{"$f":"IF(F23=\"\",\"\",\"SI\")","v":"SI"},{"$f":"IF(F23=\"\",\"\",SUM(T23:AA23)*IF(AB23=\"SI\",1,2)*IF(AND(Q23<>\"0,000\",O23=\"RF\"),Q23/100,1))","v":59.893200000000014}]
[null,null,88,302352,2187,"CARLOS CASARES","Trafo 2",5,"66/13,2",6.5500000000000007,"2016-05-05T07:32:00","2016-05-05T17:15:00",9.7166666667326353,583,"P","--","0,000","NO",0.60000000000000009,38.199600000000011,"--","--","--","--","--","--","--","SI",38.199600000000011]
[null,null,89,302356,2320,"G. CHAVES","Trafo 1",10,"132/33/13,2",13.100000000000001,"2016-05-05T09:39:00","2016-05-05T17:56:00",8.2833333332673647,497,"P","--","0,000","NO",0.60000000000000009,65.080800000000011,"--","--","--","--","--","--","--","SI",65.080800000000011]
[null,null,90,302357,2665,"SAN NICOLAS","Trafo",30,"132/33/13,2",39.300000000000004,"2016-05-05T09:41:00","2016-05-05T15:19:00",5.6333333333604969,338,"P","--","0,000","NO",0.60000000000000009,132.75540000000004,"--","--","--","--","--","--","--","SI",132.75540000000004]
[]
[null,null,92,302364,2665,"SAN NICOLAS","Trafo",30,"132/33/13,2",39.300000000000004,"2016-05-06T09:44:00","2016-05-06T15:02:00",5.2999999999883585,318,"P","--","0,000","NO",0.60000000000000009,124.97400000000002,"--","--","--","--","--","--","--","SI",124.97400000000002]
[null,null,93,302367,2667,"LUJAN","Trafo 1",30,"132/33/13,2",39.300000000000004,"2016-05-07T13:05:00","2016-05-07T18:19:00",5.2333333332790062,314,"P","--","0,000","NO",0.60000000000000009,123.32340000000003,"--","--","--","--","--","--","--","SI",123.32340000000003]
[null,null,94,302371,4420,"MERCEDES BS.AS","T1MD",30,"132/33/13,2",39.300000000000004,"2016-05-08T07:57:00","2016-05-08T12:32:00",4.5833333332557231,275,"P","--","0,000","NO",0.60000000000000009,107.99640000000002,"--","--","--","--","--","--","--","SI",107.99640000000002]
[null,null,95,302373,2607,"CAMPANA","Trafo 1",30,"132/33/13,2",39.300000000000004,"2016-05-08T08:19:00","2016-05-08T17:58:00",9.6500000000232831,579,"P","--","0,000","NO",0.60000000000000009,227.54700000000005,"--","--","--","--","--","--","--","SI",227.54700000000005]
[null,null,96,302379,2259,"HENDERSON","Trafo 5",15,"132/33/13,2",19.650000000000002,"2016-05-08T09:32:00","2016-05-08T16:30:00",6.9666666666744277,418,"P","--","0,000","NO",0.60000000000000009,82.176300000000012,"--","--","--","--","--","--","--","SI",82.176300000000012]
[null,null,97,302381,2310,"TANDIL","T2TD",30,"132/33/13,2",39.300000000000004,"2016-05-08T11:51:00","2016-05-08T12:48:00",0.94999999995343387,57,"P","--","0,000","NO",0.60000000000000009,22.401000000000003,"--","--","--","--","--","--","--","SI",22.401000000000003]
[null,null,98,302383,4485,"MERCEDES BS.AS","T2MD",30,"132/33/13,2",39.300000000000004,"2016-05-08T12:34:00","2016-05-08T16:34:00",4.0000000001164153,240,"P","--","0,000","NO",0.60000000000000009,94.320000000000022,"--","--","--","--","--","--","--","SI",94.320000000000022]
[null,null,99,302665,2096,"S. NIC. URBANA","Trafo 2",44,"132/13,2/13,2",57.64,"2016-05-09T08:20:00","2016-05-09T14:43:00",6.3833333333604969,383,"P","--","0,000","NO",0.60000000000000009,220.64592000000002,"--","--","--","--","--","--","--","SI",220.64592000000002]
[null,null,100,302675,2096,"S. NIC. URBANA","Trafo 2",44,"132/13,2/13,2",57.64,"2016-05-10T08:28:00","2016-05-10T14:51:00",6.3833333333604969,383,"P","--","0,000","NO",0.60000000000000009,220.64592000000002,"--","--","--","--","--","--","--","SI",220.64592000000002]
[null,null,101,302679,2297,"OLAVARRIA VIEJA","T2OA",30,"132/33/13,2",39.300000000000004,"2016-05-10T09:16:00","2016-05-10T14:41:00",5.4166666666860692,325,"P","--","0,000","NO",0.60000000000000009,127.80360000000003,"--","--","--","--","--","--","--","SI",127.80360000000003]
[null,null,102,302680,4432,"T. LAUQUEN","Trafo 4",40,"132/66/13,2",52.400000000000006,"2016-05-10T10:27:00","2016-05-10T14:12:00",3.75,225,"P","--","0,000","NO",0.60000000000000009,117.90000000000003,"--","--","--","--","--","--","--","SI",117.90000000000003]
[null,null,103,302685,2096,"S. NIC. URBANA","Trafo 2",44,"132/13,2/13,2",57.64,"2016-05-11T08:16:00","2016-05-11T15:04:00",6.7999999999883585,408,"P","--","0,000","NO",0.60000000000000009,235.17120000000003,"--","--","--","--","--","--","--","SI",235.17120000000003]
[null,null,104,302687,2297,"OLAVARRIA VIEJA","T2OA",30,"132/33/13,2",39.300000000000004,"2016-05-11T08:41:00","2016-05-11T16:57:00",8.2666666667209938,496,"P","--","0,000","NO",0.60000000000000009,195.00660000000005,"--","--","--","--","--","--","--","SI",195.00660000000005]
[null,null,null,null,null,null,null,null,null,0,null,null,"","",null,"",{"$f":"IF(F41=\"\",\"\",\"--\")","v":""},{"$f":"IF(F41=\"\",\"\",\"NO\")","v":""},6,"--","--","--","--","--","--","--","--","",""]
[]
[null,null,"(²)","P - PROGRAMADA  ; F - FORZADA",null,null,null,null,null,null,null,null,null,null,null,null,null,null,null,{"$f":"SUM(T20:T42)","v":2752.1711400000013},{"$f":"SUM(U20:U42)","v":0},{"$f":"SUM(V20:V42)","v":0},{"$f":"SUM(W22:W42)","v":0},{"$f":"SUM(X20:X42)","v":0},{"$f":"SUM(Y22:Y42)","v":0},{"$f":"SUM(Z20:Z42)","v":0},{"$f":"SUM(AA22:AA42)","v":0},null,{"$f":"ROUND(SUM(AC20:AC42),2)","v":2752.17}]

{"sheet":"T-05 (2)","index":7,"n_rows":43,"n_cols":29,"rows_kept":43,"cut":false,"hidden":false,"merged":[]}
[]
[null,{"$f":"'TOT-0516'!B2","v":"ANEXO VI al Memorándum D.T.E.E. N°  243/2017"}]
[]
[]
[]
[]
[]
[null,null,null,null,null,"SISTEMA DE TRANSPORTE DE ENERGÍA ELÉCTRICA POR DISTRIBUCIÓN TRONCAL - TRANSBA S.A."]
[]
[null,null,null,null,null,"2.- CONEXIÓN"]
[]
[null,null,null,null,null,"2.1.- Transformación"]
[]
[null,{"$f":"'TOT-0516'!B14","v":"Desde el 01 al 31 de mayo de 2016"}]
[]
[null,null,null,null,null,"Por Transformador por MVA    $ =",null,null,1.31]
[null,null,null,null,null,"Coeficiente de penalización por salida forzada   =",null,null,{"$f":"60*'TOT-0516'!B13","v":60},null,{"$f":"IF(I17=60,\" \",IF(I17=120,\"    Coeficiente duplicado por tasa de falla >4 Sal. x año/100 km.\",\"    REVISAR COEFICIENTE\"))","v":" "}]
[null,null,3,4,5,6,7,8,9,10,11,12,13,14,15,16,17,18,19,20,21,22,23,24,25,26,27,28,29]
[null,null,"N°","INDISP","ID EQUIPO","ESTACIÓN \nTRANSFORMADORA","EQUIPO","POT.\n[MVA]","U\n[kV]","$/h","Salida","Entrada","Hs\nIndisp.","Minutos.\nIndisp.","Tipo \nSal.(²)","AUT.","C.R.\n%","E.N.S.","K (P y ENS)","PENALIZ.\nPROGRAM.","REDUCC.\nPROGRAM.","PENALIZACIÓN FORZADA\nPor Salida   hs. Restantes",null,"REDUCC. FORZADA\nPor Salida   hs. Restantes",null,"RESTANTE\nFORZADA","REDUCC.\nRESTANTE","Informó \nen Térm.","TOTAL\nPENALIZAC."]
[null,null,null,null,null,null,null,null,null,null,null,null,null,null,null,null,null,null,null,null,null,null,null,null,null,null,null,null,{"$f":"'T-05 (1)'!AC43","v":2752.17}]
[]
[null,null,105,302693,4432,"T. LAUQUEN","Trafo 4",40,"132/66/13,2",{"$f":"H22*$I$16","v":52.400000000000006},"2016-05-11T09:52:00","2016-05-11T14:41:00",{"$f":"IF(F22=\"\",\"\",(L22-K22)*24)","v":4.8166666666511446},{"$f":"IF(F22=\"\",\"\",ROUND((L22-K22)*24*60,0))","v":289},"P",{"$f":"IF(F22=\"\",\"\",IF(OR(O22=\"P\",O22=\"RP\"),\"--\",\"NO\"))","v":"--"},"0,000","NO",{"$f":"$I$17*IF(OR(O22=\"P\",O22=\"RP\"),0.1,1)*IF(R22=\"SI\",1,0.1)","v":0.60000000000000009},{"$f":"IF(O22=\"P\",J22*S22*ROUND(N22/60,2),\"--\")","v":151.54080000000005},{"$f":"IF(O22=\"RP\",J22*S22*ROUND(N22/60,2)*Q22/100,\"--\")","v":"--"},{"$f":"IF(AND(O22=\"F\",P22=\"NO\"),J22*S22,\"--\")","v":"--"},{"$f":"IF(O22=\"F\",J22*S22*ROUND(N22/60,2),\"--\")","v":"--"},{"$f":"IF(AND(O22=\"R\",P22=\"NO\"),J22*S22*Q22/100,\"--\")","v":"--"},{"$f":"IF(O22=\"R\",J22*S22*ROUND(N22/60,2)*Q22/100,\"--\")","v":"--"},{"$f":"IF(O22=\"RF\",J22*S22*ROUND(N22/60,2),\"--\")","v":"--"},{"$f":"IF(O22=\"RR\",J22*S22*ROUND(N22/60,2)*Q22/100,\"--\")","v":"--"},{"$f":"IF(F22=\"\",\"\",\"SI\")","v":"SI"},{"$f":"IF(F22=\"\",\"\",SUM(T22:AA22)*IF(AB22=\"SI\",1,2)*IF(AND(Q22<>\"0,000\",O22=\"RF\"),Q22/100,1))","v":151.54080000000005}]
[null,null,106,302701,2297,"OLAVARRIA VIEJA","T2OA",30,"132/33/13,2",39.300000000000004,"2016-05-12T08:57:00","2016-05-12T13:45:00",4.7999999999301508,288,"P",{"$f":"IF(F23=\"\",\"\",IF(OR(O23=\"P\",O23=\"RP\"),\"--\",\"NO\"))","v":"--"},"0,000","NO",0.60000000000000009,113.18400000000003,"--","--","--","--","--","--","--",{"$f":"IF(F23=\"\",\"\",\"SI\")","v":"SI"},{"$f":"IF(F23=\"\",\"\",SUM(T23:AA23)*IF(AB23=\"SI\",1,2)*IF(AND(Q23<>\"0,000\",O23=\"RF\"),Q23/100,1))","v":113.18400000000003}]
[null,null,107,302702,2055,"SAN PEDRO","Trafo 1",15,"132/33/13,2",19.650000000000002,"2016-05-12T09:15:00","2016-05-12T17:27:00",8.2000000000116415,492,"P","--","0,000","NO",0.60000000000000009,96.678000000000011,"--","--","--","--","--","--","--","SI",96.678000000000011]
[null,null,108,302704,5288,"BRAGADO","T6BG",15,"132/33/13.2",19.650000000000002,"2016-05-12T09:41:00","2016-05-13T13:24:00",27.716666666732635,1663,"P","--","0,000","NO",0.60000000000000009,326.81880000000007,"--","--","--","--","--","--","--","SI",326.81880000000007]
[null,null,109,302706,4435,"LUJAN","T4LJ",15,"132/66",19.650000000000002,"2016-05-12T09:53:00","2016-05-12T14:31:00",4.6333333332440816,278,"P","--","0,000","NO",0.60000000000000009,54.587700000000012,"--","--","--","--","--","--","--","SI",54.587700000000012]
[null,null,110,302707,5758,"PUNTA ALTA","T1PV",20,"132/33/13.2",26.200000000000003,"2016-05-12T10:05:00","2016-05-12T17:00:00",6.9166666666860692,415,"P","--","0,000","NO",0.60000000000000009,108.78240000000002,"--","--","--","--","--","--","--","SI",108.78240000000002]
[null,null,111,302708,2138,"ARRECIFES","AutoTrafo 2",5,"66/33",6.5500000000000007,"2016-05-12T10:09:00","2016-05-12T16:59:00",6.8333333332557231,410,"P","--","0,000","NO",0.60000000000000009,26.841900000000006,"--","--","--","--","--","--","--","SI",26.841900000000006]
[null,null,112,302711,2565,"PRINGLES","Trafo 2",10,"132/13,2/13,2",13.100000000000001,"2016-05-13T08:06:00","2016-05-13T18:51:00",10.749999999941792,645,"P","--","0,000","NO",0.60000000000000009,84.495000000000019,"--","--","--","--","--","--","--","SI",84.495000000000019]
[null,null,113,302716,4435,"LUJAN","T4LJ",15,"132/66",19.650000000000002,"2016-05-13T09:23:00","2016-05-13T14:10:00",4.78333333338378,287,"P","--","0,000","NO",0.60000000000000009,56.356200000000015,"--","--","--","--","--","--","--","SI",56.356200000000015]
[null,null,114,302717,2138,"ARRECIFES","AutoTrafo 2",5,"66/33",6.5500000000000007,"2016-05-13T09:44:00","2016-05-13T13:48:00",4.0666666666511446,244,"P","--","0,000","NO",0.60000000000000009,15.995100000000006,"--","--","--","--","--","--","--","SI",15.995100000000006]
[null,null,115,302718,5758,"PUNTA ALTA","T1PV",20,"132/33/13.2",26.200000000000003,"2016-05-13T11:05:00","2016-05-13T17:47:00",6.7000000000116415,402,"P","--","0,000","NO",0.60000000000000009,105.32400000000003,"--","--","--","--","--","--","--","SI",105.32400000000003]
[null,null,116,302722,2137,"ARRECIFES","Trafo 2",7.5,"66/13,2",9.8250000000000011,"2016-05-14T07:57:00","2016-05-15T16:33:00",32.599999999918509,1956,"P","--","0,000","NO",0.60000000000000009,192.17700000000005,"--","--","--","--","--","--","--","SI",192.17700000000005]
[null,null,117,302726,2410,"CHASCOMUS","Trafo 2",15,"132/33/13,2",19.650000000000002,"2016-05-15T07:48:00","2016-05-15T10:10:00",2.3666666666977108,142,"P","--","0,000","NO",0.60000000000000009,27.942300000000007,"--","--","--","--","--","--","--","SI",27.942300000000007]
[null,null,118,302729,5424,"LUJAN","T2LJ",40,"132/34.5/13.8",52.400000000000006,"2016-05-15T08:24:00","2016-05-15T13:00:00",4.5999999999767169,276,"P","--","0,000","NO",0.60000000000000009,144.62400000000002,"--","--","--","--","--","--","--","SI",144.62400000000002]
[null,null,119,302731,2667,"LUJAN","Trafo 1",30,"132/33/13,2",39.300000000000004,"2016-05-15T13:03:00","2016-05-15T15:53:00",2.8333333334885538,170,"P","--","0,000","NO",0.60000000000000009,66.731400000000022,"--","--","--","--","--","--","--","SI",66.731400000000022]
[null,null,120,302959,5358,"CORCEMAR","T2CO",30," 132/33/13.2",39.300000000000004,"2016-05-16T08:34:00","2016-05-16T23:46:00",15.199999999953434,912,"P","--","0,000","NO",0.60000000000000009,358.41600000000005,"--","--","--","--","--","--","--","SI",358.41600000000005]
[null,null,121,302961,4652,"OLAVARRIA VIEJA","T3OA",30,"132/33/13,2",39.300000000000004,"2016-05-16T09:33:00","2016-05-16T14:53:00",5.3333333332557231,320,"P","--","0,000","NO",0.60000000000000009,125.68140000000002,"--","--","--","--","--","--","--","SI",125.68140000000002]
[null,null,122,303020,5358,"CORCEMAR","T2CO",30,"132/33/13.2",39.300000000000004,"2016-05-16T23:47:00","2016-05-17T16:15:00",16.466666666732635,988,"F","NO","0,000","NO",6,"--","--",235.8,3883.6259999999997,"--","--","--","--","SI",4119.4259999999995]
[null,null,123,302963,2246,"LINCOLN","Trafo 1",15,"132/33/13,2",19.650000000000002,"2016-05-17T08:48:00","2016-05-17T18:47:00",9.9833333332207985,599,"P","--","0,000","NO",0.60000000000000009,117.66420000000004,"--","--","--","--","--","--","--","SI",117.66420000000004]
[null,null,124,302964,4652,"OLAVARRIA VIEJA","T3OA",30,"132/33/13,2",39.300000000000004,"2016-05-17T09:08:00","2016-05-17T15:28:00",6.3333333331975155,380,"P","--","0,000","NO",0.60000000000000009,149.26140000000004,"--","--","--","--","--","--","--","SI",149.26140000000004]
[]
[null,null,"(²)","P - PROGRAMADA  ; F - FORZADA",null,null,null,null,null,null,null,null,null,null,null,null,null,null,null,{"$f":"SUM(T20:T42)","v":2323.1016000000004},{"$f":"SUM(U20:U42)","v":0},{"$f":"SUM(V20:V42)","v":235.8},{"$f":"SUM(W22:W42)","v":3883.6259999999997},{"$f":"SUM(X20:X42)","v":0},{"$f":"SUM(Y22:Y42)","v":0},{"$f":"SUM(Z20:Z42)","v":0},{"$f":"SUM(AA22:AA42)","v":0},null,{"$f":"ROUND(SUM(AC20:AC42),2)","v":9194.7000000000007}]

{"sheet":"T-05 (3)","index":8,"n_rows":42,"n_cols":29,"rows_kept":42,"cut":false,"hidden":false,"merged":[]}
[]
[null,{"$f":"'TOT-0516'!B2","v":"ANEXO VI al Memorándum D.T.E.E. N°  243/2017"}]
[]
[]
[]
[]
[]
[null,null,null,null,null,"SISTEMA DE TRANSPORTE DE ENERGÍA ELÉCTRICA POR DISTRIBUCIÓN TRONCAL - TRANSBA S.A."]
[]
[null,null,null,null,null,"2.- CONEXIÓN"]
[]
[null,null,null,null,null,"2.1.- Transformación"]
[]
[null,{"$f":"'TOT-0516'!B14","v":"Desde el 01 al 31 de mayo de 2016"}]
[]
[null,null,null,null,null,"Por Transformador por MVA    $ =",null,null,1.31]
[null,null,null,null,null,"Coeficiente de penalización por salida forzada   =",null,null,{"$f":"60*'TOT-0516'!B13","v":60},null,{"$f":"IF(I17=60,\" \",IF(I17=120,\"    Coeficiente duplicado por tasa de falla >4 Sal. x año/100 km.\",\"    REVISAR COEFICIENTE\"))","v":" "}]
[null,null,3,4,5,6,7,8,9,10,11,12,13,14,15,16,17,18,19,20,21,22,23,24,25,26,27,28,29]
[null,null,"N°","INDISP","ID EQUIPO","ESTACIÓN \nTRANSFORMADORA","EQUIPO","POT.\n[MVA]","U\n[kV]","$/h","Salida","Entrada","Hs\nIndisp.","Minutos.\nIndisp.","Tipo \nSal.(²)","AUT.","C.R.\n%","E.N.S.","K (P y ENS)","PENALIZ.\nPROGRAM.","REDUCC.\nPROGRAM.","PENALIZACIÓN FORZADA\nPor Salida   hs. Restantes",null,"REDUCC. FORZADA\nPor Salida   hs. Restantes",null,"RESTANTE\nFORZADA","REDUCC.\nRESTANTE","Informó \nen Térm.","TOTAL\nPENALIZAC."]
[null,null,null,null,null,null,null,null,null,null,null,null,null,null,null,null,null,null,null,null,null,null,null,null,null,null,null,null,{"$f":"'T-05 (2)'!AC43","v":9194.7000000000007}]
[]
[null,null,125,302965,2442,"MAR DE AJO","Trafo 3",44,"132/33/13,2",{"$f":"H22*$I$16","v":57.64},"2016-05-17T09:41:00","2016-05-17T17:34:00",{"$f":"IF(F22=\"\",\"\",(L22-K22)*24)","v":7.8833333333604969},{"$f":"IF(F22=\"\",\"\",ROUND((L22-K22)*24*60,0))","v":473},"P",{"$f":"IF(F22=\"\",\"\",IF(OR(O22=\"P\",O22=\"RP\"),\"--\",\"NO\"))","v":"--"},"0,000","NO",{"$f":"$I$17*IF(OR(O22=\"P\",O22=\"RP\"),0.1,1)*IF(R22=\"SI\",1,0.1)","v":0.60000000000000009},{"$f":"IF(O22=\"P\",J22*S22*ROUND(N22/60,2),\"--\")","v":272.52192000000002},{"$f":"IF(O22=\"RP\",J22*S22*ROUND(N22/60,2)*Q22/100,\"--\")","v":"--"},{"$f":"IF(AND(O22=\"F\",P22=\"NO\"),J22*S22,\"--\")","v":"--"},{"$f":"IF(O22=\"F\",J22*S22*ROUND(N22/60,2),\"--\")","v":"--"},{"$f":"IF(AND(O22=\"R\",P22=\"NO\"),J22*S22*Q22/100,\"--\")","v":"--"},{"$f":"IF(O22=\"R\",J22*S22*ROUND(N22/60,2)*Q22/100,\"--\")","v":"--"},{"$f":"IF(O22=\"RF\",J22*S22*ROUND(N22/60,2),\"--\")","v":"--"},{"$f":"IF(O22=\"RR\",J22*S22*ROUND(N22/60,2)*Q22/100,\"--\")","v":"--"},{"$f":"IF(F22=\"\",\"\",\"SI\")","v":"SI"},{"$f":"IF(F22=\"\",\"\",SUM(T22:AA22)*IF(AB22=\"SI\",1,2)*IF(AND(Q22<>\"0,000\",O22=\"RF\"),Q22/100,1))","v":272.52192000000002}]
[null,null,126,302973,3550,"PETROQUIMICA","Trafo 2",40,"132/33/13,2",52.400000000000006,"2016-05-17T09:46:00","2016-05-17T14:06:00",4.3333333333139308,260,"P",{"$f":"IF(F23=\"\",\"\",IF(OR(O23=\"P\",O23=\"RP\"),\"--\",\"NO\"))","v":"--"},"0,000","NO",0.60000000000000009,136.13520000000003,"--","--","--","--","--","--","--",{"$f":"IF(F23=\"\",\"\",\"SI\")","v":"SI"},{"$f":"IF(F23=\"\",\"\",SUM(T23:AA23)*IF(AB23=\"SI\",1,2)*IF(AND(Q23<>\"0,000\",O23=\"RF\"),Q23/100,1))","v":136.13520000000003}]
[null,null,127,302966,3558,"PETROQUIMICA","Trafo 3",40,"132/33/13,2",52.400000000000006,"2016-05-17T09:46:00","2016-05-17T09:50:00",6.6666666534729302E-2,4,"R","NO",28,"SI",60,"--","--","--","--",880.32000000000016,61.622400000000013,"--","--","SI",941.94240000000013]
[null,null,128,302975,2442,"MAR DE AJO","Trafo 3",44,"132/33/13,2",57.64,"2016-05-18T08:23:00","2016-05-18T15:35:00",7.1999999998952262,432,"P","--","0,000","NO",0.60000000000000009,249.00480000000002,"--","--","--","--","--","--","--","SI",249.00480000000002]
[null,null,129,302978,2246,"LINCOLN","Trafo 1",15,"132/33/13,2",19.650000000000002,"2016-05-18T09:43:00","2016-05-18T18:38:00",8.9166666665696539,535,"P","--","0,000","NO",0.60000000000000009,105.16680000000002,"--","--","--","--","--","--","--","SI",105.16680000000002]
[null,null,130,302979,4652,"OLAVARRIA VIEJA","T3OA",30,"132/33/13,2",39.300000000000004,"2016-05-18T09:51:00","2016-05-18T15:03:00",5.2000000000116415,312,"P","--","0,000","NO",0.60000000000000009,122.61600000000003,"--","--","--","--","--","--","--","SI",122.61600000000003]
[null,null,131,302981,3550,"PETROQUIMICA","Trafo 2",40,"132/33/13,2",52.400000000000006,"2016-05-18T10:04:00","2016-05-18T16:19:00",6.2499999999417923,375,"P","--","0,000","NO",0.60000000000000009,196.50000000000006,"--","--","--","--","--","--","--","SI",196.50000000000006]
[null,null,132,302985,2442,"MAR DE AJO","Trafo 3",44,"132/33/13,2",57.64,"2016-05-19T08:04:00","2016-05-19T15:38:00",7.5666666667093523,454,"P","--","0,000","NO",0.60000000000000009,261.80088000000001,"--","--","--","--","--","--","--","SI",261.80088000000001]
[null,null,133,302989,3816,"BARADERO","T1BD",30,"132/33/13,2",39.300000000000004,"2016-05-19T09:21:00","2016-05-19T14:42:00",5.3500000001513399,321,"P","--","0,000","NO",0.60000000000000009,126.15300000000002,"--","--","--","--","--","--","--","SI",126.15300000000002]
[null,null,134,302993,2442,"MAR DE AJO","Trafo 3",44,"132/33/13,2",57.64,"2016-05-20T08:19:00","2016-05-20T15:50:00",7.5166666665463708,451,"P","--","0,000","NO",0.60000000000000009,260.07168000000001,"--","--","--","--","--","--","--","SI",260.07168000000001]
[null,null,135,302997,3816,"BARADERO","T1BD",30,"132/33/13,2",39.300000000000004,"2016-05-20T09:38:00","2016-05-20T15:04:00",5.433333333407063,326,"P","--","0,000","NO",0.60000000000000009,128.03940000000003,"--","--","--","--","--","--","--","SI",128.03940000000003]
[null,null,136,303005,5424,"LUJAN","T2LJ",40,"132/34.5/13.8",52.400000000000006,"2016-05-22T07:57:00","2016-05-22T13:41:00",5.7333333333372138,344,"P","--","0,000","NO",0.60000000000000009,180.15120000000007,"--","--","--","--","--","--","--","SI",180.15120000000007]
[null,null,137,303007,4573,"NECOCHEA","Trafo 2",30,"132/33/13,2",39.300000000000004,"2016-05-22T08:38:00","2016-05-22T18:08:00",9.5000000000582077,570,"P","--","0,000","NO",0.60000000000000009,224.01000000000005,"--","--","--","--","--","--","--","SI",224.01000000000005]
[null,null,138,303012,2667,"LUJAN","Trafo 1",30,"132/33/13,2",39.300000000000004,"2016-05-22T13:41:00","2016-05-22T17:39:00",3.9666666666744277,238,"P","--","0,000","NO",0.60000000000000009,93.612600000000029,"--","--","--","--","--","--","--","SI",93.612600000000029]
[null,null,139,303175,4210,"URBANA BBCA","Trafo 2",40,"132/33/13,2",52.400000000000006,"2016-05-23T10:46:00","2016-05-23T17:30:00",6.7333333332790062,404,"P","--","0,000","NO",0.60000000000000009,211.59120000000007,"--","--","--","--","--","--","--","SI",211.59120000000007]
[null,null,140,303178,4210,"URBANA BBCA","Trafo 2",40,"132/33/13,2",52.400000000000006,"2016-05-24T09:14:00","2016-05-24T17:22:00",8.1333333333022892,488,"P","--","0,000","NO",0.60000000000000009,255.60720000000009,"--","--","--","--","--","--","--","SI",255.60720000000009]
[null,null,141,303179,3716,"SALTO - BA","Trafo 1",30,"132/33/13,2",39.300000000000004,"2016-05-24T09:27:00","2016-05-24T15:38:00",6.1833333332324401,371,"P","--","0,000","NO",0.60000000000000009,145.72440000000003,"--","--","--","--","--","--","--","SI",145.72440000000003]
[null,null,142,303180,2696,"AZUL","Trafo 3",15,"132/33/13,2",19.650000000000002,"2016-05-24T10:00:00","2016-05-24T16:07:00",6.1166666666977108,367,"P","--","0,000","NO",0.60000000000000009,72.154800000000023,"--","--","--","--","--","--","--","SI",72.154800000000023]
[null,null,143,303183,3716,"SALTO - BA","Trafo 1",30,"132/33/13,2",39.300000000000004,"2016-05-26T08:56:00","2016-05-26T15:24:00",6.466666666790843,388,"P","--","0,000","NO",0.60000000000000009,152.56260000000003,"--","--","--","--","--","--","--","SI",152.56260000000003]
[]
[null,null,"(²)","P - PROGRAMADA  ; R - REDUCCION FORZADA",null,null,null,null,null,null,null,null,null,null,null,null,null,null,null,{"$f":"SUM(T20:T41)","v":3193.4236800000008},{"$f":"SUM(U20:U41)","v":0},{"$f":"SUM(V20:V41)","v":0},{"$f":"SUM(W22:W41)","v":0},{"$f":"SUM(X20:X41)","v":880.32000000000016},{"$f":"SUM(Y22:Y41)","v":61.622400000000013},{"$f":"SUM(Z20:Z41)","v":0},{"$f":"SUM(AA22:AA41)","v":0},null,{"$f":"ROUND(SUM(AC20:AC41),2)","v":13330.07}]

{"sheet":"T-05 (4)","index":9,"n_rows":43,"n_cols":29,"rows_kept":43,"cut":false,"hidden":false,"merged":[]}
[]
[null,{"$f":"'TOT-0516'!B2","v":"ANEXO VI al Memorándum D.T.E.E. N°  243/2017"}]
[]
[]
[]
[]
[]
[null,null,null,null,null,"SISTEMA DE TRANSPORTE DE ENERGÍA ELÉCTRICA POR DISTRIBUCIÓN TRONCAL - TRANSBA S.A."]
[]
[null,null,null,null,null,"2.- CONEXIÓN"]
[]
[null,null,null,null,null,"2.1.- Transformación"]
[]
[null,{"$f":"'TOT-0516'!B14","v":"Desde el 01 al 31 de mayo de 2016"}]
[]
[null,null,null,null,null,"Por Transformador por MVA    $ =",null,null,1.31]
[null,null,null,null,null,"Coeficiente de penalización por salida forzada   =",null,null,{"$f":"60*'TOT-0516'!B13","v":60},null,{"$f":"IF(I17=60,\" \",IF(I17=120,\"    Coeficiente duplicado por tasa de falla >4 Sal. x año/100 km.\",\"    REVISAR COEFICIENTE\"))","v":" "}]
[null,null,3,4,5,6,7,8,9,10,11,12,13,14,15,16,17,18,19,20,21,22,23,24,25,26,27,28,29]
[null,null,"N°","INDISP","ID EQUIPO","ESTACIÓN \nTRANSFORMADORA","EQUIPO","POT.\n[MVA]","U\n[kV]","$/h","Salida","Entrada","Hs\nIndisp.","Minutos.\nIndisp.","Tipo \nSal.(²)","AUT.","C.R.\n%","E.N.S.","K (P y ENS)","PENALIZ.\nPROGRAM.","REDUCC.\nPROGRAM.","PENALIZACIÓN FORZADA\nPor Salida   hs. Restantes",null,"REDUCC. FORZADA\nPor Salida   hs. Restantes",null,"RESTANTE\nFORZADA","REDUCC.\nRESTANTE","Informó \nen Térm.","TOTAL\nPENALIZAC."]
[null,null,null,null,null,null,null,null,null,null,null,null,null,null,null,null,null,null,null,null,null,null,null,null,null,null,null,null,{"$f":"'T-05 (3)'!AC42","v":13330.07}]
[]
[null,null,144,303185,4210,"URBANA BBCA","Trafo 2",40,"132/33/13,2",{"$f":"H22*$I$16","v":52.400000000000006},"2016-05-26T09:24:00","2016-05-26T14:27:00",{"$f":"IF(F22=\"\",\"\",(L22-K22)*24)","v":5.0499999998719431},{"$f":"IF(F22=\"\",\"\",ROUND((L22-K22)*24*60,0))","v":303},"P",{"$f":"IF(F22=\"\",\"\",IF(OR(O22=\"P\",O22=\"RP\"),\"--\",\"NO\"))","v":"--"},"0,000","NO",{"$f":"$I$17*IF(OR(O22=\"P\",O22=\"RP\"),0.1,1)*IF(R22=\"SI\",1,0.1)","v":0.60000000000000009},{"$f":"IF(O22=\"P\",J22*S22*ROUND(N22/60,2),\"--\")","v":158.77200000000005},{"$f":"IF(O22=\"RP\",J22*S22*ROUND(N22/60,2)*Q22/100,\"--\")","v":"--"},{"$f":"IF(AND(O22=\"F\",P22=\"NO\"),J22*S22,\"--\")","v":"--"},{"$f":"IF(O22=\"F\",J22*S22*ROUND(N22/60,2),\"--\")","v":"--"},{"$f":"IF(AND(O22=\"R\",P22=\"NO\"),J22*S22*Q22/100,\"--\")","v":"--"},{"$f":"IF(O22=\"R\",J22*S22*ROUND(N22/60,2)*Q22/100,\"--\")","v":"--"},{"$f":"IF(O22=\"RF\",J22*S22*ROUND(N22/60,2),\"--\")","v":"--"},{"$f":"IF(O22=\"RR\",J22*S22*ROUND(N22/60,2)*Q22/100,\"--\")","v":"--"},{"$f":"IF(F22=\"\",\"\",\"SI\")","v":"SI"},{"$f":"IF(F22=\"\",\"\",SUM(T22:AA22)*IF(AB22=\"SI\",1,2)*IF(AND(Q22<>\"0,000\",O22=\"RF\"),Q22/100,1))","v":158.77200000000005}]
[null,null,145,303188,2696,"AZUL","Trafo 3",15,"132/33/13,2",19.650000000000002,"2016-05-26T10:21:00","2016-05-26T16:06:00",5.7499999998835847,345,"P",{"$f":"IF(F23=\"\",\"\",IF(OR(O23=\"P\",O23=\"RP\"),\"--\",\"NO\"))","v":"--"},"0,000","NO",0.60000000000000009,67.792500000000018,"--","--","--","--","--","--","--",{"$f":"IF(F23=\"\",\"\",\"SI\")","v":"SI"},{"$f":"IF(F23=\"\",\"\",SUM(T23:AA23)*IF(AB23=\"SI\",1,2)*IF(AND(Q23<>\"0,000\",O23=\"RF\"),Q23/100,1))","v":67.792500000000018}]
[null,null,146,303189,2069,"VILLA LIA","Autotrafo",150,"220/132/13,2",196.5,"2016-05-26T10:51:00","2016-05-26T15:09:00",4.3000000000465661,258,"P","--","0,000","NO",0.60000000000000009,506.97000000000008,"--","--","--","--","--","--","--","SI",506.97000000000008]
[null,null,147,303193,3716,"SALTO - BA","Trafo 1",30,"132/33/13,2",39.300000000000004,"2016-05-27T08:52:00","2016-05-27T13:06:00",4.2333333333372138,254,"P","--","0,000","NO",0.60000000000000009,99.743400000000037,"--","--","--","--","--","--","--","SI",99.743400000000037]
[null,null,148,303194,2696,"AZUL","Trafo 3",15,"132/33/13,2",19.650000000000002,"2016-05-27T09:05:00","2016-05-27T11:33:00",2.4666666666744277,148,"P","--","0,000","NO",0.60000000000000009,29.121300000000009,"--","--","--","--","--","--","--","SI",29.121300000000009]
[null,null,149,303195,2069,"VILLA LIA","Autotrafo",150,"220/132/13,2",196.5,"2016-05-27T09:10:00","2016-05-27T13:39:00",4.4833333332790062,269,"P","--","0,000","NO",0.60000000000000009,528.19200000000012,"--","--","--","--","--","--","--","SI",528.19200000000012]
[null,null,150,303198,4210,"URBANA BBCA","Trafo 2",40,"132/33/13,2",52.400000000000006,"2016-05-27T10:12:00","2016-05-27T17:14:00",7.033333333209157,422,"P","--","0,000","NO",0.60000000000000009,221.02320000000006,"--","--","--","--","--","--","--","SI",221.02320000000006]
[null,null,151,303248,2517,"PETROQUIMICA","Trafo 1",15,"132/33/13,2",19.650000000000002,"2016-05-30T08:55:00","2016-05-30T14:39:00",5.7333333333372138,344,"P","--","0,000","NO",0.60000000000000009,67.556700000000021,"--","--","--","--","--","--","--","SI",67.556700000000021]
[null,null,152,303251,2517,"PETROQUIMICA","Trafo 1",15,"132/33/13,2",19.650000000000002,"2016-05-31T08:58:00","2016-05-31T09:24:00",0.43333333334885538,26,"P","--","0,000","NO",0.60000000000000009,5.069700000000001,"--","--","--","--","--","--","--","SI",5.069700000000001]
[null,null,153,303254,5288,"BRAGADO","T6BG",15,"132/33/13.2",19.650000000000002,"2016-05-31T10:28:00","2016-05-31T15:21:00",4.8833333331858739,293,"P","--","0,000","NO",0.60000000000000009,57.53520000000001,"--","--","--","--","--","--","--","SI",57.53520000000001]
[null,null,null,null,null,null,null,null,null,0,null,null,"","",null,"",{"$f":"IF(F32=\"\",\"\",\"--\")","v":""},{"$f":"IF(F32=\"\",\"\",\"NO\")","v":""},6,"--","--","--","--","--","--","--","--","",""]
[null,null,null,null,null,null,null,null,null,0,null,null,"","",null,"","","",6,"--","--","--","--","--","--","--","--","",""]
[null,null,null,null,null,null,null,null,null,0,null,null,"","",null,"","","",6,"--","--","--","--","--","--","--","--","",""]
[null,null,null,null,null,null,null,null,null,0,null,null,"","",null,"","","",6,"--","--","--","--","--","--","--","--","",""]
[null,null,null,null,null,null,null,null,null,0,null,null,"","",null,"","","",6,"--","--","--","--","--","--","--","--","",""]
[null,null,null,null,null,null,null,null,null,0,null,null,"","",null,"","","",6,"--","--","--","--","--","--","--","--","",""]
[null,null,null,null,null,null,null,null,null,0,null,null,"","",null,"","","",6,"--","--","--","--","--","--","--","--","",""]
[null,null,null,null,null,null,null,null,null,0,null,null,"","",null,"","","",6,"--","--","--","--","--","--","--","--","",""]
[null,null,null,null,null,null,null,null,null,0,null,null,"","",null,"","","",6,"--","--","--","--","--","--","--","--","",""]
[null,null,null,null,null,null,null,null,null,0,null,null,"","",null,"","","",6,"--","--","--","--","--","--","--","--","",""]
[]
[null,null,"(²)","P - PROGRAMADA",null,null,null,null,null,null,null,null,null,null,null,null,null,null,null,{"$f":"SUM(T20:T42)","v":1741.7760000000005},{"$f":"SUM(U20:U42)","v":0},{"$f":"SUM(V20:V42)","v":0},{"$f":"SUM(W22:W42)","v":0},{"$f":"SUM(X20:X42)","v":0},{"$f":"SUM(Y22:Y42)","v":0},{"$f":"SUM(Z20:Z42)","v":0},{"$f":"SUM(AA22:AA42)","v":0},null,{"$f":"ROUND(SUM(AC20:AC42),2)","v":15071.85}]

{"sheet":"SA-05 (1)","index":10,"n_rows":43,"n_cols":22,"rows_kept":43,"cut":false,"hidden":false,"merged":[]}
[]
[null,{"$f":"'TOT-0516'!B2","v":"ANEXO VI al Memorándum D.T.E.E. N°  243/2017"}]
[]
[]
[]
[]
[]
[null,null,null,null,null,"SISTEMA DE TRANSPORTE DE ENERGÍA ELÉCTRICA POR DISTRIBUCIÓN TRONCAL -  TRANSBA S.A."]
[]
[null,null,null,null,null,"2.2.- Salidas"]
[]
[null,{"$f":"'TOT-0516'!B14","v":"Desde el 01 al 31 de mayo de 2016"}]
[]
[null,null,null,null,null,"Salida en 220 kV",34.93,{"$f":"60*'TOT-0516'!B13","v":60},null,{"$f":"IF(H14=60,\" \",IF(H14=120,\"    Coeficiente duplicado por tasa de falla >4 Sal. x año/100 km.\",\"    REVISAR COEFICIENTE\"))","v":" "}]
[null,null,null,null,null,"Salida en 132 kV o 66 kV = ",17.466000000000001,{"$f":"50*'TOT-0516'!B13","v":50},null,{"$f":"IF(H15=50,\" \",IF(H15=100,\"    Coeficiente duplicado por tasa de falla >4 Sal. x año/100 km.\",\"    REVISAR COEFICIENTE\"))","v":" "}]
[null,null,null,null,null,"Salida en 33 kV ",13.097,{"$f":"50*'TOT-0516'!B13","v":50},null,{"$f":"IF(H16=50,\" \",IF(H16=100,\"    Coeficiente duplicado por tasa de falla >4 Sal. x año/100 km.\",\"    REVISAR COEFICIENTE\"))","v":" "}]
[null,null,null,null,null,"Salida en 13,2 kV =",13.097,{"$f":"40*'TOT-0516'!B13","v":40},null,{"$f":"IF(H17=40,\" \",IF(H17=80,\"    Coeficiente duplicado por tasa de falla >4 Sal. x año/100 km.\",\"    REVISAR COEFICIENTE\"))","v":" "}]
[null,null,3,4,5,6,7,8,9,10,11,12,13,14,15,16,17,18,19,20,21,22]
[null,null,"N°","INDISP","ID EQUIPO","ESTACIÓN \nTRANSFORMADORA","EQUIPO","U\n[kV]","$/h","Salida","Entrada","Hs\nIndisp.","Minutos.\nIndisp.","Tipo \nSal.(²)","AUT.","K (U)","PENALIZAC.\nPROGRAM.","PENALIZACIÓN FORZADA\nPor Salida   hs. Restantes",null,"RESTANTE\nFORZADA","Informó\nen Térm.","TOTAL\nPENALIZAC."]
[]
[]
[null,null,154,302340,3813,"MONTE","Alimentador a G. BELGRANO",33,{"$f":"IF(H22=220,$G$14,IF(AND(H22<=132,H22>=66),$G$15,IF(AND(H22<66,H22>=33),$G$16,$G$17)))","v":13.097},"2016-05-03T08:53:00","2016-05-03T15:45:00",{"$f":"IF(F22=\"\",\"\",(K22-J22)*24)","v":6.8666666666977108},{"$f":"IF(F22=\"\",\"\",ROUND((K22-J22)*24*60,0))","v":412},"P",{"$f":"IF(F22=\"\",\"\",IF(OR(N22=\"P\",N22=\"RP\"),\"--\",\"NO\"))","v":"--"},{"$f":"IF(H22=220,$H$14,IF(AND(H22<=132,H22>=66),$H$15,IF(AND(H22<66,H22>13.2),$H$16,$H$17)))","v":50},{"$f":"IF(N22=\"P\",I22*P22*ROUND(M22/60,2)*0.1,\"--\")","v":449.88195000000007},{"$f":"IF(AND(N22=\"F\",O22=\"NO\"),I22*P22,\"--\")","v":"--"},{"$f":"IF(N22=\"F\",I22*P22*ROUND(M22/60,2),\"--\")","v":"--"},{"$f":"IF(N22=\"RF\",I22*P22*ROUND(M22/60,2),\"--\")","v":"--"},"SI",{"$f":"IF(F22=\"\",\"\",SUM(Q22:T22)*IF(U22=\"SI\",1,2)*IF(H22=\"500/220\",0,1))","v":449.88195000000007}]
[null,null,155,302346,3633,"BRAGADO","Alimentador Alberti",33,13.097,"2016-05-03T10:44:00","2016-05-03T15:50:00",5.0999999998603016,306,"P",{"$f":"IF(F23=\"\",\"\",IF(OR(N23=\"P\",N23=\"RP\"),\"--\",\"NO\"))","v":"--"},50,333.9735,"--","--","--","SI",333.9735]
[null,null,156,302347,2412,"CHASCOMUS","Alimentador a LEZAMA",33,13.097,"2016-05-03T10:54:00","2016-05-03T15:13:00",4.316666666592937,259,"P","--",50,282.89520000000005,"--","--","--","SI",282.89520000000005]
[null,null,157,302350,2178,"BRAGADO","Interruptor WARNER - O'BRIEN",33,13.097,"2016-05-04T09:05:00","2016-05-04T15:01:00",5.9333333334652707,356,"P","--",50,388.32605000000001,"--","--","--","SI",388.32605000000001]
[null,null,158,302368,3468,"TANDIL","Alimentador 7 EDEA",13.199999809265137,13.097,"2016-05-08T06:45:00","2016-05-08T09:05:00",2.3333333332557231,140,"P","--",40,122.06404000000001,"--","--","--","SI",122.06404000000001]
[null,null,159,302372,2199,"CHIVILCOY","Alimentador 4 a CHIVILCOY",13.199999809265137,13.097,"2016-05-08T08:11:00","2016-05-08T11:23:00",3.2000000001280569,192,"P","--",40,167.64160000000004,"--","--","--","SI",167.64160000000004]
[null,null,160,302374,3837,"TANDIL","Alimentador 6  Coop. TANDIL",13.199999809265137,13.097,"2016-05-08T08:21:00","2016-05-08T11:23:00",3.0333333334419876,182,"P","--",40,158.73563999999999,"--","--","--","SI",158.73563999999999]
[null,null,161,302378,3717,"SALTO BA","ALIMENTADOR 3",13.199999809265137,13.097,"2016-05-08T09:03:00","2016-05-08T11:38:00",2.5833333333721384,155,"P","--",40,135.16104000000001,"--","--","--","SI",135.16104000000001]
[null,null,162,302380,3718,"SALTO BA","ALIMENTADOR 4",13.199999809265137,13.097,"2016-05-08T11:39:00","2016-05-08T14:14:00",2.5833333331975155,155,"P","--",40,135.16104000000001,"--","--","--","SI",135.16104000000001]
[null,null,163,302382,2201,"CHIVILCOY","Alimentador 6 a CHIVILCOY",13.199999809265137,13.097,"2016-05-08T12:09:00","2016-05-08T14:04:00",1.9166666666278616,115,"P","--",40,100.58496000000001,"--","--","--","SI",100.58496000000001]
[null,null,164,302669,5243,"BARADERO","ALIM. 4",33,13.097,"2016-05-09T10:31:00","2016-05-09T14:39:00",4.1333333333604969,248,"P","--",50,270.45305000000002,"--","--","--","SI",270.45305000000002]
[null,null,165,302670,5273,"MTE. HERMOSO","SALIDA ALIMENTADOR 9ALIM1 ",13.2,13.097,"2016-05-09T11:40:00","2016-05-09T17:41:00",6.0166666667209938,361,"P","--",40,315.37576000000001,"--","--","--","SI",315.37576000000001]
[null,null,166,302671,5066,"CAMPANA III","ALIMENTADOR CARDALES",33,13.097,"2016-05-09T11:57:00","2016-05-09T14:51:00",2.9000000000232831,174,"P","--",50,189.90650000000002,"--","--","--","SI",189.90650000000002]
[null,null,167,302676,5274,"MTE. HERMOSO","SALIDA ALIMENTADOR 9ALIM2",13.2,13.097,"2016-05-10T08:35:00","2016-05-10T17:50:00",9.2499999999417923,555,"P","--",40,484.58900000000006,"--","--","--","SI",484.58900000000006]
[null,null,168,302682,5109,"BRAGADO","ALIMENT. A C.T. BRAGADO",132,17.466000000000001,"2016-05-10T10:57:00","2016-05-10T15:04:00",4.1166666666395031,247,"P","--",50,359.79960000000005,"--","--","--","SI",359.79960000000005]
[null,null,169,302683,2321,"G.CHAVES","Alimentador 3 a JUAREZ",33,13.097,"2016-05-10T11:16:00","2016-05-10T19:24:00",8.1333333333022892,488,"P","--",50,532.39305000000002,"--","--","--","SI",532.39305000000002]
[null,null,170,302686,5109,"BRAGADO","ALIMENT. A C.T. BRAGADO",132,17.466000000000001,"2016-05-11T08:33:00","2016-05-11T14:06:00",5.5500000001047738,333,"P","--",50,484.68150000000009,"--","--","--","SI",484.68150000000009]
[null,null,171,302688,5275,"MTE. HERMOSO","SALIDA ALIMENTADOR 9ALIM3",13.2,13.097,"2016-05-11T08:45:00","2016-05-11T17:33:00",8.7999999998719431,528,"P","--",40,461.01440000000002,"--","--","--","SI",461.01440000000002]
[null,null,172,302692,2321,"G.CHAVES","Alimentador 3 a JUAREZ",33,13.097,"2016-05-11T09:19:00","2016-05-11T17:33:00",8.2333333332790062,494,"P","--",50,538.94155000000001,"--","--","--","SI",538.94155000000001]
[null,null,null,null,null,null,null,null,13.097,null,null,"","",null,"",40,"--","--","--","--",{"$f":"IF(F41=\"\",\"\",\"SI\")","v":""},""]
[]
[null,null,"(²)","P - PROGRAMADA",null,null,null,null,null,null,null,null,null,null,null,null,{"$f":"SUM(Q20:Q42)","v":5911.5794299999998},{"$f":"SUM(R20:R42)","v":0},{"$f":"SUM(S20:S42)","v":0},{"$f":"SUM(T20:T42)","v":0},null,{"$f":"ROUND(SUM(V20:V42),2)","v":5911.58}]

{"sheet":"SA-05 (2)","index":11,"n_rows":44,"n_cols":22,"rows_kept":44,"cut":false,"hidden":false,"merged":[]}
[]
[null,{"$f":"'TOT-0516'!B2","v":"ANEXO VI al Memorándum D.T.E.E. N°  243/2017"}]
[]
[]
[]
[]
[]
[null,null,null,null,null,"SISTEMA DE TRANSPORTE DE ENERGÍA ELÉCTRICA POR DISTRIBUCIÓN TRONCAL -  TRANSBA S.A."]
[]
[null,null,null,null,null,"2.2.- Salidas"]
[]
[null,{"$f":"'TOT-0516'!B14","v":"Desde el 01 al 31 de mayo de 2016"}]
[]
[null,null,null,null,null,"Salida en 220 kV",34.93,{"$f":"60*'TOT-0516'!B13","v":60},null,{"$f":"IF(H14=60,\" \",IF(H14=120,\"    Coeficiente duplicado por tasa de falla >4 Sal. x año/100 km.\",\"    REVISAR COEFICIENTE\"))","v":" "}]
[null,null,null,null,null,"Salida en 132 kV o 66 kV = ",17.466000000000001,{"$f":"50*'TOT-0516'!B13","v":50},null,{"$f":"IF(H15=50,\" \",IF(H15=100,\"    Coeficiente duplicado por tasa de falla >4 Sal. x año/100 km.\",\"    REVISAR COEFICIENTE\"))","v":" "}]
[null,null,null,null,null,"Salida en 33 kV ",13.097,{"$f":"50*'TOT-0516'!B13","v":50},null,{"$f":"IF(H16=50,\" \",IF(H16=100,\"    Coeficiente duplicado por tasa de falla >4 Sal. x año/100 km.\",\"    REVISAR COEFICIENTE\"))","v":" "}]
[null,null,null,null,null,"Salida en 13,2 kV =",13.097,{"$f":"40*'TOT-0516'!B13","v":40},null,{"$f":"IF(H17=40,\" \",IF(H17=80,\"    Coeficiente duplicado por tasa de falla >4 Sal. x año/100 km.\",\"    REVISAR COEFICIENTE\"))","v":" "}]
[null,null,3,4,5,6,7,8,9,10,11,12,13,14,15,16,17,18,19,20,21,22]
[null,null,"N°","INDISP","ID EQUIPO","ESTACIÓN \nTRANSFORMADORA","EQUIPO","U\n[kV]","$/h","Salida","Entrada","Hs\nIndisp.","Minutos.\nIndisp.","Tipo \nSal.(²)","AUT.","K (U)","PENALIZAC.\nPROGRAM.","PENALIZACIÓN FORZADA\nPor Salida   hs. Restantes",null,"RESTANTE\nFORZADA","Informó\nen Térm.","TOTAL\nPENALIZAC."]
[null,null,null,null,null,null,null,null,null,null,null,null,null,null,null,null,null,null,null,null,null,{"$f":"'SA-05 (1)'!V43","v":5911.58}]
[]
[null,null,173,302694,2504,"PUNTA ALTA","Alimentador a BASE NAVAL P.BELG. 4",33,{"$f":"IF(H22=220,$G$14,IF(AND(H22<=132,H22>=66),$G$15,IF(AND(H22<66,H22>=33),$G$16,$G$17)))","v":13.097},"2016-05-11T10:38:00","2016-05-11T17:38:00",{"$f":"IF(F22=\"\",\"\",(K22-J22)*24)","v":6.9999999999417923},{"$f":"IF(F22=\"\",\"\",ROUND((K22-J22)*24*60,0))","v":420},"P",{"$f":"IF(F22=\"\",\"\",IF(OR(N22=\"P\",N22=\"RP\"),\"--\",\"NO\"))","v":"--"},{"$f":"IF(H22=220,$H$14,IF(AND(H22<=132,H22>=66),$H$15,IF(AND(H22<66,H22>13.2),$H$16,$H$17)))","v":50},{"$f":"IF(N22=\"P\",I22*P22*ROUND(M22/60,2)*0.1,\"--\")","v":458.39499999999998},{"$f":"IF(AND(N22=\"F\",O22=\"NO\"),I22*P22,\"--\")","v":"--"},{"$f":"IF(N22=\"F\",I22*P22*ROUND(M22/60,2),\"--\")","v":"--"},{"$f":"IF(N22=\"RF\",I22*P22*ROUND(M22/60,2),\"--\")","v":"--"},"SI",{"$f":"IF(F22=\"\",\"\",SUM(Q22:T22)*IF(U22=\"SI\",1,2)*IF(H22=\"500/220\",0,1))","v":458.39499999999998}]
[null,null,174,302695,2167,"IMSA","Alimentador 1",13.199999809265137,13.097,"2016-05-11T12:13:00","2016-05-11T15:20:00",3.1166666666977108,187,"P",{"$f":"IF(F23=\"\",\"\",IF(OR(N23=\"P\",N23=\"RP\"),\"--\",\"NO\"))","v":"--"},40,163.45056,"--","--","--","SI",163.45056]
[null,null,175,302696,5276,"MTE. HERMOSO","SALIDA ALIMENTADOR 9ALIM4",13.2,13.097,"2016-05-12T08:19:00","2016-05-12T17:43:00",9.3999999999068677,564,"P","--",40,492.44720000000001,"--","--","--","SI",492.44720000000001]
[null,null,176,302699,2321,"G.CHAVES","Alimentador 3 a JUAREZ",33,13.097,"2016-05-12T08:43:00","2016-05-12T19:08:00",10.416666666744277,625,"P","--",50,682.35370000000012,"--","--","--","SI",682.35370000000012]
[null,null,177,302705,2504,"PUNTA ALTA","Alimentador a BASE NAVAL P.BELG. 4",33,13.097,"2016-05-12T09:42:00","2016-05-12T17:04:00",7.3666666665812954,442,"P","--",50,482.62445000000002,"--","--","--","SI",482.62445000000002]
[null,null,178,302709,2168,"IMSA","Alimentador 2",13.199999809265137,13.097,"2016-05-12T12:18:00","2016-05-12T14:23:00",2.0833333334885538,125,"P","--",40,108.96704,"--","--","--","SI",108.96704]
[]
[null,null,180,302713,5277,"MTE. HERMOSO","SALIDA ALIMENTADOR 9MOHE5",13.2,13.097,"2016-05-13T08:50:00","2016-05-13T14:09:00",5.3166666667093523,319,"P","--",40,278.70416,"--","--","--","SI",278.70416]
[null,null,181,302715,2322,"G.CHAVES","Alimentador 4 a SAN CAYETANO",33,13.097,"2016-05-13T09:19:00","2016-05-13T14:02:00",4.7166666666744277,283,"P","--",50,309.08920000000001,"--","--","--","SI",309.08920000000001]
[null,null,182,302719,5290,"BRAGADO","9ALIM2",13.2,13.097,"2016-05-13T12:51:00","2016-05-13T15:25:00",2.5666666666511446,154,"P","--",40,134.63715999999999,"--","--","--","SI",134.63715999999999]
[null,null,183,302727,4590,"SALTO - BA","Alimentador 1 a SALTO",13.199999809265137,13.097,"2016-05-15T08:02:00","2016-05-15T11:12:00",3.1666666666860692,190,"P","--",40,166.06996000000001,"--","--","--","SI",166.06996000000001]
[null,null,184,302730,4977,"SALTO BA","ALIMENTADOR 2",13.199999809265137,13.097,"2016-05-15T11:13:00","2016-05-15T14:30:00",3.283333333209157,197,"P","--",40,171.83264,"--","--","--","SI",171.83264]
[null,null,185,302957,5068,"SALTO BA","ALIMENTADOR A C.T. SALTO",13.199999809265137,13.097,"2016-05-16T07:40:00","2016-05-16T09:40:00",2.0000000000582077,120,"P","--",40,104.77600000000001,"--","--","--","SI",104.77600000000001]
[null,null,186,302962,2250,"LINCOLN","Alimentador a VEDIA",33,13.097,"2016-05-17T08:43:00","2016-05-17T15:37:00",6.8999999999650754,414,"P","--",50,451.84650000000005,"--","--","--","SI",451.84650000000005]
[null,null,187,302977,2251,"LINCOLN","Alimentador a ARENAZA",33,13.097,"2016-05-18T09:37:00","2016-05-18T14:35:00",4.966666666790843,298,"P","--",50,325.46045000000004,"--","--","--","SI",325.46045000000004]
[null,null,188,302980,2408,"LAS ARMAS","Alimentador 1  a LAS ARMAS",13.199999809265137,13.097,"2016-05-18T09:56:00","2016-05-18T12:10:00",2.2333333332790062,134,"P","--",40,116.82524000000001,"--","--","--","SI",116.82524000000001]
[null,null,189,303003,3720,"SALTO BA","ALIMENTADOR 6",13.199999809265137,13.097,"2016-05-22T07:49:00","2016-05-22T11:12:00",3.3833333333604969,203,"P","--",40,177.07144,"--","--","--","SI",177.07144]
[null,null,190,303006,2388,"AZUL","Alimentador 1  a Coop. AZUL",33,13.097,"2016-05-22T08:17:00","2016-05-22T13:10:00",4.8833333333604969,293,"P","--",50,319.56680000000006,"--","--","--","SI",319.56680000000006]
[null,null,191,303010,5239,"SALTO"," SALIDA ALIMENTADOR 9SALT7",13.2,13.097,"2016-05-22T11:09:00","2016-05-22T13:54:00",2.7500000000582077,165,"P","--",40,144.06700000000001,"--","--","--","SI",144.06700000000001]
[null,null,192,303011,2389,"AZUL","Alimentador 2  a Coop. AZUL",33,13.097,"2016-05-22T13:11:00","2016-05-22T16:22:00",3.1833333332324401,191,"P","--",50,208.24230000000003,"--","--","--","SI",208.24230000000003]
[null,null,193,303013,3719,"SALTO"," SALIDA ALIMENTADOR 5",13.2,13.097,"2016-05-22T14:08:00","2016-05-22T16:49:00",2.6833333333488554,161,"P","--",40,140.39984000000001,"--","--","--","SI",140.39984000000001]
[]
[null,null,"(²)","P - PROGRAMADA",null,null,null,null,null,null,null,null,null,null,null,null,{"$f":"SUM(Q20:Q43)","v":5436.8266400000002},{"$f":"SUM(R20:R43)","v":0},{"$f":"SUM(S20:S43)","v":0},{"$f":"SUM(T20:T43)","v":0},null,{"$f":"ROUND(SUM(V20:V43),2)","v":11348.41}]

{"sheet":"SA-05 (3)","index":12,"n_rows":43,"n_cols":22,"rows_kept":43,"cut":false,"hidden":false,"merged":[]}
[]
[null,{"$f":"'TOT-0516'!B2","v":"ANEXO VI al Memorándum D.T.E.E. N°  243/2017"}]
[]
[]
[]
[]
[]
[null,null,null,null,null,"SISTEMA DE TRANSPORTE DE ENERGÍA ELÉCTRICA POR DISTRIBUCIÓN TRONCAL -  TRANSBA S.A."]
[]
[null,null,null,null,null,"2.2.- Salidas"]
[]
[null,{"$f":"'TOT-0516'!B14","v":"Desde el 01 al 31 de mayo de 2016"}]
[]
[null,null,null,null,null,"Salida en 220 kV",34.93,{"$f":"60*'TOT-0516'!B13","v":60},null,{"$f":"IF(H14=60,\" \",IF(H14=120,\"    Coeficiente duplicado por tasa de falla >4 Sal. x año/100 km.\",\"    REVISAR COEFICIENTE\"))","v":" "}]
[null,null,null,null,null,"Salida en 132 kV o 66 kV = ",17.466000000000001,{"$f":"50*'TOT-0516'!B13","v":50},null,{"$f":"IF(H15=50,\" \",IF(H15=100,\"    Coeficiente duplicado por tasa de falla >4 Sal. x año/100 km.\",\"    REVISAR COEFICIENTE\"))","v":" "}]
[null,null,null,null,null,"Salida en 33 kV ",13.097,{"$f":"50*'TOT-0516'!B13","v":50},null,{"$f":"IF(H16=50,\" \",IF(H16=100,\"    Coeficiente duplicado por tasa de falla >4 Sal. x año/100 km.\",\"    REVISAR COEFICIENTE\"))","v":" "}]
[null,null,null,null,null,"Salida en 13,2 kV =",13.097,{"$f":"40*'TOT-0516'!B13","v":40},null,{"$f":"IF(H17=40,\" \",IF(H17=80,\"    Coeficiente duplicado por tasa de falla >4 Sal. x año/100 km.\",\"    REVISAR COEFICIENTE\"))","v":" "}]
[null,null,3,4,5,6,7,8,9,10,11,12,13,14,15,16,17,18,19,20,21,22]
[null,null,"N°","INDISP","ID EQUIPO","ESTACIÓN \nTRANSFORMADORA","EQUIPO","U\n[kV]","$/h","Salida","Entrada","Hs\nIndisp.","Minutos.\nIndisp.","Tipo \nSal.(²)","AUT.","K (U)","PENALIZAC.\nPROGRAM.","PENALIZACIÓN FORZADA\nPor Salida   hs. Restantes",null,"RESTANTE\nFORZADA","Informó\nen Térm.","TOTAL\nPENALIZAC."]
[null,null,null,null,null,null,null,null,null,null,null,null,null,null,null,null,null,null,null,null,null,{"$f":"'SA-05 (2)'!V44","v":11348.41}]
[]
[null,null,194,303174,2413,"CHASCOMUS","Alimentador a VILLA DEL SUR-GANDARA",33,{"$f":"IF(H22=220,$G$14,IF(AND(H22<=132,H22>=66),$G$15,IF(AND(H22<66,H22>=33),$G$16,$G$17)))","v":13.097},"2016-05-23T09:49:00","2016-05-23T17:00:00",{"$f":"IF(F22=\"\",\"\",(K22-J22)*24)","v":7.1833333333488554},{"$f":"IF(F22=\"\",\"\",ROUND((K22-J22)*24*60,0))","v":431},"P",{"$f":"IF(F22=\"\",\"\",IF(OR(N22=\"P\",N22=\"RP\"),\"--\",\"NO\"))","v":"--"},{"$f":"IF(H22=220,$H$14,IF(AND(H22<=132,H22>=66),$H$15,IF(AND(H22<66,H22>13.2),$H$16,$H$17)))","v":50},{"$f":"IF(N22=\"P\",I22*P22*ROUND(M22/60,2)*0.1,\"--\")","v":470.18230000000005},{"$f":"IF(AND(N22=\"F\",O22=\"NO\"),I22*P22,\"--\")","v":"--"},{"$f":"IF(N22=\"F\",I22*P22*ROUND(M22/60,2),\"--\")","v":"--"},{"$f":"IF(N22=\"RF\",I22*P22*ROUND(M22/60,2),\"--\")","v":"--"},"SI",{"$f":"IF(F22=\"\",\"\",SUM(Q22:T22)*IF(U22=\"SI\",1,2)*IF(H22=\"500/220\",0,1))","v":470.18230000000005}]
[null,null,195,303176,2413,"CHASCOMUS","Alimentador a VILLA DEL SUR-GANDARA",33,13.097,"2016-05-24T08:06:00","2016-05-24T15:03:00",6.9499999999534339,417,"P",{"$f":"IF(F23=\"\",\"\",IF(OR(N23=\"P\",N23=\"RP\"),\"--\",\"NO\"))","v":"--"},50,455.12075000000004,"--","--","--","SI",455.12075000000004]
[null,null,196,303187,2412,"CHASCOMUS","Alimentador a LEZAMA",33,13.097,"2016-05-26T09:48:00","2016-05-26T17:16:00",7.4666666667326353,448,"P","--",50,489.17295000000007,"--","--","--","SI",489.17295000000007]
[null,null,197,303197,2412,"CHASCOMUS","Alimentador a LEZAMA",33,13.097,"2016-05-27T09:17:00","2016-05-27T16:13:00",6.9333333332324401,416,"P","--",50,453.81105000000002,"--","--","--","SI",453.81105000000002]
[null,null,198,303250,2117,"ROJAS","Alimentador a Coop. COLON",33,13.097,"2016-05-31T08:39:00","2016-05-31T09:04:00",0.41666666662786156,25,"P","--",50,27.503699999999998,"--","--","--","SI",27.503699999999998]
[null,null,null,null,null,null,null,null,13.097,null,null,"","",null,"",40,"--","--","--","--",{"$f":"IF(F27=\"\",\"\",\"SI\")","v":""},""]
[null,null,null,null,null,null,null,null,13.097,null,null,"","",null,"",40,"--","--","--","--","",""]
[null,null,null,null,null,null,null,null,13.097,null,null,"","",null,"",40,"--","--","--","--","",""]
[null,null,null,null,null,null,null,null,13.097,null,null,"","",null,"",40,"--","--","--","--","",""]
[null,null,null,null,null,null,null,null,13.097,null,null,"","",null,"",40,"--","--","--","--","",""]
[null,null,null,null,null,null,null,null,13.097,null,null,"","",null,"",40,"--","--","--","--","",""]
[null,null,null,null,null,null,null,null,13.097,null,null,"","",null,"",40,"--","--","--","--","",""]
[null,null,null,null,null,null,null,null,13.097,null,null,"","",null,"",40,"--","--","--","--","",""]
[null,null,null,null,null,null,null,null,13.097,null,null,"","",null,"",40,"--","--","--","--","",""]
[null,null,null,null,null,null,null,null,13.097,null,null,"","",null,"",40,"--","--","--","--","",""]
[null,null,null,null,null,null,null,null,13.097,null,null,"","",null,"",40,"--","--","--","--","",""]
[null,null,null,null,null,null,null,null,13.097,null,null,"","",null,"",40,"--","--","--","--","",""]
[null,null,null,null,null,null,null,null,13.097,null,null,"","",null,"",40,"--","--","--","--","",""]
[null,null,null,null,null,null,null,null,13.097,null,null,"","",null,"",40,"--","--","--","--","",""]
[null,null,null,null,null,null,null,null,13.097,null,null,"","",null,"",40,"--","--","--","--","",""]
[]
[null,null,"(²)","P - PROGRAMADA",null,null,null,null,null,null,null,null,null,null,null,null,{"$f":"SUM(Q20:Q42)","v":1895.7907500000001},{"$f":"SUM(R20:R42)","v":0},{"$f":"SUM(S20:S42)","v":0},{"$f":"SUM(T20:T42)","v":0},null,{"$f":"ROUND(SUM(V20:V42),2)","v":13244.2}]

{"sheet":"RE-05 (1)","index":13,"n_rows":43,"n_cols":30,"rows_kept":43,"cut":false,"hidden":false,"merged":[]}
[]
[null,{"$f":"'TOT-0516'!B2","v":"ANEXO VI al Memorándum D.T.E.E. N°  243/2017"}]
[]
[]
[]
[]
[]
[null,null,null,null,null,"SISTEMA DE TRANSPORTE DE ENERGÍA ELÉCTRICA POR DISTRIBUCIÓN TRONCAL - TRANSBA S.A."]
[]
[null,null,null,null,null,"3.- REACTIVA"]
[]
[null,null,null,null,null,"3.1.1- Equipamiento propio Res. 01_03"]
[]
[null,{"$f":"'TOT-0516'!B14","v":"Desde el 01 al 31 de mayo de 2016"}]
[]
[null,null,null,null,null,"Coeficiente de penalización por salida forzada   =",null,null,null,{"$f":"60*'TOT-0516'!B13","v":60},null,{"$f":"IF(J16=60,\" \",IF(J16=120,\"    Coeficiente duplicado por tasa de falla >4 Sal. x año/100 km.\",\"    REVISAR COEFICIENTE\"))","v":" "}]
[null,null,3,4,5,6,7,8,9,10,11,12,13,14,15,16,17,18,19,20,21,22,23,24,25,26,27,28,29,30]
[null,null,"N°","INDISP","ID EQUIPO","ESTACIÓN \nTRANSFORMADORA","EQUIPO","POT.\n[MVA]","MVA    $ =","U\n[kV]","$/h","Salida","Entrada","Hs\nIndisp.","Minutos.\nIndisp.","Tipo \nSal.(²)","AUT.","C.R.\n%","E.N.S.","K (P y ENS)","PENALIZ.\nPROGRAM.","REDUCC.\nPROGRAM.","PENALIZACIÓN FORZADA\nPor Salida   hs. Restantes",null,"REDUCC. FORZADA\nPor Salida   hs. Restantes",null,"RESTANTE\nFORZADA","REDUCC.\nRESTANTE","Informó \nen Térm.","TOTAL\nPENALIZAC."]
[]
[null,null,null,null,null,null,null,null,null,null,{"$f":"H20*I20","v":0},null,null,{"$f":"IF(F20=\"\",\"\",(M20-L20)*24)","v":""},{"$f":"IF(F20=\"\",\"\",ROUND((M20-L20)*24*60,0))","v":""},null,null,null,null,{"$f":"$J$16*IF(OR(P20=\"P\",P20=\"RP\"),0.1,1)*IF(S20=\"SI\",1,0.1)","v":6},{"$f":"IF(P20=\"P\",K20*T20*ROUND(O20/60,2),\"--\")","v":"--"},{"$f":"IF(P20=\"RP\",K20*T20*ROUND(O20/60,2)*R20/100,\"--\")","v":"--"},{"$f":"IF(AND(P20=\"F\",Q20=\"NO\"),K20*T20,\"--\")","v":"--"},{"$f":"IF(P20=\"F\",K20*T20*ROUND(O20/60,2),\"--\")","v":"--"},{"$f":"IF(AND(P20=\"R\",Q20=\"NO\"),K20*T20*R20/100,\"--\")","v":"--"},{"$f":"IF(P20=\"R\",K20*T20*ROUND(O20/60,2)*R20/100,\"--\")","v":"--"},{"$f":"IF(P20=\"RF\",K20*T20*ROUND(O20/60,2),\"--\")","v":"--"},{"$f":"IF(P20=\"RR\",K20*T20*ROUND(O20/60,2)*R20/100,\"--\")","v":"--"},null,{"$f":"IF(F20=\"\",\"\",SUM(U20:AB20)*IF(AC20=\"SI\",1,2))","v":""}]
[null,null,199,302681,4450,"MERCEDES","CAP K1MD",1.5,4.8739999999999997,13.8,{"$f":"H21*I21","v":7.3109999999999999},"2016-05-10T10:35:00","2016-05-10T11:57:00",1.3666666667559184,82,"P","0,000",{"$f":"IF(F21=\"\",\"\",\"--\")","v":"--"},{"$f":"IF(F21=\"\",\"\",\"NO\")","v":"NO"},0.60000000000000009,6.0096420000000013,"--","--","--","--","--","--","--","SI",6.0096420000000013]
[null,null,200,302684,4451,"MERCEDES","CAP K3MD",3,4.8739999999999997,13.8,{"$f":"H22*I22","v":14.622},"2016-05-10T11:58:00","2016-05-10T13:08:00",1.1666666666278616,70,"P","0,000",{"$f":"IF(F22=\"\",\"\",\"--\")","v":"--"},{"$f":"IF(F22=\"\",\"\",\"NO\")","v":"NO"},0.60000000000000009,10.264644000000001,"--","--","--","--","--","--","--","SI",10.264644000000001]
[null,null,null,null,null,null,null,null,null,null,{"$f":"H23*I23","v":0},null,null,"","",null,{"$f":"IF(F23=\"\",\"\",IF(OR(P23=\"P\",P23=\"RP\"),\"--\",\"NO\"))","v":""},"","",6,"--","--","--","--","--","--","--","--",{"$f":"IF(F23=\"\",\"\",\"SI\")","v":""},""]
[null,null,null,null,null,null,null,null,null,null,null,null,null,"","",null,"","","",6,"--","--","--","--","--","--","--","--","",""]
[null,null,null,null,null,null,null,null,null,null,null,null,null,"","",null,"","","",6,"--","--","--","--","--","--","--","--","",""]
[null,null,null,null,null,null,null,null,null,null,null,null,null,"","",null,"","","",6,"--","--","--","--","--","--","--","--","",""]
[null,null,null,null,null,null,null,null,null,null,null,null,null,"","",null,"","","",6,"--","--","--","--","--","--","--","--","",""]
[null,null,null,null,null,null,null,null,null,null,{"$f":"H28*I28","v":0},null,null,"","",null,"","","",6,"--","--","--","--","--","--","--","--","",""]
[null,null,null,null,null,null,null,null,null,null,null,null,null,"","",null,"","","",6,"--","--","--","--","--","--","--","--","",""]
[null,null,null,null,null,null,null,null,null,null,null,null,null,"","",null,"","","",6,"--","--","--","--","--","--","--","--","",""]
[null,null,null,null,null,null,null,null,null,null,null,null,null,"","",null,"","","",6,"--","--","--","--","--","--","--","--","",""]
[null,null,null,null,null,null,null,null,null,null,null,null,null,"","",null,"","","",6,"--","--","--","--","--","--","--","--","",""]
[null,null,null,null,null,null,null,null,null,null,null,null,null,"","",null,"","","",6,"--","--","--","--","--","--","--","--","",""]
[null,null,null,null,null,null,null,null,null,null,null,null,null,"","",null,"","","",6,"--","--","--","--","--","--","--","--","",""]
[null,null,null,null,null,null,null,null,null,null,null,null,null,"","",null,"","","",6,"--","--","--","--","--","--","--","--","",""]
[null,null,null,null,null,null,null,null,null,null,null,null,null,"","",null,"","","",6,"--","--","--","--","--","--","--","--","",""]
[null,null,null,null,null,null,null,null,null,null,null,null,null,"","",null,"","","",6,"--","--","--","--","--","--","--","--","",""]
[null,null,null,null,null,null,null,null,null,null,null,null,null,"","",null,"","","",6,"--","--","--","--","--","--","--","--","",""]
[null,null,null,null,null,null,null,null,null,null,null,null,null,"","",null,"","","",6,"--","--","--","--","--","--","--","--","",""]
[null,null,null,null,null,null,null,null,null,null,null,null,null,"","",null,"","","",6,"--","--","--","--","--","--","--","--","",""]
[null,null,null,null,null,null,null,null,null,null,null,null,null,"","",null,"","","",6,"--","--","--","--","--","--","--","--","",""]
[]
[null,null,"(²)","P - PROGRAMADA",null,null,null,null,null,null,null,null,null,null,null,null,null,null,null,null,{"$f":"SUM(U19:U42)","v":16.274286000000004},{"$f":"SUM(V19:V42)","v":0},{"$f":"SUM(W19:W42)","v":0},{"$f":"SUM(X21:X42)","v":0},{"$f":"SUM(Y19:Y42)","v":0},{"$f":"SUM(Z21:Z42)","v":0},{"$f":"SUM(AA19:AA42)","v":0},{"$f":"SUM(AB21:AB42)","v":0},null,{"$f":"ROUND(SUM(AD19:AD42),2)","v":16.27}]

{"sheet":"TASA FALLA","index":14,"n_rows":167,"n_cols":21,"rows_kept":167,"cut":false,"hidden":false,"merged":[[4,1,4,21],[6,1,6,21],[8,1,8,21],[11,1,11,21],[166,11,166,12]]}
[]
[null,{"$f":"+'TOT-0516'!B2","v":"ANEXO VI al Memorándum D.T.E.E. N°  243/2017"}]
[]
[]
[null,"SISTEMA DE TRANSPORTE DE ENERGÍA ELÉCTRICA POR DISTRIBUCIÓN TRONCAL"]
[]
[null,"TRANSBA S.A."]
[]
[null,"INDISPONIBILIDADES FORZADAS DE LÍNEAS - TASA DE FALLA"]
[]
[]
[null,"Tasa de falla correspondiente al mes de Mayo de 2016"]
[]
[null,null,null,"Codigo","LÍNEAS","U\n[kV]","Long.\n[km]","CLASE",{"$f":"[1]BASE!HK$15","v":"2015-05-01"},{"$f":"[1]BASE!HL$15","v":"2015-06-01"},{"$f":"[1]BASE!HM$15","v":"2015-07-01"},{"$f":"[1]BASE!HN$15","v":"2015-08-01"},{"$f":"[1]BASE!HO$15","v":"2015-09-01"},{"$f":"[1]BASE!HP$15","v":"2015-10-01"},{"$f":"[1]BASE!HQ$15","v":"2015-11-01"},{"$f":"[1]BASE!HR$15","v":"2015-12-01"},{"$f":"[1]BASE!HS$15","v":"2016-01-01"},{"$f":"[1]BASE!HT$15","v":"2016-02-01"},{"$f":"[1]BASE!HU$15","v":"2016-03-01"},{"$f":"[1]BASE!HV$15","v":"2016-04-01"},{"$f":"[1]BASE!HW$15","v":"2016-05-01"}]
[]
[null,null,{"$f":"+[1]BASE!C17","v":1},{"$f":"+[1]BASE!D17","v":1403},{"$f":"+[1]BASE!E17","v":"BRAGADO - HENDERSON"},{"$f":"+[1]BASE!F17","v":220},{"$f":"+[1]BASE!G17","v":177},{"$f":"+[1]BASE!H17","v":"A"},{"$f":"IF([1]BASE!HK17=\"\",\"\",[1]BASE!HK17)","v":""},{"$f":"IF([1]BASE!HL17=\"\",\"\",[1]BASE!HL17)","v":""},{"$f":"IF([1]BASE!HM17=\"\",\"\",[1]BASE!HM17)","v":""},{"$f":"IF([1]BASE!HN17=\"\",\"\",[1]BASE!HN17)","v":""},{"$f":"IF([1]BASE!HO17=\"\",\"\",[1]BASE!HO17)","v":""},{"$f":"IF([1]BASE!HP17=\"\",\"\",[1]BASE!HP17)","v":""},{"$f":"IF([1]BASE!HQ17=\"\",\"\",[1]BASE!HQ17)","v":""},{"$f":"IF([1]BASE!HR17=\"\",\"\",[1]BASE!HR17)","v":""},{"$f":"IF([1]BASE!HS17=\"\",\"\",[1]BASE!HS17)","v":""},{"$f":"IF([1]BASE!HT17=\"\",\"\",[1]BASE!HT17)","v":""},{"$f":"IF([1]BASE!HU17=\"\",\"\",[1]BASE!HU17)","v":1},{"$f":"IF([1]BASE!HV17=\"\",\"\",[1]BASE!HV17)","v":""}]
[null,null,{"$f":"+[1]BASE!C18","v":2},{"$f":"+[1]BASE!D18","v":"CE-000"},{"$f":"+[1]BASE!E18","v":"AZUL - LAS FLORES"},{"$f":"+[1]BASE!F18","v":132},{"$f":"+[1]BASE!G18","v":107},{"$f":"+[1]BASE!H18","v":"C"},{"$f":"IF([1]BASE!HK18=\"\",\"\",[1]BASE!HK18)","v":"XXXX"},{"$f":"IF([1]BASE!HL18=\"\",\"\",[1]BASE!HL18)","v":"XXXX"},{"$f":"IF([1]BASE!HM18=\"\",\"\",[1]BASE!HM18)","v":"XXXX"},{"$f":"IF([1]BASE!HN18=\"\",\"\",[1]BASE!HN18)","v":"XXXX"},{"$f":"IF([1]BASE!HO18=\"\",\"\",[1]BASE!HO18)","v":"XXXX"},{"$f":"IF([1]BASE!HP18=\"\",\"\",[1]BASE!HP18)","v":"XXXX"},{"$f":"IF([1]BASE!HQ18=\"\",\"\",[1]BASE!HQ18)","v":"XXXX"},{"$f":"IF([1]BASE!HR18=\"\",\"\",[1]BASE!HR18)","v":"XXXX"},{"$f":"IF([1]BASE!HS18=\"\",\"\",[1]BASE!HS18)","v":"XXXX"},{"$f":"IF([1]BASE!HT18=\"\",\"\",[1]BASE!HT18)","v":"XXXX"},{"$f":"IF([1]BASE!HU18=\"\",\"\",[1]BASE!HU18)","v":"XXXX"},{"$f":"IF([1]BASE!HV18=\"\",\"\",[1]BASE!HV18)","v":"XXXX"}]
[null,null,{"$f":"+[1]BASE!C19","v":3},{"$f":"+[1]BASE!D19","v":1534},{"$f":"+[1]BASE!E19","v":"BAHIA BLANCA - NORTE II"},{"$f":"+[1]BASE!F19","v":132},{"$f":"+[1]BASE!G19","v":19},{"$f":"+[1]BASE!H19","v":"C"},{"$f":"IF([1]BASE!HK19=\"\",\"\",[1]BASE!HK19)","v":""},{"$f":"IF([1]BASE!HL19=\"\",\"\",[1]BASE!HL19)","v":""},{"$f":"IF([1]BASE!HM19=\"\",\"\",[1]BASE!HM19)","v":""},{"$f":"IF([1]BASE!HN19=\"\",\"\",[1]BASE!HN19)","v":""},{"$f":"IF([1]BASE!HO19=\"\",\"\",[1]BASE!HO19)","v":""},{"$f":"IF([1]BASE!HP19=\"\",\"\",[1]BASE!HP19)","v":""},{"$f":"IF([1]BASE!HQ19=\"\",\"\",[1]BASE!HQ19)","v":""},{"$f":"IF([1]BASE!HR19=\"\",\"\",[1]BASE!HR19)","v":""},{"$f":"IF([1]BASE!HS19=\"\",\"\",[1]BASE!HS19)","v":""},{"$f":"IF([1]BASE!HT19=\"\",\"\",[1]BASE!HT19)","v":""},{"$f":"IF([1]BASE!HU19=\"\",\"\",[1]BASE!HU19)","v":""},{"$f":"IF([1]BASE!HV19=\"\",\"\",[1]BASE!HV19)","v":""}]
[null,null,{"$f":"+[1]BASE!C20","v":4},{"$f":"+[1]BASE!D20","v":1532},{"$f":"+[1]BASE!E20","v":"BAHIA BLANCA - P. LURO"},{"$f":"+[1]BASE!F20","v":132},{"$f":"+[1]BASE!G20","v":141},{"$f":"+[1]BASE!H20","v":"B"},{"$f":"IF([1]BASE!HK20=\"\",\"\",[1]BASE!HK20)","v":""},{"$f":"IF([1]BASE!HL20=\"\",\"\",[1]BASE!HL20)","v":""},{"$f":"IF([1]BASE!HM20=\"\",\"\",[1]BASE!HM20)","v":""},{"$f":"IF([1]BASE!HN20=\"\",\"\",[1]BASE!HN20)","v":""},{"$f":"IF([1]BASE!HO20=\"\",\"\",[1]BASE!HO20)","v":""},{"$f":"IF([1]BASE!HP20=\"\",\"\",[1]BASE!HP20)","v":""},{"$f":"IF([1]BASE!HQ20=\"\",\"\",[1]BASE!HQ20)","v":1},{"$f":"IF([1]BASE!HR20=\"\",\"\",[1]BASE!HR20)","v":""},{"$f":"IF([1]BASE!HS20=\"\",\"\",[1]BASE!HS20)","v":""},{"$f":"IF([1]BASE!HT20=\"\",\"\",[1]BASE!HT20)","v":""},{"$f":"IF([1]BASE!HU20=\"\",\"\",[1]BASE!HU20)","v":""},{"$f":"IF([1]BASE!HV20=\"\",\"\",[1]BASE!HV20)","v":""}]
[null,null,{"$f":"+[1]BASE!C21","v":5},{"$f":"+[1]BASE!D21","v":1535},{"$f":"+[1]BASE!E21","v":"BAHIA BLANCA - PETROQ. BAHIA BLANCA 1"},{"$f":"+[1]BASE!F21","v":132},{"$f":"+[1]BASE!G21","v":29.8},{"$f":"+[1]BASE!H21","v":"C"},{"$f":"IF([1]BASE!HK21=\"\",\"\",[1]BASE!HK21)","v":""},{"$f":"IF([1]BASE!HL21=\"\",\"\",[1]BASE!HL21)","v":""},{"$f":"IF([1]BASE!HM21=\"\",\"\",[1]BASE!HM21)","v":""},{"$f":"IF([1]BASE!HN21=\"\",\"\",[1]BASE!HN21)","v":""},{"$f":"IF([1]BASE!HO21=\"\",\"\",[1]BASE!HO21)","v":""},{"$f":"IF([1]BASE!HP21=\"\",\"\",[1]BASE!HP21)","v":""},{"$f":"IF([1]BASE!HQ21=\"\",\"\",[1]BASE!HQ21)","v":""},{"$f":"IF([1]BASE!HR21=\"\",\"\",[1]BASE!HR21)","v":""},{"$f":"IF([1]BASE!HS21=\"\",\"\",[1]BASE!HS21)","v":""},{"$f":"IF([1]BASE!HT21=\"\",\"\",[1]BASE!HT21)","v":""},{"$f":"IF([1]BASE!HU21=\"\",\"\",[1]BASE!HU21)","v":""},{"$f":"IF([1]BASE!HV21=\"\",\"\",[1]BASE!HV21)","v":""}]
[null,null,{"$f":"+[1]BASE!C22","v":6},{"$f":"+[1]BASE!D22","v":1531},{"$f":"+[1]BASE!E22","v":"BAHIA BLANCA - PRINGLES"},{"$f":"+[1]BASE!F22","v":132},{"$f":"+[1]BASE!G22","v":102.09},{"$f":"+[1]BASE!H22","v":"C"},{"$f":"IF([1]BASE!HK22=\"\",\"\",[1]BASE!HK22)","v":""},{"$f":"IF([1]BASE!HL22=\"\",\"\",[1]BASE!HL22)","v":""},{"$f":"IF([1]BASE!HM22=\"\",\"\",[1]BASE!HM22)","v":""},{"$f":"IF([1]BASE!HN22=\"\",\"\",[1]BASE!HN22)","v":""},{"$f":"IF([1]BASE!HO22=\"\",\"\",[1]BASE!HO22)","v":""},{"$f":"IF([1]BASE!HP22=\"\",\"\",[1]BASE!HP22)","v":""},{"$f":"IF([1]BASE!HQ22=\"\",\"\",[1]BASE!HQ22)","v":""},{"$f":"IF([1]BASE!HR22=\"\",\"\",[1]BASE!HR22)","v":""},{"$f":"IF([1]BASE!HS22=\"\",\"\",[1]BASE!HS22)","v":""},{"$f":"IF([1]BASE!HT22=\"\",\"\",[1]BASE!HT22)","v":""},{"$f":"IF([1]BASE!HU22=\"\",\"\",[1]BASE!HU22)","v":""},{"$f":"IF([1]BASE!HV22=\"\",\"\",[1]BASE!HV22)","v":""}]
[null,null,{"$f":"+[1]BASE!C23","v":7},{"$f":"+[1]BASE!D23","v":1522},{"$f":"+[1]BASE!E23","v":"BALCARCE - MAR DEL PLATA"},{"$f":"+[1]BASE!F23","v":132},{"$f":"+[1]BASE!G23","v":62.9},{"$f":"+[1]BASE!H23","v":"C"},{"$f":"IF([1]BASE!HK23=\"\",\"\",[1]BASE!HK23)","v":""},{"$f":"IF([1]BASE!HL23=\"\",\"\",[1]BASE!HL23)","v":""},{"$f":"IF([1]BASE!HM23=\"\",\"\",[1]BASE!HM23)","v":""},{"$f":"IF([1]BASE!HN23=\"\",\"\",[1]BASE!HN23)","v":""},{"$f":"IF([1]BASE!HO23=\"\",\"\",[1]BASE!HO23)","v":""},{"$f":"IF([1]BASE!HP23=\"\",\"\",[1]BASE!HP23)","v":""},{"$f":"IF([1]BASE!HQ23=\"\",\"\",[1]BASE!HQ23)","v":""},{"$f":"IF([1]BASE!HR23=\"\",\"\",[1]BASE!HR23)","v":""},{"$f":"IF([1]BASE!HS23=\"\",\"\",[1]BASE!HS23)","v":1},{"$f":"IF([1]BASE!HT23=\"\",\"\",[1]BASE!HT23)","v":""},{"$f":"IF([1]BASE!HU23=\"\",\"\",[1]BASE!HU23)","v":""},{"$f":"IF([1]BASE!HV23=\"\",\"\",[1]BASE!HV23)","v":""}]
[null,null,{"$f":"+[1]BASE!C24","v":8},{"$f":"+[1]BASE!D24","v":1406},{"$f":"+[1]BASE!E24","v":"BRAGADO - CHACABUCO"},{"$f":"+[1]BASE!F24","v":132},{"$f":"+[1]BASE!G24","v":60.6},{"$f":"+[1]BASE!H24","v":"B"},{"$f":"IF([1]BASE!HK24=\"\",\"\",[1]BASE!HK24)","v":""},{"$f":"IF([1]BASE!HL24=\"\",\"\",[1]BASE!HL24)","v":""},{"$f":"IF([1]BASE!HM24=\"\",\"\",[1]BASE!HM24)","v":1},{"$f":"IF([1]BASE!HN24=\"\",\"\",[1]BASE!HN24)","v":""},{"$f":"IF([1]BASE!HO24=\"\",\"\",[1]BASE!HO24)","v":""},{"$f":"IF([1]BASE!HP24=\"\",\"\",[1]BASE!HP24)","v":1},{"$f":"IF([1]BASE!HQ24=\"\",\"\",[1]BASE!HQ24)","v":""},{"$f":"IF([1]BASE!HR24=\"\",\"\",[1]BASE!HR24)","v":""},{"$f":"IF([1]BASE!HS24=\"\",\"\",[1]BASE!HS24)","v":""},{"$f":"IF([1]BASE!HT24=\"\",\"\",[1]BASE!HT24)","v":""},{"$f":"IF([1]BASE!HU24=\"\",\"\",[1]BASE!HU24)","v":""},{"$f":"IF([1]BASE!HV24=\"\",\"\",[1]BASE!HV24)","v":""}]
[null,null,{"$f":"+[1]BASE!C25","v":9},{"$f":"+[1]BASE!D25","v":1404},{"$f":"+[1]BASE!E25","v":"BRAGADO - CHIVILCOY"},{"$f":"+[1]BASE!F25","v":132},{"$f":"+[1]BASE!G25","v":49},{"$f":"+[1]BASE!H25","v":"B"},{"$f":"IF([1]BASE!HK25=\"\",\"\",[1]BASE!HK25)","v":""},{"$f":"IF([1]BASE!HL25=\"\",\"\",[1]BASE!HL25)","v":""},{"$f":"IF([1]BASE!HM25=\"\",\"\",[1]BASE!HM25)","v":2},{"$f":"IF([1]BASE!HN25=\"\",\"\",[1]BASE!HN25)","v":1},{"$f":"IF([1]BASE!HO25=\"\",\"\",[1]BASE!HO25)","v":""},{"$f":"IF([1]BASE!HP25=\"\",\"\",[1]BASE!HP25)","v":""},{"$f":"IF([1]BASE!HQ25=\"\",\"\",[1]BASE!HQ25)","v":""},{"$f":"IF([1]BASE!HR25=\"\",\"\",[1]BASE!HR25)","v":""},{"$f":"IF([1]BASE!HS25=\"\",\"\",[1]BASE!HS25)","v":""},{"$f":"IF([1]BASE!HT25=\"\",\"\",[1]BASE!HT25)","v":""},{"$f":"IF([1]BASE!HU25=\"\",\"\",[1]BASE!HU25)","v":""},{"$f":"IF([1]BASE!HV25=\"\",\"\",[1]BASE!HV25)","v":""}]
[null,null,{"$f":"+[1]BASE!C26","v":10},{"$f":"+[1]BASE!D26","v":1405},{"$f":"+[1]BASE!E26","v":"BRAGADO - SALADILLO"},{"$f":"+[1]BASE!F26","v":132},{"$f":"+[1]BASE!G26","v":83.8},{"$f":"+[1]BASE!H26","v":"B"},{"$f":"IF([1]BASE!HK26=\"\",\"\",[1]BASE!HK26)","v":""},{"$f":"IF([1]BASE!HL26=\"\",\"\",[1]BASE!HL26)","v":""},{"$f":"IF([1]BASE!HM26=\"\",\"\",[1]BASE!HM26)","v":""},{"$f":"IF([1]BASE!HN26=\"\",\"\",[1]BASE!HN26)","v":""},{"$f":"IF([1]BASE!HO26=\"\",\"\",[1]BASE!HO26)","v":""},{"$f":"IF([1]BASE!HP26=\"\",\"\",[1]BASE!HP26)","v":""},{"$f":"IF([1]BASE!HQ26=\"\",\"\",[1]BASE!HQ26)","v":""},{"$f":"IF([1]BASE!HR26=\"\",\"\",[1]BASE!HR26)","v":""},{"$f":"IF([1]BASE!HS26=\"\",\"\",[1]BASE!HS26)","v":""},{"$f":"IF([1]BASE!HT26=\"\",\"\",[1]BASE!HT26)","v":""},{"$f":"IF([1]BASE!HU26=\"\",\"\",[1]BASE!HU26)","v":""},{"$f":"IF([1]BASE!HV26=\"\",\"\",[1]BASE!HV26)","v":""}]
[null,null,{"$f":"+[1]BASE!C27","v":11},{"$f":"+[1]BASE!D27","v":1454},{"$f":"+[1]BASE!E27","v":"C. AVELLANEDA - OLAVARRIA VIEJA"},{"$f":"+[1]BASE!F27","v":132},{"$f":"+[1]BASE!G27","v":6.3},{"$f":"+[1]BASE!H27","v":"C"},{"$f":"IF([1]BASE!HK27=\"\",\"\",[1]BASE!HK27)","v":""},{"$f":"IF([1]BASE!HL27=\"\",\"\",[1]BASE!HL27)","v":""},{"$f":"IF([1]BASE!HM27=\"\",\"\",[1]BASE!HM27)","v":""},{"$f":"IF([1]BASE!HN27=\"\",\"\",[1]BASE!HN27)","v":""},{"$f":"IF([1]BASE!HO27=\"\",\"\",[1]BASE!HO27)","v":""},{"$f":"IF([1]BASE!HP27=\"\",\"\",[1]BASE!HP27)","v":""},{"$f":"IF([1]BASE!HQ27=\"\",\"\",[1]BASE!HQ27)","v":""},{"$f":"IF([1]BASE!HR27=\"\",\"\",[1]BASE!HR27)","v":""},{"$f":"IF([1]BASE!HS27=\"\",\"\",[1]BASE!HS27)","v":""},{"$f":"IF([1]BASE!HT27=\"\",\"\",[1]BASE!HT27)","v":""},{"$f":"IF([1]BASE!HU27=\"\",\"\",[1]BASE!HU27)","v":""},{"$f":"IF([1]BASE!HV27=\"\",\"\",[1]BASE!HV27)","v":""}]
[null,null,{"$f":"+[1]BASE!C28","v":12},{"$f":"+[1]BASE!D28","v":2617},{"$f":"+[1]BASE!E28","v":"C. PATAGONES - VIEDMA"},{"$f":"+[1]BASE!F28","v":132},{"$f":"+[1]BASE!G28","v":2.7},{"$f":"+[1]BASE!H28","v":"C"},{"$f":"IF([1]BASE!HK28=\"\",\"\",[1]BASE!HK28)","v":""},{"$f":"IF([1]BASE!HL28=\"\",\"\",[1]BASE!HL28)","v":""},{"$f":"IF([1]BASE!HM28=\"\",\"\",[1]BASE!HM28)","v":""},{"$f":"IF([1]BASE!HN28=\"\",\"\",[1]BASE!HN28)","v":""},{"$f":"IF([1]BASE!HO28=\"\",\"\",[1]BASE!HO28)","v":""},{"$f":"IF([1]BASE!HP28=\"\",\"\",[1]BASE!HP28)","v":""},{"$f":"IF([1]BASE!HQ28=\"\",\"\",[1]BASE!HQ28)","v":""},{"$f":"IF([1]BASE!HR28=\"\",\"\",[1]BASE!HR28)","v":""},{"$f":"IF([1]BASE!HS28=\"\",\"\",[1]BASE!HS28)","v":""},{"$f":"IF([1]BASE!HT28=\"\",\"\",[1]BASE!HT28)","v":""},{"$f":"IF([1]BASE!HU28=\"\",\"\",[1]BASE!HU28)","v":""},{"$f":"IF([1]BASE!HV28=\"\",\"\",[1]BASE!HV28)","v":""}]
[null,null,{"$f":"+[1]BASE!C29","v":13},{"$f":"+[1]BASE!D29","v":"CE-000"},{"$f":"+[1]BASE!E29","v":"CAMPANA - NUEVA CAMPANA"},{"$f":"+[1]BASE!F29","v":132},{"$f":"+[1]BASE!G29","v":6.5},{"$f":"+[1]BASE!H29","v":"C"},{"$f":"IF([1]BASE!HK29=\"\",\"\",[1]BASE!HK29)","v":"XXXX"},{"$f":"IF([1]BASE!HL29=\"\",\"\",[1]BASE!HL29)","v":"XXXX"},{"$f":"IF([1]BASE!HM29=\"\",\"\",[1]BASE!HM29)","v":"XXXX"},{"$f":"IF([1]BASE!HN29=\"\",\"\",[1]BASE!HN29)","v":"XXXX"},{"$f":"IF([1]BASE!HO29=\"\",\"\",[1]BASE!HO29)","v":"XXXX"},{"$f":"IF([1]BASE!HP29=\"\",\"\",[1]BASE!HP29)","v":"XXXX"},{"$f":"IF([1]BASE!HQ29=\"\",\"\",[1]BASE!HQ29)","v":"XXXX"},{"$f":"IF([1]BASE!HR29=\"\",\"\",[1]BASE!HR29)","v":"XXXX"},{"$f":"IF([1]BASE!HS29=\"\",\"\",[1]BASE!HS29)","v":"XXXX"},{"$f":"IF([1]BASE!HT29=\"\",\"\",[1]BASE!HT29)","v":"XXXX"},{"$f":"IF([1]BASE!HU29=\"\",\"\",[1]BASE!HU29)","v":"XXXX"},{"$f":"IF([1]BASE!HV29=\"\",\"\",[1]BASE!HV29)","v":"XXXX"}]
[null,null,{"$f":"+[1]BASE!C30","v":14},{"$f":"+[1]BASE!D30","v":1432},{"$f":"+[1]BASE!E30","v":"CAMPANA - SIDERCA"},{"$f":"+[1]BASE!F30","v":132},{"$f":"+[1]BASE!G30","v":0.3},{"$f":"+[1]BASE!H30","v":"C"},{"$f":"IF([1]BASE!HK30=\"\",\"\",[1]BASE!HK30)","v":""},{"$f":"IF([1]BASE!HL30=\"\",\"\",[1]BASE!HL30)","v":""},{"$f":"IF([1]BASE!HM30=\"\",\"\",[1]BASE!HM30)","v":""},{"$f":"IF([1]BASE!HN30=\"\",\"\",[1]BASE!HN30)","v":""},{"$f":"IF([1]BASE!HO30=\"\",\"\",[1]BASE!HO30)","v":""},{"$f":"IF([1]BASE!HP30=\"\",\"\",[1]BASE!HP30)","v":""},{"$f":"IF([1]BASE!HQ30=\"\",\"\",[1]BASE!HQ30)","v":""},{"$f":"IF([1]BASE!HR30=\"\",\"\",[1]BASE!HR30)","v":""},{"$f":"IF([1]BASE!HS30=\"\",\"\",[1]BASE!HS30)","v":""},{"$f":"IF([1]BASE!HT30=\"\",\"\",[1]BASE!HT30)","v":""},{"$f":"IF([1]BASE!HU30=\"\",\"\",[1]BASE!HU30)","v":""},{"$f":"IF([1]BASE!HV30=\"\",\"\",[1]BASE!HV30)","v":""}]
[null,null,{"$f":"+[1]BASE!C31","v":15},{"$f":"+[1]BASE!D31","v":1428},{"$f":"+[1]BASE!E31","v":"CAMPANA - ZARATE"},{"$f":"+[1]BASE!F31","v":132},{"$f":"+[1]BASE!G31","v":9.4},{"$f":"+[1]BASE!H31","v":"C"},{"$f":"IF([1]BASE!HK31=\"\",\"\",[1]BASE!HK31)","v":""},{"$f":"IF([1]BASE!HL31=\"\",\"\",[1]BASE!HL31)","v":""},{"$f":"IF([1]BASE!HM31=\"\",\"\",[1]BASE!HM31)","v":""},{"$f":"IF([1]BASE!HN31=\"\",\"\",[1]BASE!HN31)","v":""},{"$f":"IF([1]BASE!HO31=\"\",\"\",[1]BASE!HO31)","v":""},{"$f":"IF([1]BASE!HP31=\"\",\"\",[1]BASE!HP31)","v":""},{"$f":"IF([1]BASE!HQ31=\"\",\"\",[1]BASE!HQ31)","v":""},{"$f":"IF([1]BASE!HR31=\"\",\"\",[1]BASE!HR31)","v":""},{"$f":"IF([1]BASE!HS31=\"\",\"\",[1]BASE!HS31)","v":""},{"$f":"IF([1]BASE!HT31=\"\",\"\",[1]BASE!HT31)","v":""},{"$f":"IF([1]BASE!HU31=\"\",\"\",[1]BASE!HU31)","v":""},{"$f":"IF([1]BASE!HV31=\"\",\"\",[1]BASE!HV31)","v":""}]
[null,null,{"$f":"+[1]BASE!C32","v":16},{"$f":"+[1]BASE!D32","v":1438},{"$f":"+[1]BASE!E32","v":"CHASCOMUS - VERONICA"},{"$f":"+[1]BASE!F32","v":132},{"$f":"+[1]BASE!G32","v":70.8},{"$f":"+[1]BASE!H32","v":"B"},{"$f":"IF([1]BASE!HK32=\"\",\"\",[1]BASE!HK32)","v":""},{"$f":"IF([1]BASE!HL32=\"\",\"\",[1]BASE!HL32)","v":""},{"$f":"IF([1]BASE!HM32=\"\",\"\",[1]BASE!HM32)","v":""},{"$f":"IF([1]BASE!HN32=\"\",\"\",[1]BASE!HN32)","v":""},{"$f":"IF([1]BASE!HO32=\"\",\"\",[1]BASE!HO32)","v":""},{"$f":"IF([1]BASE!HP32=\"\",\"\",[1]BASE!HP32)","v":""},{"$f":"IF([1]BASE!HQ32=\"\",\"\",[1]BASE!HQ32)","v":""},{"$f":"IF([1]BASE!HR32=\"\",\"\",[1]BASE!HR32)","v":""},{"$f":"IF([1]BASE!HS32=\"\",\"\",[1]BASE!HS32)","v":""},{"$f":"IF([1]BASE!HT32=\"\",\"\",[1]BASE!HT32)","v":""},{"$f":"IF([1]BASE!HU32=\"\",\"\",[1]BASE!HU32)","v":1},{"$f":"IF([1]BASE!HV32=\"\",\"\",[1]BASE!HV32)","v":""}]
[null,null,{"$f":"+[1]BASE!C33","v":17},{"$f":"+[1]BASE!D33","v":1409},{"$f":"+[1]BASE!E33","v":"CHIVILCOY - MERCEDES B.A."},{"$f":"+[1]BASE!F33","v":132},{"$f":"+[1]BASE!G33","v":69.099999999999994},{"$f":"+[1]BASE!H33","v":"C"},{"$f":"IF([1]BASE!HK33=\"\",\"\",[1]BASE!HK33)","v":""},{"$f":"IF([1]BASE!HL33=\"\",\"\",[1]BASE!HL33)","v":""},{"$f":"IF([1]BASE!HM33=\"\",\"\",[1]BASE!HM33)","v":""},{"$f":"IF([1]BASE!HN33=\"\",\"\",[1]BASE!HN33)","v":""},{"$f":"IF([1]BASE!HO33=\"\",\"\",[1]BASE!HO33)","v":""},{"$f":"IF([1]BASE!HP33=\"\",\"\",[1]BASE!HP33)","v":""},{"$f":"IF([1]BASE!HQ33=\"\",\"\",[1]BASE!HQ33)","v":""},{"$f":"IF([1]BASE!HR33=\"\",\"\",[1]BASE!HR33)","v":""},{"$f":"IF([1]BASE!HS33=\"\",\"\",[1]BASE!HS33)","v":""},{"$f":"IF([1]BASE!HT33=\"\",\"\",[1]BASE!HT33)","v":""},{"$f":"IF([1]BASE!HU33=\"\",\"\",[1]BASE!HU33)","v":""},{"$f":"IF([1]BASE!HV33=\"\",\"\",[1]BASE!HV33)","v":""}]
[null,null,{"$f":"+[1]BASE!C34","v":18},{"$f":"+[1]BASE!D34","v":1539},{"$f":"+[1]BASE!E34","v":"CNEL. DORREGO - BAHIA BLANCA"},{"$f":"+[1]BASE!F34","v":132},{"$f":"+[1]BASE!G34","v":77.5},{"$f":"+[1]BASE!H34","v":"C"},{"$f":"IF([1]BASE!HK34=\"\",\"\",[1]BASE!HK34)","v":"XXXX"},{"$f":"IF([1]BASE!HL34=\"\",\"\",[1]BASE!HL34)","v":"XXXX"},{"$f":"IF([1]BASE!HM34=\"\",\"\",[1]BASE!HM34)","v":"XXXX"},{"$f":"IF([1]BASE!HN34=\"\",\"\",[1]BASE!HN34)","v":"XXXX"},{"$f":"IF([1]BASE!HO34=\"\",\"\",[1]BASE!HO34)","v":"XXXX"},{"$f":"IF([1]BASE!HP34=\"\",\"\",[1]BASE!HP34)","v":"XXXX"},{"$f":"IF([1]BASE!HQ34=\"\",\"\",[1]BASE!HQ34)","v":"XXXX"},{"$f":"IF([1]BASE!HR34=\"\",\"\",[1]BASE!HR34)","v":"XXXX"},{"$f":"IF([1]BASE!HS34=\"\",\"\",[1]BASE!HS34)","v":"XXXX"},{"$f":"IF([1]BASE!HT34=\"\",\"\",[1]BASE!HT34)","v":"XXXX"},{"$f":"IF([1]BASE!HU34=\"\",\"\",[1]BASE!HU34)","v":"XXXX"},{"$f":"IF([1]BASE!HV34=\"\",\"\",[1]BASE!HV34)","v":"XXXX"}]
[null,null,{"$f":"+[1]BASE!C35","v":19},{"$f":"+[1]BASE!D35","v":1538},{"$f":"+[1]BASE!E35","v":"CNEL. DORREGO - TRES ARROYOS"},{"$f":"+[1]BASE!F35","v":132},{"$f":"+[1]BASE!G35","v":99},{"$f":"+[1]BASE!H35","v":"C"},{"$f":"IF([1]BASE!HK35=\"\",\"\",[1]BASE!HK35)","v":""},{"$f":"IF([1]BASE!HL35=\"\",\"\",[1]BASE!HL35)","v":""},{"$f":"IF([1]BASE!HM35=\"\",\"\",[1]BASE!HM35)","v":""},{"$f":"IF([1]BASE!HN35=\"\",\"\",[1]BASE!HN35)","v":1},{"$f":"IF([1]BASE!HO35=\"\",\"\",[1]BASE!HO35)","v":""},{"$f":"IF([1]BASE!HP35=\"\",\"\",[1]BASE!HP35)","v":""},{"$f":"IF([1]BASE!HQ35=\"\",\"\",[1]BASE!HQ35)","v":""},{"$f":"IF([1]BASE!HR35=\"\",\"\",[1]BASE!HR35)","v":""},{"$f":"IF([1]BASE!HS35=\"\",\"\",[1]BASE!HS35)","v":""},{"$f":"IF([1]BASE!HT35=\"\",\"\",[1]BASE!HT35)","v":""},{"$f":"IF([1]BASE!HU35=\"\",\"\",[1]BASE!HU35)","v":""},{"$f":"IF([1]BASE!HV35=\"\",\"\",[1]BASE!HV35)","v":""}]
[null,null,{"$f":"+[1]BASE!C36","v":20},{"$f":"+[1]BASE!D36","v":1537},{"$f":"+[1]BASE!E36","v":"CNEL. SUAREZ - PIGUE"},{"$f":"+[1]BASE!F36","v":132},{"$f":"+[1]BASE!G36","v":47.6},{"$f":"+[1]BASE!H36","v":"C"},{"$f":"IF([1]BASE!HK36=\"\",\"\",[1]BASE!HK36)","v":""},{"$f":"IF([1]BASE!HL36=\"\",\"\",[1]BASE!HL36)","v":""},{"$f":"IF([1]BASE!HM36=\"\",\"\",[1]BASE!HM36)","v":""},{"$f":"IF([1]BASE!HN36=\"\",\"\",[1]BASE!HN36)","v":""},{"$f":"IF([1]BASE!HO36=\"\",\"\",[1]BASE!HO36)","v":""},{"$f":"IF([1]BASE!HP36=\"\",\"\",[1]BASE!HP36)","v":""},{"$f":"IF([1]BASE!HQ36=\"\",\"\",[1]BASE!HQ36)","v":""},{"$f":"IF([1]BASE!HR36=\"\",\"\",[1]BASE!HR36)","v":1},{"$f":"IF([1]BASE!HS36=\"\",\"\",[1]BASE!HS36)","v":""},{"$f":"IF([1]BASE!HT36=\"\",\"\",[1]BASE!HT36)","v":1},{"$f":"IF([1]BASE!HU36=\"\",\"\",[1]BASE!HU36)","v":""},{"$f":"IF([1]BASE!HV36=\"\",\"\",[1]BASE!HV36)","v":""}]
[null,null,{"$f":"+[1]BASE!C37","v":21},{"$f":"+[1]BASE!D37","v":1437},{"$f":"+[1]BASE!E37","v":"DOLORES - CHASCOMUS"},{"$f":"+[1]BASE!F37","v":132},{"$f":"+[1]BASE!G37","v":90.23},{"$f":"+[1]BASE!H37","v":"C"},{"$f":"IF([1]BASE!HK37=\"\",\"\",[1]BASE!HK37)","v":""},{"$f":"IF([1]BASE!HL37=\"\",\"\",[1]BASE!HL37)","v":""},{"$f":"IF([1]BASE!HM37=\"\",\"\",[1]BASE!HM37)","v":""},{"$f":"IF([1]BASE!HN37=\"\",\"\",[1]BASE!HN37)","v":""},{"$f":"IF([1]BASE!HO37=\"\",\"\",[1]BASE!HO37)","v":""},{"$f":"IF([1]BASE!HP37=\"\",\"\",[1]BASE!HP37)","v":""},{"$f":"IF([1]BASE!HQ37=\"\",\"\",[1]BASE!HQ37)","v":""},{"$f":"IF([1]BASE!HR37=\"\",\"\",[1]BASE!HR37)","v":1},{"$f":"IF([1]BASE!HS37=\"\",\"\",[1]BASE!HS37)","v":1},{"$f":"IF([1]BASE!HT37=\"\",\"\",[1]BASE!HT37)","v":""},{"$f":"IF([1]BASE!HU37=\"\",\"\",[1]BASE!HU37)","v":""},{"$f":"IF([1]BASE!HV37=\"\",\"\",[1]BASE!HV37)","v":""}]
[null,null,{"$f":"+[1]BASE!C38","v":22},{"$f":"+[1]BASE!D38","v":"CE-000"},{"$f":"+[1]BASE!E38","v":"EASTMAN T - EASTMAN"},{"$f":"+[1]BASE!F38","v":132},{"$f":"+[1]BASE!G38","v":6.5},{"$f":"+[1]BASE!H38","v":"C"},{"$f":"IF([1]BASE!HK38=\"\",\"\",[1]BASE!HK38)","v":"XXXX"},{"$f":"IF([1]BASE!HL38=\"\",\"\",[1]BASE!HL38)","v":"XXXX"},{"$f":"IF([1]BASE!HM38=\"\",\"\",[1]BASE!HM38)","v":"XXXX"},{"$f":"IF([1]BASE!HN38=\"\",\"\",[1]BASE!HN38)","v":"XXXX"},{"$f":"IF([1]BASE!HO38=\"\",\"\",[1]BASE!HO38)","v":"XXXX"},{"$f":"IF([1]BASE!HP38=\"\",\"\",[1]BASE!HP38)","v":"XXXX"},{"$f":"IF([1]BASE!HQ38=\"\",\"\",[1]BASE!HQ38)","v":"XXXX"},{"$f":"IF([1]BASE!HR38=\"\",\"\",[1]BASE!HR38)","v":"XXXX"},{"$f":"IF([1]BASE!HS38=\"\",\"\",[1]BASE!HS38)","v":"XXXX"},{"$f":"IF([1]BASE!HT38=\"\",\"\",[1]BASE!HT38)","v":"XXXX"},{"$f":"IF([1]BASE!HU38=\"\",\"\",[1]BASE!HU38)","v":"XXXX"},{"$f":"IF([1]BASE!HV38=\"\",\"\",[1]BASE!HV38)","v":"XXXX"}]
[null,null,{"$f":"+[1]BASE!C39","v":23},{"$f":"+[1]BASE!D39","v":1516},{"$f":"+[1]BASE!E39","v":"GONZALEZ CHAVEZ - NECOCHEA"},{"$f":"+[1]BASE!F39","v":132},{"$f":"+[1]BASE!G39","v":138.86000000000001},{"$f":"+[1]BASE!H39","v":"A"},{"$f":"IF([1]BASE!HK39=\"\",\"\",[1]BASE!HK39)","v":""},{"$f":"IF([1]BASE!HL39=\"\",\"\",[1]BASE!HL39)","v":""},{"$f":"IF([1]BASE!HM39=\"\",\"\",[1]BASE!HM39)","v":""},{"$f":"IF([1]BASE!HN39=\"\",\"\",[1]BASE!HN39)","v":""},{"$f":"IF([1]BASE!HO39=\"\",\"\",[1]BASE!HO39)","v":""},{"$f":"IF([1]BASE!HP39=\"\",\"\",[1]BASE!HP39)","v":""},{"$f":"IF([1]BASE!HQ39=\"\",\"\",[1]BASE!HQ39)","v":""},{"$f":"IF([1]BASE!HR39=\"\",\"\",[1]BASE!HR39)","v":""},{"$f":"IF([1]BASE!HS39=\"\",\"\",[1]BASE!HS39)","v":""},{"$f":"IF([1]BASE!HT39=\"\",\"\",[1]BASE!HT39)","v":""},{"$f":"IF([1]BASE!HU39=\"\",\"\",[1]BASE!HU39)","v":""},{"$f":"IF([1]BASE!HV39=\"\",\"\",[1]BASE!HV39)","v":""}]
[null,null,{"$f":"+[1]BASE!C40","v":24},{"$f":"+[1]BASE!D40","v":1515},{"$f":"+[1]BASE!E40","v":"GONZALEZ CHAVEZ - TRES ARROYOS"},{"$f":"+[1]BASE!F40","v":132},{"$f":"+[1]BASE!G40","v":40.22},{"$f":"+[1]BASE!H40","v":"C"},{"$f":"IF([1]BASE!HK40=\"\",\"\",[1]BASE!HK40)","v":""},{"$f":"IF([1]BASE!HL40=\"\",\"\",[1]BASE!HL40)","v":""},{"$f":"IF([1]BASE!HM40=\"\",\"\",[1]BASE!HM40)","v":""},{"$f":"IF([1]BASE!HN40=\"\",\"\",[1]BASE!HN40)","v":""},{"$f":"IF([1]BASE!HO40=\"\",\"\",[1]BASE!HO40)","v":1},{"$f":"IF([1]BASE!HP40=\"\",\"\",[1]BASE!HP40)","v":""},{"$f":"IF([1]BASE!HQ40=\"\",\"\",[1]BASE!HQ40)","v":""},{"$f":"IF([1]BASE!HR40=\"\",\"\",[1]BASE!HR40)","v":""},{"$f":"IF([1]BASE!HS40=\"\",\"\",[1]BASE!HS40)","v":""},{"$f":"IF([1]BASE!HT40=\"\",\"\",[1]BASE!HT40)","v":1},{"$f":"IF([1]BASE!HU40=\"\",\"\",[1]BASE!HU40)","v":""},{"$f":"IF([1]BASE!HV40=\"\",\"\",[1]BASE!HV40)","v":""}]
[null,null,{"$f":"+[1]BASE!C41","v":25},{"$f":"+[1]BASE!D41","v":1444},{"$f":"+[1]BASE!E41","v":"GRAL. MADARIAGA - LAS ARMAS"},{"$f":"+[1]BASE!F41","v":132},{"$f":"+[1]BASE!G41","v":64.400000000000006},{"$f":"+[1]BASE!H41","v":"C"},{"$f":"IF([1]BASE!HK41=\"\",\"\",[1]BASE!HK41)","v":1},{"$f":"IF([1]BASE!HL41=\"\",\"\",[1]BASE!HL41)","v":""},{"$f":"IF([1]BASE!HM41=\"\",\"\",[1]BASE!HM41)","v":""},{"$f":"IF([1]BASE!HN41=\"\",\"\",[1]BASE!HN41)","v":""},{"$f":"IF([1]BASE!HO41=\"\",\"\",[1]BASE!HO41)","v":""},{"$f":"IF([1]BASE!HP41=\"\",\"\",[1]BASE!HP41)","v":""},{"$f":"IF([1]BASE!HQ41=\"\",\"\",[1]BASE!HQ41)","v":""},{"$f":"IF([1]BASE!HR41=\"\",\"\",[1]BASE!HR41)","v":""},{"$f":"IF([1]BASE!HS41=\"\",\"\",[1]BASE!HS41)","v":""},{"$f":"IF([1]BASE!HT41=\"\",\"\",[1]BASE!HT41)","v":""},{"$f":"IF([1]BASE!HU41=\"\",\"\",[1]BASE!HU41)","v":""},{"$f":"IF([1]BASE!HV41=\"\",\"\",[1]BASE!HV41)","v":""}]
[null,null,{"$f":"+[1]BASE!C42","v":26},{"$f":"+[1]BASE!D42","v":1401},{"$f":"+[1]BASE!E42","v":"HENDERSON - CNEL. SUAREZ"},{"$f":"+[1]BASE!F42","v":132},{"$f":"+[1]BASE!G42","v":126.9},{"$f":"+[1]BASE!H42","v":"C"},{"$f":"IF([1]BASE!HK42=\"\",\"\",[1]BASE!HK42)","v":""},{"$f":"IF([1]BASE!HL42=\"\",\"\",[1]BASE!HL42)","v":""},{"$f":"IF([1]BASE!HM42=\"\",\"\",[1]BASE!HM42)","v":""},{"$f":"IF([1]BASE!HN42=\"\",\"\",[1]BASE!HN42)","v":""},{"$f":"IF([1]BASE!HO42=\"\",\"\",[1]BASE!HO42)","v":""},{"$f":"IF([1]BASE!HP42=\"\",\"\",[1]BASE!HP42)","v":""},{"$f":"IF([1]BASE!HQ42=\"\",\"\",[1]BASE!HQ42)","v":""},{"$f":"IF([1]BASE!HR42=\"\",\"\",[1]BASE!HR42)","v":""},{"$f":"IF([1]BASE!HS42=\"\",\"\",[1]BASE!HS42)","v":""},{"$f":"IF([1]BASE!HT42=\"\",\"\",[1]BASE!HT42)","v":""},{"$f":"IF([1]BASE!HU42=\"\",\"\",[1]BASE!HU42)","v":""},{"$f":"IF([1]BASE!HV42=\"\",\"\",[1]BASE!HV42)","v":""}]
[null,null,{"$f":"+[1]BASE!C43","v":27},{"$f":"+[1]BASE!D43","v":"C-001"},{"$f":"+[1]BASE!E43","v":"JUNIN - IMSA - LINCOLN"},{"$f":"+[1]BASE!F43","v":132},{"$f":"+[1]BASE!G43","v":70},{"$f":"+[1]BASE!H43","v":"B"},{"$f":"IF([1]BASE!HK43=\"\",\"\",[1]BASE!HK43)","v":""},{"$f":"IF([1]BASE!HL43=\"\",\"\",[1]BASE!HL43)","v":1},{"$f":"IF([1]BASE!HM43=\"\",\"\",[1]BASE!HM43)","v":""},{"$f":"IF([1]BASE!HN43=\"\",\"\",[1]BASE!HN43)","v":1},{"$f":"IF([1]BASE!HO43=\"\",\"\",[1]BASE!HO43)","v":""},{"$f":"IF([1]BASE!HP43=\"\",\"\",[1]BASE!HP43)","v":""},{"$f":"IF([1]BASE!HQ43=\"\",\"\",[1]BASE!HQ43)","v":""},{"$f":"IF([1]BASE!HR43=\"\",\"\",[1]BASE!HR43)","v":""},{"$f":"IF([1]BASE!HS43=\"\",\"\",[1]BASE!HS43)","v":""},{"$f":"IF([1]BASE!HT43=\"\",\"\",[1]BASE!HT43)","v":""},{"$f":"IF([1]BASE!HU43=\"\",\"\",[1]BASE!HU43)","v":""},{"$f":"IF([1]BASE!HV43=\"\",\"\",[1]BASE!HV43)","v":1}]
[null,null,{"$f":"+[1]BASE!C44","v":28},{"$f":"+[1]BASE!D44","v":1456},{"$f":"+[1]BASE!E44","v":"LAPRIDA - PRINGLES"},{"$f":"+[1]BASE!F44","v":132},{"$f":"+[1]BASE!G44","v":71.5},{"$f":"+[1]BASE!H44","v":"C"},{"$f":"IF([1]BASE!HK44=\"\",\"\",[1]BASE!HK44)","v":""},{"$f":"IF([1]BASE!HL44=\"\",\"\",[1]BASE!HL44)","v":""},{"$f":"IF([1]BASE!HM44=\"\",\"\",[1]BASE!HM44)","v":""},{"$f":"IF([1]BASE!HN44=\"\",\"\",[1]BASE!HN44)","v":""},{"$f":"IF([1]BASE!HO44=\"\",\"\",[1]BASE!HO44)","v":""},{"$f":"IF([1]BASE!HP44=\"\",\"\",[1]BASE!HP44)","v":""},{"$f":"IF([1]BASE!HQ44=\"\",\"\",[1]BASE!HQ44)","v":""},{"$f":"IF([1]BASE!HR44=\"\",\"\",[1]BASE!HR44)","v":""},{"$f":"IF([1]BASE!HS44=\"\",\"\",[1]BASE!HS44)","v":""},{"$f":"IF([1]BASE!HT44=\"\",\"\",[1]BASE!HT44)","v":""},{"$f":"IF([1]BASE!HU44=\"\",\"\",[1]BASE!HU44)","v":""},{"$f":"IF([1]BASE!HV44=\"\",\"\",[1]BASE!HV44)","v":""}]
[null,null,{"$f":"+[1]BASE!C45","v":29},{"$f":"+[1]BASE!D45","v":1520},{"$f":"+[1]BASE!E45","v":"LAS ARMAS - DOLORES"},{"$f":"+[1]BASE!F45","v":132},{"$f":"+[1]BASE!G45","v":88.2},{"$f":"+[1]BASE!H45","v":"C"},{"$f":"IF([1]BASE!HK45=\"\",\"\",[1]BASE!HK45)","v":""},{"$f":"IF([1]BASE!HL45=\"\",\"\",[1]BASE!HL45)","v":""},{"$f":"IF([1]BASE!HM45=\"\",\"\",[1]BASE!HM45)","v":1},{"$f":"IF([1]BASE!HN45=\"\",\"\",[1]BASE!HN45)","v":""},{"$f":"IF([1]BASE!HO45=\"\",\"\",[1]BASE!HO45)","v":""},{"$f":"IF([1]BASE!HP45=\"\",\"\",[1]BASE!HP45)","v":""},{"$f":"IF([1]BASE!HQ45=\"\",\"\",[1]BASE!HQ45)","v":""},{"$f":"IF([1]BASE!HR45=\"\",\"\",[1]BASE!HR45)","v":""},{"$f":"IF([1]BASE!HS45=\"\",\"\",[1]BASE!HS45)","v":1},{"$f":"IF([1]BASE!HT45=\"\",\"\",[1]BASE!HT45)","v":""},{"$f":"IF([1]BASE!HU45=\"\",\"\",[1]BASE!HU45)","v":""},{"$f":"IF([1]BASE!HV45=\"\",\"\",[1]BASE!HV45)","v":""}]
[null,null,{"$f":"+[1]BASE!C46","v":30},{"$f":"+[1]BASE!D46","v":1521},{"$f":"+[1]BASE!E46","v":"LAS ARMAS - TANDIL"},{"$f":"+[1]BASE!F46","v":132},{"$f":"+[1]BASE!G46","v":122.2},{"$f":"+[1]BASE!H46","v":"C"},{"$f":"IF([1]BASE!HK46=\"\",\"\",[1]BASE!HK46)","v":""},{"$f":"IF([1]BASE!HL46=\"\",\"\",[1]BASE!HL46)","v":""},{"$f":"IF([1]BASE!HM46=\"\",\"\",[1]BASE!HM46)","v":""},{"$f":"IF([1]BASE!HN46=\"\",\"\",[1]BASE!HN46)","v":""},{"$f":"IF([1]BASE!HO46=\"\",\"\",[1]BASE!HO46)","v":""},{"$f":"IF([1]BASE!HP46=\"\",\"\",[1]BASE!HP46)","v":""},{"$f":"IF([1]BASE!HQ46=\"\",\"\",[1]BASE!HQ46)","v":""},{"$f":"IF([1]BASE!HR46=\"\",\"\",[1]BASE!HR46)","v":""},{"$f":"IF([1]BASE!HS46=\"\",\"\",[1]BASE!HS46)","v":""},{"$f":"IF([1]BASE!HT46=\"\",\"\",[1]BASE!HT46)","v":""},{"$f":"IF([1]BASE!HU46=\"\",\"\",[1]BASE!HU46)","v":""},{"$f":"IF([1]BASE!HV46=\"\",\"\",[1]BASE!HV46)","v":""}]
[null,null,{"$f":"+[1]BASE!C47","v":31},{"$f":"+[1]BASE!D47","v":"CE-000"},{"$f":"+[1]BASE!E47","v":"LAS FLORES - MONTE"},{"$f":"+[1]BASE!F47","v":132},{"$f":"+[1]BASE!G47","v":86.8},{"$f":"+[1]BASE!H47","v":"C"},{"$f":"IF([1]BASE!HK47=\"\",\"\",[1]BASE!HK47)","v":"XXXX"},{"$f":"IF([1]BASE!HL47=\"\",\"\",[1]BASE!HL47)","v":"XXXX"},{"$f":"IF([1]BASE!HM47=\"\",\"\",[1]BASE!HM47)","v":"XXXX"},{"$f":"IF([1]BASE!HN47=\"\",\"\",[1]BASE!HN47)","v":"XXXX"},{"$f":"IF([1]BASE!HO47=\"\",\"\",[1]BASE!HO47)","v":"XXXX"},{"$f":"IF([1]BASE!HP47=\"\",\"\",[1]BASE!HP47)","v":"XXXX"},{"$f":"IF([1]BASE!HQ47=\"\",\"\",[1]BASE!HQ47)","v":"XXXX"},{"$f":"IF([1]BASE!HR47=\"\",\"\",[1]BASE!HR47)","v":"XXXX"},{"$f":"IF([1]BASE!HS47=\"\",\"\",[1]BASE!HS47)","v":"XXXX"},{"$f":"IF([1]BASE!HT47=\"\",\"\",[1]BASE!HT47)","v":"XXXX"},{"$f":"IF([1]BASE!HU47=\"\",\"\",[1]BASE!HU47)","v":"XXXX"},{"$f":"IF([1]BASE!HV47=\"\",\"\",[1]BASE!HV47)","v":"XXXX"}]
[null,null,{"$f":"+[1]BASE!C48","v":32},{"$f":"+[1]BASE!D48","v":1416},{"$f":"+[1]BASE!E48","v":"LINCOLN - BRAGADO"},{"$f":"+[1]BASE!F48","v":132},{"$f":"+[1]BASE!G48","v":109.4},{"$f":"+[1]BASE!H48","v":"C"},{"$f":"IF([1]BASE!HK48=\"\",\"\",[1]BASE!HK48)","v":""},{"$f":"IF([1]BASE!HL48=\"\",\"\",[1]BASE!HL48)","v":""},{"$f":"IF([1]BASE!HM48=\"\",\"\",[1]BASE!HM48)","v":""},{"$f":"IF([1]BASE!HN48=\"\",\"\",[1]BASE!HN48)","v":""},{"$f":"IF([1]BASE!HO48=\"\",\"\",[1]BASE!HO48)","v":""},{"$f":"IF([1]BASE!HP48=\"\",\"\",[1]BASE!HP48)","v":1},{"$f":"IF([1]BASE!HQ48=\"\",\"\",[1]BASE!HQ48)","v":""},{"$f":"IF([1]BASE!HR48=\"\",\"\",[1]BASE!HR48)","v":""},{"$f":"IF([1]BASE!HS48=\"\",\"\",[1]BASE!HS48)","v":""},{"$f":"IF([1]BASE!HT48=\"\",\"\",[1]BASE!HT48)","v":""},{"$f":"IF([1]BASE!HU48=\"\",\"\",[1]BASE!HU48)","v":""},{"$f":"IF([1]BASE!HV48=\"\",\"\",[1]BASE!HV48)","v":""}]
[null,null,{"$f":"+[1]BASE!C49","v":33},{"$f":"+[1]BASE!D49","v":1453},{"$f":"+[1]BASE!E49","v":"LOMA NEGRA - C. AVELLANEDA"},{"$f":"+[1]BASE!F49","v":132},{"$f":"+[1]BASE!G49","v":5.3},{"$f":"+[1]BASE!H49","v":"C"},{"$f":"IF([1]BASE!HK49=\"\",\"\",[1]BASE!HK49)","v":""},{"$f":"IF([1]BASE!HL49=\"\",\"\",[1]BASE!HL49)","v":""},{"$f":"IF([1]BASE!HM49=\"\",\"\",[1]BASE!HM49)","v":""},{"$f":"IF([1]BASE!HN49=\"\",\"\",[1]BASE!HN49)","v":""},{"$f":"IF([1]BASE!HO49=\"\",\"\",[1]BASE!HO49)","v":""},{"$f":"IF([1]BASE!HP49=\"\",\"\",[1]BASE!HP49)","v":""},{"$f":"IF([1]BASE!HQ49=\"\",\"\",[1]BASE!HQ49)","v":""},{"$f":"IF([1]BASE!HR49=\"\",\"\",[1]BASE!HR49)","v":""},{"$f":"IF([1]BASE!HS49=\"\",\"\",[1]BASE!HS49)","v":""},{"$f":"IF([1]BASE!HT49=\"\",\"\",[1]BASE!HT49)","v":""},{"$f":"IF([1]BASE!HU49=\"\",\"\",[1]BASE!HU49)","v":""},{"$f":"IF([1]BASE!HV49=\"\",\"\",[1]BASE!HV49)","v":""}]
[null,null,{"$f":"+[1]BASE!C50","v":34},{"$f":"+[1]BASE!D50","v":1452},{"$f":"+[1]BASE!E50","v":"LOMA NEGRA - OLAVARRIA"},{"$f":"+[1]BASE!F50","v":132},{"$f":"+[1]BASE!G50","v":51.51},{"$f":"+[1]BASE!H50","v":"C"},{"$f":"IF([1]BASE!HK50=\"\",\"\",[1]BASE!HK50)","v":""},{"$f":"IF([1]BASE!HL50=\"\",\"\",[1]BASE!HL50)","v":""},{"$f":"IF([1]BASE!HM50=\"\",\"\",[1]BASE!HM50)","v":""},{"$f":"IF([1]BASE!HN50=\"\",\"\",[1]BASE!HN50)","v":""},{"$f":"IF([1]BASE!HO50=\"\",\"\",[1]BASE!HO50)","v":""},{"$f":"IF([1]BASE!HP50=\"\",\"\",[1]BASE!HP50)","v":""},{"$f":"IF([1]BASE!HQ50=\"\",\"\",[1]BASE!HQ50)","v":""},{"$f":"IF([1]BASE!HR50=\"\",\"\",[1]BASE!HR50)","v":""},{"$f":"IF([1]BASE!HS50=\"\",\"\",[1]BASE!HS50)","v":""},{"$f":"IF([1]BASE!HT50=\"\",\"\",[1]BASE!HT50)","v":""},{"$f":"IF([1]BASE!HU50=\"\",\"\",[1]BASE!HU50)","v":""},{"$f":"IF([1]BASE!HV50=\"\",\"\",[1]BASE!HV50)","v":""}]
[null,null,{"$f":"+[1]BASE!C51","v":35},{"$f":"+[1]BASE!D51","v":2620},{"$f":"+[1]BASE!E51","v":"LUJAN  - MALV.1 - CATONAS 1 - MORÓN 1"},{"$f":"+[1]BASE!F51","v":132},{"$f":"+[1]BASE!G51","v":38.29},{"$f":"+[1]BASE!H51","v":"A"},{"$f":"IF([1]BASE!HK51=\"\",\"\",[1]BASE!HK51)","v":"XXXX"},{"$f":"IF([1]BASE!HL51=\"\",\"\",[1]BASE!HL51)","v":"XXXX"},{"$f":"IF([1]BASE!HM51=\"\",\"\",[1]BASE!HM51)","v":"XXXX"},{"$f":"IF([1]BASE!HN51=\"\",\"\",[1]BASE!HN51)","v":"XXXX"},{"$f":"IF([1]BASE!HO51=\"\",\"\",[1]BASE!HO51)","v":"XXXX"},{"$f":"IF([1]BASE!HP51=\"\",\"\",[1]BASE!HP51)","v":"XXXX"},{"$f":"IF([1]BASE!HQ51=\"\",\"\",[1]BASE!HQ51)","v":"XXXX"},{"$f":"IF([1]BASE!HR51=\"\",\"\",[1]BASE!HR51)","v":"XXXX"},{"$f":"IF([1]BASE!HS51=\"\",\"\",[1]BASE!HS51)","v":"XXXX"},{"$f":"IF([1]BASE!HT51=\"\",\"\",[1]BASE!HT51)","v":"XXXX"},{"$f":"IF([1]BASE!HU51=\"\",\"\",[1]BASE!HU51)","v":"XXXX"},{"$f":"IF([1]BASE!HV51=\"\",\"\",[1]BASE!HV51)","v":"XXXX"}]
[null,null,{"$f":"+[1]BASE!C52","v":36},{"$f":"+[1]BASE!D52","v":2621},{"$f":"+[1]BASE!E52","v":"LUJAN - MALV.2 - CATONAS 2 - MORÓN 2"},{"$f":"+[1]BASE!F52","v":132},{"$f":"+[1]BASE!G52","v":44.56},{"$f":"+[1]BASE!H52","v":"A"},{"$f":"IF([1]BASE!HK52=\"\",\"\",[1]BASE!HK52)","v":""},{"$f":"IF([1]BASE!HL52=\"\",\"\",[1]BASE!HL52)","v":""},{"$f":"IF([1]BASE!HM52=\"\",\"\",[1]BASE!HM52)","v":1},{"$f":"IF([1]BASE!HN52=\"\",\"\",[1]BASE!HN52)","v":1},{"$f":"IF([1]BASE!HO52=\"\",\"\",[1]BASE!HO52)","v":""},{"$f":"IF([1]BASE!HP52=\"\",\"\",[1]BASE!HP52)","v":""},{"$f":"IF([1]BASE!HQ52=\"\",\"\",[1]BASE!HQ52)","v":""},{"$f":"IF([1]BASE!HR52=\"\",\"\",[1]BASE!HR52)","v":2},{"$f":"IF([1]BASE!HS52=\"\",\"\",[1]BASE!HS52)","v":""},{"$f":"IF([1]BASE!HT52=\"\",\"\",[1]BASE!HT52)","v":1},{"$f":"IF([1]BASE!HU52=\"\",\"\",[1]BASE!HU52)","v":""},{"$f":"IF([1]BASE!HV52=\"\",\"\",[1]BASE!HV52)","v":""}]
[null,null,{"$f":"+[1]BASE!C53","v":37},{"$f":"+[1]BASE!D53","v":1442},{"$f":"+[1]BASE!E53","v":"MAR DE AJO - PINAMAR"},{"$f":"+[1]BASE!F53","v":132},{"$f":"+[1]BASE!G53","v":46.4},{"$f":"+[1]BASE!H53","v":"C"},{"$f":"IF([1]BASE!HK53=\"\",\"\",[1]BASE!HK53)","v":""},{"$f":"IF([1]BASE!HL53=\"\",\"\",[1]BASE!HL53)","v":""},{"$f":"IF([1]BASE!HM53=\"\",\"\",[1]BASE!HM53)","v":""},{"$f":"IF([1]BASE!HN53=\"\",\"\",[1]BASE!HN53)","v":""},{"$f":"IF([1]BASE!HO53=\"\",\"\",[1]BASE!HO53)","v":""},{"$f":"IF([1]BASE!HP53=\"\",\"\",[1]BASE!HP53)","v":""},{"$f":"IF([1]BASE!HQ53=\"\",\"\",[1]BASE!HQ53)","v":""},{"$f":"IF([1]BASE!HR53=\"\",\"\",[1]BASE!HR53)","v":""},{"$f":"IF([1]BASE!HS53=\"\",\"\",[1]BASE!HS53)","v":""},{"$f":"IF([1]BASE!HT53=\"\",\"\",[1]BASE!HT53)","v":""},{"$f":"IF([1]BASE!HU53=\"\",\"\",[1]BASE!HU53)","v":""},{"$f":"IF([1]BASE!HV53=\"\",\"\",[1]BASE!HV53)","v":""}]
[null,null,{"$f":"+[1]BASE!C54","v":38},{"$f":"+[1]BASE!D54","v":1525},{"$f":"+[1]BASE!E54","v":"MAR DEL PLATA - MIRAMAR"},{"$f":"+[1]BASE!F54","v":132},{"$f":"+[1]BASE!G54","v":39.29},{"$f":"+[1]BASE!H54","v":"C"},{"$f":"IF([1]BASE!HK54=\"\",\"\",[1]BASE!HK54)","v":""},{"$f":"IF([1]BASE!HL54=\"\",\"\",[1]BASE!HL54)","v":""},{"$f":"IF([1]BASE!HM54=\"\",\"\",[1]BASE!HM54)","v":1},{"$f":"IF([1]BASE!HN54=\"\",\"\",[1]BASE!HN54)","v":""},{"$f":"IF([1]BASE!HO54=\"\",\"\",[1]BASE!HO54)","v":""},{"$f":"IF([1]BASE!HP54=\"\",\"\",[1]BASE!HP54)","v":""},{"$f":"IF([1]BASE!HQ54=\"\",\"\",[1]BASE!HQ54)","v":""},{"$f":"IF([1]BASE!HR54=\"\",\"\",[1]BASE!HR54)","v":""},{"$f":"IF([1]BASE!HS54=\"\",\"\",[1]BASE!HS54)","v":""},{"$f":"IF([1]BASE!HT54=\"\",\"\",[1]BASE!HT54)","v":1},{"$f":"IF([1]BASE!HU54=\"\",\"\",[1]BASE!HU54)","v":""},{"$f":"IF([1]BASE!HV54=\"\",\"\",[1]BASE!HV54)","v":""}]
[null,null,{"$f":"+[1]BASE!C55","v":39},{"$f":"+[1]BASE!D55","v":"CE-002"},{"$f":"+[1]BASE!E55","v":"MAR DEL PLATA - QUEQUEN -NECOCHEA"},{"$f":"+[1]BASE!F55","v":132},{"$f":"+[1]BASE!G55","v":129},{"$f":"+[1]BASE!H55","v":"B"},{"$f":"IF([1]BASE!HK55=\"\",\"\",[1]BASE!HK55)","v":""},{"$f":"IF([1]BASE!HL55=\"\",\"\",[1]BASE!HL55)","v":""},{"$f":"IF([1]BASE!HM55=\"\",\"\",[1]BASE!HM55)","v":""},{"$f":"IF([1]BASE!HN55=\"\",\"\",[1]BASE!HN55)","v":""},{"$f":"IF([1]BASE!HO55=\"\",\"\",[1]BASE!HO55)","v":""},{"$f":"IF([1]BASE!HP55=\"\",\"\",[1]BASE!HP55)","v":""},{"$f":"IF([1]BASE!HQ55=\"\",\"\",[1]BASE!HQ55)","v":""},{"$f":"IF([1]BASE!HR55=\"\",\"\",[1]BASE!HR55)","v":""},{"$f":"IF([1]BASE!HS55=\"\",\"\",[1]BASE!HS55)","v":""},{"$f":"IF([1]BASE!HT55=\"\",\"\",[1]BASE!HT55)","v":""},{"$f":"IF([1]BASE!HU55=\"\",\"\",[1]BASE!HU55)","v":""},{"$f":"IF([1]BASE!HV55=\"\",\"\",[1]BASE!HV55)","v":""}]
[null,null,{"$f":"+[1]BASE!C56","v":40},{"$f":"+[1]BASE!D56","v":1410},{"$f":"+[1]BASE!E56","v":"MERCEDES B.A. - LUJAN"},{"$f":"+[1]BASE!F56","v":132},{"$f":"+[1]BASE!G56","v":41.3},{"$f":"+[1]BASE!H56","v":"B"},{"$f":"IF([1]BASE!HK56=\"\",\"\",[1]BASE!HK56)","v":""},{"$f":"IF([1]BASE!HL56=\"\",\"\",[1]BASE!HL56)","v":1},{"$f":"IF([1]BASE!HM56=\"\",\"\",[1]BASE!HM56)","v":""},{"$f":"IF([1]BASE!HN56=\"\",\"\",[1]BASE!HN56)","v":""},{"$f":"IF([1]BASE!HO56=\"\",\"\",[1]BASE!HO56)","v":""},{"$f":"IF([1]BASE!HP56=\"\",\"\",[1]BASE!HP56)","v":""},{"$f":"IF([1]BASE!HQ56=\"\",\"\",[1]BASE!HQ56)","v":""},{"$f":"IF([1]BASE!HR56=\"\",\"\",[1]BASE!HR56)","v":1},{"$f":"IF([1]BASE!HS56=\"\",\"\",[1]BASE!HS56)","v":""},{"$f":"IF([1]BASE!HT56=\"\",\"\",[1]BASE!HT56)","v":""},{"$f":"IF([1]BASE!HU56=\"\",\"\",[1]BASE!HU56)","v":""},{"$f":"IF([1]BASE!HV56=\"\",\"\",[1]BASE!HV56)","v":""}]
[null,null,{"$f":"+[1]BASE!C57","v":41},{"$f":"+[1]BASE!D57","v":1529},{"$f":"+[1]BASE!E57","v":"MIRAMAR - NECOCHEA"},{"$f":"+[1]BASE!F57","v":132},{"$f":"+[1]BASE!G57","v":103.29},{"$f":"+[1]BASE!H57","v":"A"},{"$f":"IF([1]BASE!HK57=\"\",\"\",[1]BASE!HK57)","v":""},{"$f":"IF([1]BASE!HL57=\"\",\"\",[1]BASE!HL57)","v":""},{"$f":"IF([1]BASE!HM57=\"\",\"\",[1]BASE!HM57)","v":""},{"$f":"IF([1]BASE!HN57=\"\",\"\",[1]BASE!HN57)","v":""},{"$f":"IF([1]BASE!HO57=\"\",\"\",[1]BASE!HO57)","v":""},{"$f":"IF([1]BASE!HP57=\"\",\"\",[1]BASE!HP57)","v":""},{"$f":"IF([1]BASE!HQ57=\"\",\"\",[1]BASE!HQ57)","v":""},{"$f":"IF([1]BASE!HR57=\"\",\"\",[1]BASE!HR57)","v":""},{"$f":"IF([1]BASE!HS57=\"\",\"\",[1]BASE!HS57)","v":1},{"$f":"IF([1]BASE!HT57=\"\",\"\",[1]BASE!HT57)","v":""},{"$f":"IF([1]BASE!HU57=\"\",\"\",[1]BASE!HU57)","v":""},{"$f":"IF([1]BASE!HV57=\"\",\"\",[1]BASE!HV57)","v":""}]
[null,null,{"$f":"+[1]BASE!C58","v":42},{"$f":"+[1]BASE!D58","v":1417},{"$f":"+[1]BASE!E58","v":"MONTE - CHASCOMUS"},{"$f":"+[1]BASE!F58","v":132},{"$f":"+[1]BASE!G58","v":114},{"$f":"+[1]BASE!H58","v":"C"},{"$f":"IF([1]BASE!HK58=\"\",\"\",[1]BASE!HK58)","v":""},{"$f":"IF([1]BASE!HL58=\"\",\"\",[1]BASE!HL58)","v":""},{"$f":"IF([1]BASE!HM58=\"\",\"\",[1]BASE!HM58)","v":""},{"$f":"IF([1]BASE!HN58=\"\",\"\",[1]BASE!HN58)","v":""},{"$f":"IF([1]BASE!HO58=\"\",\"\",[1]BASE!HO58)","v":""},{"$f":"IF([1]BASE!HP58=\"\",\"\",[1]BASE!HP58)","v":""},{"$f":"IF([1]BASE!HQ58=\"\",\"\",[1]BASE!HQ58)","v":""},{"$f":"IF([1]BASE!HR58=\"\",\"\",[1]BASE!HR58)","v":""},{"$f":"IF([1]BASE!HS58=\"\",\"\",[1]BASE!HS58)","v":""},{"$f":"IF([1]BASE!HT58=\"\",\"\",[1]BASE!HT58)","v":""},{"$f":"IF([1]BASE!HU58=\"\",\"\",[1]BASE!HU58)","v":""},{"$f":"IF([1]BASE!HV58=\"\",\"\",[1]BASE!HV58)","v":""}]
[null,null,{"$f":"+[1]BASE!C59","v":43},{"$f":"+[1]BASE!D59","v":1545},{"$f":"+[1]BASE!E59","v":"NORTE II - PETROQ. BAHIA BLANCA"},{"$f":"+[1]BASE!F59","v":132},{"$f":"+[1]BASE!G59","v":30},{"$f":"+[1]BASE!H59","v":"C"},{"$f":"IF([1]BASE!HK59=\"\",\"\",[1]BASE!HK59)","v":"XXXX"},{"$f":"IF([1]BASE!HL59=\"\",\"\",[1]BASE!HL59)","v":"XXXX"},{"$f":"IF([1]BASE!HM59=\"\",\"\",[1]BASE!HM59)","v":"XXXX"},{"$f":"IF([1]BASE!HN59=\"\",\"\",[1]BASE!HN59)","v":"XXXX"},{"$f":"IF([1]BASE!HO59=\"\",\"\",[1]BASE!HO59)","v":"XXXX"},{"$f":"IF([1]BASE!HP59=\"\",\"\",[1]BASE!HP59)","v":"XXXX"},{"$f":"IF([1]BASE!HQ59=\"\",\"\",[1]BASE!HQ59)","v":"XXXX"},{"$f":"IF([1]BASE!HR59=\"\",\"\",[1]BASE!HR59)","v":"XXXX"},{"$f":"IF([1]BASE!HS59=\"\",\"\",[1]BASE!HS59)","v":"XXXX"},{"$f":"IF([1]BASE!HT59=\"\",\"\",[1]BASE!HT59)","v":"XXXX"},{"$f":"IF([1]BASE!HU59=\"\",\"\",[1]BASE!HU59)","v":"XXXX"},{"$f":"IF([1]BASE!HV59=\"\",\"\",[1]BASE!HV59)","v":"XXXX"}]
[null,null,{"$f":"+[1]BASE!C60","v":44},{"$f":"+[1]BASE!D60","v":2648},{"$f":"+[1]BASE!E60","v":"NUEVA CAMPANA - SIDERCA 1"},{"$f":"+[1]BASE!F60","v":132},{"$f":"+[1]BASE!G60","v":3.2},{"$f":"+[1]BASE!H60","v":"C"},{"$f":"IF([1]BASE!HK60=\"\",\"\",[1]BASE!HK60)","v":""},{"$f":"IF([1]BASE!HL60=\"\",\"\",[1]BASE!HL60)","v":""},{"$f":"IF([1]BASE!HM60=\"\",\"\",[1]BASE!HM60)","v":""},{"$f":"IF([1]BASE!HN60=\"\",\"\",[1]BASE!HN60)","v":""},{"$f":"IF([1]BASE!HO60=\"\",\"\",[1]BASE!HO60)","v":""},{"$f":"IF([1]BASE!HP60=\"\",\"\",[1]BASE!HP60)","v":""},{"$f":"IF([1]BASE!HQ60=\"\",\"\",[1]BASE!HQ60)","v":""},{"$f":"IF([1]BASE!HR60=\"\",\"\",[1]BASE!HR60)","v":""},{"$f":"IF([1]BASE!HS60=\"\",\"\",[1]BASE!HS60)","v":""},{"$f":"IF([1]BASE!HT60=\"\",\"\",[1]BASE!HT60)","v":""},{"$f":"IF([1]BASE!HU60=\"\",\"\",[1]BASE!HU60)","v":""},{"$f":"IF([1]BASE!HV60=\"\",\"\",[1]BASE!HV60)","v":""}]
[null,null,{"$f":"+[1]BASE!C61","v":45},{"$f":"+[1]BASE!D61","v":"CE-000"},{"$f":"+[1]BASE!E61","v":"NUEVA CAMPANA - ZARATE"},{"$f":"+[1]BASE!F61","v":132},{"$f":"+[1]BASE!G61","v":10.6},{"$f":"+[1]BASE!H61","v":"C"},{"$f":"IF([1]BASE!HK61=\"\",\"\",[1]BASE!HK61)","v":"XXXX"},{"$f":"IF([1]BASE!HL61=\"\",\"\",[1]BASE!HL61)","v":"XXXX"},{"$f":"IF([1]BASE!HM61=\"\",\"\",[1]BASE!HM61)","v":"XXXX"},{"$f":"IF([1]BASE!HN61=\"\",\"\",[1]BASE!HN61)","v":"XXXX"},{"$f":"IF([1]BASE!HO61=\"\",\"\",[1]BASE!HO61)","v":"XXXX"},{"$f":"IF([1]BASE!HP61=\"\",\"\",[1]BASE!HP61)","v":"XXXX"},{"$f":"IF([1]BASE!HQ61=\"\",\"\",[1]BASE!HQ61)","v":"XXXX"},{"$f":"IF([1]BASE!HR61=\"\",\"\",[1]BASE!HR61)","v":"XXXX"},{"$f":"IF([1]BASE!HS61=\"\",\"\",[1]BASE!HS61)","v":"XXXX"},{"$f":"IF([1]BASE!HT61=\"\",\"\",[1]BASE!HT61)","v":"XXXX"},{"$f":"IF([1]BASE!HU61=\"\",\"\",[1]BASE!HU61)","v":"XXXX"},{"$f":"IF([1]BASE!HV61=\"\",\"\",[1]BASE!HV61)","v":"XXXX"}]
[null,null,{"$f":"+[1]BASE!C62","v":46},{"$f":"+[1]BASE!D62","v":1433},{"$f":"+[1]BASE!E62","v":"NUEVA CAMPANA - SIDERCA \"0\""},{"$f":"+[1]BASE!F62","v":132},{"$f":"+[1]BASE!G62","v":2.2000000000000002},{"$f":"+[1]BASE!H62","v":"C"},{"$f":"IF([1]BASE!HK62=\"\",\"\",[1]BASE!HK62)","v":""},{"$f":"IF([1]BASE!HL62=\"\",\"\",[1]BASE!HL62)","v":""},{"$f":"IF([1]BASE!HM62=\"\",\"\",[1]BASE!HM62)","v":""},{"$f":"IF([1]BASE!HN62=\"\",\"\",[1]BASE!HN62)","v":""},{"$f":"IF([1]BASE!HO62=\"\",\"\",[1]BASE!HO62)","v":""},{"$f":"IF([1]BASE!HP62=\"\",\"\",[1]BASE!HP62)","v":""},{"$f":"IF([1]BASE!HQ62=\"\",\"\",[1]BASE!HQ62)","v":""},{"$f":"IF([1]BASE!HR62=\"\",\"\",[1]BASE!HR62)","v":""},{"$f":"IF([1]BASE!HS62=\"\",\"\",[1]BASE!HS62)","v":""},{"$f":"IF([1]BASE!HT62=\"\",\"\",[1]BASE!HT62)","v":""},{"$f":"IF([1]BASE!HU62=\"\",\"\",[1]BASE!HU62)","v":""},{"$f":"IF([1]BASE!HV62=\"\",\"\",[1]BASE!HV62)","v":""}]
[null,null,{"$f":"+[1]BASE!C63","v":47},{"$f":"+[1]BASE!D63","v":1450},{"$f":"+[1]BASE!E63","v":"OLAVARRIA - AZUL"},{"$f":"+[1]BASE!F63","v":132},{"$f":"+[1]BASE!G63","v":51.4},{"$f":"+[1]BASE!H63","v":"C"},{"$f":"IF([1]BASE!HK63=\"\",\"\",[1]BASE!HK63)","v":""},{"$f":"IF([1]BASE!HL63=\"\",\"\",[1]BASE!HL63)","v":""},{"$f":"IF([1]BASE!HM63=\"\",\"\",[1]BASE!HM63)","v":""},{"$f":"IF([1]BASE!HN63=\"\",\"\",[1]BASE!HN63)","v":""},{"$f":"IF([1]BASE!HO63=\"\",\"\",[1]BASE!HO63)","v":""},{"$f":"IF([1]BASE!HP63=\"\",\"\",[1]BASE!HP63)","v":""},{"$f":"IF([1]BASE!HQ63=\"\",\"\",[1]BASE!HQ63)","v":""},{"$f":"IF([1]BASE!HR63=\"\",\"\",[1]BASE!HR63)","v":""},{"$f":"IF([1]BASE!HS63=\"\",\"\",[1]BASE!HS63)","v":""},{"$f":"IF([1]BASE!HT63=\"\",\"\",[1]BASE!HT63)","v":1},{"$f":"IF([1]BASE!HU63=\"\",\"\",[1]BASE!HU63)","v":""},{"$f":"IF([1]BASE!HV63=\"\",\"\",[1]BASE!HV63)","v":""}]
[null,null,{"$f":"+[1]BASE!C64","v":48},{"$f":"+[1]BASE!D64","v":"CE-000"},{"$f":"+[1]BASE!E64","v":"OLAVARRIA - GONZALEZ CHAVEZ"},{"$f":"+[1]BASE!F64","v":132},{"$f":"+[1]BASE!G64","v":152},{"$f":"+[1]BASE!H64","v":"C"},{"$f":"IF([1]BASE!HK64=\"\",\"\",[1]BASE!HK64)","v":"XXXX"},{"$f":"IF([1]BASE!HL64=\"\",\"\",[1]BASE!HL64)","v":"XXXX"},{"$f":"IF([1]BASE!HM64=\"\",\"\",[1]BASE!HM64)","v":"XXXX"},{"$f":"IF([1]BASE!HN64=\"\",\"\",[1]BASE!HN64)","v":"XXXX"},{"$f":"IF([1]BASE!HO64=\"\",\"\",[1]BASE!HO64)","v":"XXXX"},{"$f":"IF([1]BASE!HP64=\"\",\"\",[1]BASE!HP64)","v":"XXXX"},{"$f":"IF([1]BASE!HQ64=\"\",\"\",[1]BASE!HQ64)","v":"XXXX"},{"$f":"IF([1]BASE!HR64=\"\",\"\",[1]BASE!HR64)","v":"XXXX"},{"$f":"IF([1]BASE!HS64=\"\",\"\",[1]BASE!HS64)","v":"XXXX"},{"$f":"IF([1]BASE!HT64=\"\",\"\",[1]BASE!HT64)","v":"XXXX"},{"$f":"IF([1]BASE!HU64=\"\",\"\",[1]BASE!HU64)","v":"XXXX"},{"$f":"IF([1]BASE!HV64=\"\",\"\",[1]BASE!HV64)","v":"XXXX"}]
[null,null,{"$f":"+[1]BASE!C65","v":49},{"$f":"+[1]BASE!D65","v":1446},{"$f":"+[1]BASE!E65","v":"OLAVARRIA - HENDERSON"},{"$f":"+[1]BASE!F65","v":132},{"$f":"+[1]BASE!G65","v":139.9},{"$f":"+[1]BASE!H65","v":"C"},{"$f":"IF([1]BASE!HK65=\"\",\"\",[1]BASE!HK65)","v":""},{"$f":"IF([1]BASE!HL65=\"\",\"\",[1]BASE!HL65)","v":""},{"$f":"IF([1]BASE!HM65=\"\",\"\",[1]BASE!HM65)","v":""},{"$f":"IF([1]BASE!HN65=\"\",\"\",[1]BASE!HN65)","v":""},{"$f":"IF([1]BASE!HO65=\"\",\"\",[1]BASE!HO65)","v":""},{"$f":"IF([1]BASE!HP65=\"\",\"\",[1]BASE!HP65)","v":""},{"$f":"IF([1]BASE!HQ65=\"\",\"\",[1]BASE!HQ65)","v":""},{"$f":"IF([1]BASE!HR65=\"\",\"\",[1]BASE!HR65)","v":""},{"$f":"IF([1]BASE!HS65=\"\",\"\",[1]BASE!HS65)","v":""},{"$f":"IF([1]BASE!HT65=\"\",\"\",[1]BASE!HT65)","v":""},{"$f":"IF([1]BASE!HU65=\"\",\"\",[1]BASE!HU65)","v":""},{"$f":"IF([1]BASE!HV65=\"\",\"\",[1]BASE!HV65)","v":""}]
[null,null,{"$f":"+[1]BASE!C66","v":50},{"$f":"+[1]BASE!D66","v":"CE-000"},{"$f":"+[1]BASE!E66","v":"OLAVARRIA - LAPRIDA"},{"$f":"+[1]BASE!F66","v":132},{"$f":"+[1]BASE!G66","v":99.7},{"$f":"+[1]BASE!H66","v":"C"},{"$f":"IF([1]BASE!HK66=\"\",\"\",[1]BASE!HK66)","v":"XXXX"},{"$f":"IF([1]BASE!HL66=\"\",\"\",[1]BASE!HL66)","v":"XXXX"},{"$f":"IF([1]BASE!HM66=\"\",\"\",[1]BASE!HM66)","v":"XXXX"},{"$f":"IF([1]BASE!HN66=\"\",\"\",[1]BASE!HN66)","v":"XXXX"},{"$f":"IF([1]BASE!HO66=\"\",\"\",[1]BASE!HO66)","v":"XXXX"},{"$f":"IF([1]BASE!HP66=\"\",\"\",[1]BASE!HP66)","v":"XXXX"},{"$f":"IF([1]BASE!HQ66=\"\",\"\",[1]BASE!HQ66)","v":"XXXX"},{"$f":"IF([1]BASE!HR66=\"\",\"\",[1]BASE!HR66)","v":"XXXX"},{"$f":"IF([1]BASE!HS66=\"\",\"\",[1]BASE!HS66)","v":"XXXX"},{"$f":"IF([1]BASE!HT66=\"\",\"\",[1]BASE!HT66)","v":"XXXX"},{"$f":"IF([1]BASE!HU66=\"\",\"\",[1]BASE!HU66)","v":"XXXX"},{"$f":"IF([1]BASE!HV66=\"\",\"\",[1]BASE!HV66)","v":"XXXX"}]
[null,null,{"$f":"+[1]BASE!C67","v":51},{"$f":"+[1]BASE!D67","v":1449},{"$f":"+[1]BASE!E67","v":"OLAVARRIA - TANDIL"},{"$f":"+[1]BASE!F67","v":132},{"$f":"+[1]BASE!G67","v":133.19999999999999},{"$f":"+[1]BASE!H67","v":"A"},{"$f":"IF([1]BASE!HK67=\"\",\"\",[1]BASE!HK67)","v":1},{"$f":"IF([1]BASE!HL67=\"\",\"\",[1]BASE!HL67)","v":""},{"$f":"IF([1]BASE!HM67=\"\",\"\",[1]BASE!HM67)","v":""},{"$f":"IF([1]BASE!HN67=\"\",\"\",[1]BASE!HN67)","v":""},{"$f":"IF([1]BASE!HO67=\"\",\"\",[1]BASE!HO67)","v":""},{"$f":"IF([1]BASE!HP67=\"\",\"\",[1]BASE!HP67)","v":""},{"$f":"IF([1]BASE!HQ67=\"\",\"\",[1]BASE!HQ67)","v":""},{"$f":"IF([1]BASE!HR67=\"\",\"\",[1]BASE!HR67)","v":""},{"$f":"IF([1]BASE!HS67=\"\",\"\",[1]BASE!HS67)","v":""},{"$f":"IF([1]BASE!HT67=\"\",\"\",[1]BASE!HT67)","v":""},{"$f":"IF([1]BASE!HU67=\"\",\"\",[1]BASE!HU67)","v":""},{"$f":"IF([1]BASE!HV67=\"\",\"\",[1]BASE!HV67)","v":""}]
[null,null,{"$f":"+[1]BASE!C68","v":52},{"$f":"+[1]BASE!D68","v":1451},{"$f":"+[1]BASE!E68","v":"OLAVARRIA VIEJA - OLAVARRIA"},{"$f":"+[1]BASE!F68","v":132},{"$f":"+[1]BASE!G68","v":35.590000000000003},{"$f":"+[1]BASE!H68","v":"C"},{"$f":"IF([1]BASE!HK68=\"\",\"\",[1]BASE!HK68)","v":""},{"$f":"IF([1]BASE!HL68=\"\",\"\",[1]BASE!HL68)","v":""},{"$f":"IF([1]BASE!HM68=\"\",\"\",[1]BASE!HM68)","v":""},{"$f":"IF([1]BASE!HN68=\"\",\"\",[1]BASE!HN68)","v":""},{"$f":"IF([1]BASE!HO68=\"\",\"\",[1]BASE!HO68)","v":""},{"$f":"IF([1]BASE!HP68=\"\",\"\",[1]BASE!HP68)","v":""},{"$f":"IF([1]BASE!HQ68=\"\",\"\",[1]BASE!HQ68)","v":""},{"$f":"IF([1]BASE!HR68=\"\",\"\",[1]BASE!HR68)","v":""},{"$f":"IF([1]BASE!HS68=\"\",\"\",[1]BASE!HS68)","v":""},{"$f":"IF([1]BASE!HT68=\"\",\"\",[1]BASE!HT68)","v":""},{"$f":"IF([1]BASE!HU68=\"\",\"\",[1]BASE!HU68)","v":""},{"$f":"IF([1]BASE!HV68=\"\",\"\",[1]BASE!HV68)","v":""}]
[null,null,{"$f":"+[1]BASE!C69","v":53},{"$f":"+[1]BASE!D69","v":1533},{"$f":"+[1]BASE!E69","v":"P. LURO - C. PATAGONES"},{"$f":"+[1]BASE!F69","v":132},{"$f":"+[1]BASE!G69","v":151},{"$f":"+[1]BASE!H69","v":"C"},{"$f":"IF([1]BASE!HK69=\"\",\"\",[1]BASE!HK69)","v":""},{"$f":"IF([1]BASE!HL69=\"\",\"\",[1]BASE!HL69)","v":""},{"$f":"IF([1]BASE!HM69=\"\",\"\",[1]BASE!HM69)","v":""},{"$f":"IF([1]BASE!HN69=\"\",\"\",[1]BASE!HN69)","v":""},{"$f":"IF([1]BASE!HO69=\"\",\"\",[1]BASE!HO69)","v":""},{"$f":"IF([1]BASE!HP69=\"\",\"\",[1]BASE!HP69)","v":""},{"$f":"IF([1]BASE!HQ69=\"\",\"\",[1]BASE!HQ69)","v":""},{"$f":"IF([1]BASE!HR69=\"\",\"\",[1]BASE!HR69)","v":""},{"$f":"IF([1]BASE!HS69=\"\",\"\",[1]BASE!HS69)","v":""},{"$f":"IF([1]BASE!HT69=\"\",\"\",[1]BASE!HT69)","v":""},{"$f":"IF([1]BASE!HU69=\"\",\"\",[1]BASE!HU69)","v":""},{"$f":"IF([1]BASE!HV69=\"\",\"\",[1]BASE!HV69)","v":""}]
[null,null,{"$f":"+[1]BASE!C70","v":54},{"$f":"+[1]BASE!D70","v":2740},{"$f":"+[1]BASE!E70","v":"PERGAMINO - RAMALLO"},{"$f":"+[1]BASE!F70","v":132},{"$f":"+[1]BASE!G70","v":66.8},{"$f":"+[1]BASE!H70","v":"C"},{"$f":"IF([1]BASE!HK70=\"\",\"\",[1]BASE!HK70)","v":""},{"$f":"IF([1]BASE!HL70=\"\",\"\",[1]BASE!HL70)","v":""},{"$f":"IF([1]BASE!HM70=\"\",\"\",[1]BASE!HM70)","v":1},{"$f":"IF([1]BASE!HN70=\"\",\"\",[1]BASE!HN70)","v":""},{"$f":"IF([1]BASE!HO70=\"\",\"\",[1]BASE!HO70)","v":""},{"$f":"IF([1]BASE!HP70=\"\",\"\",[1]BASE!HP70)","v":""},{"$f":"IF([1]BASE!HQ70=\"\",\"\",[1]BASE!HQ70)","v":""},{"$f":"IF([1]BASE!HR70=\"\",\"\",[1]BASE!HR70)","v":""},{"$f":"IF([1]BASE!HS70=\"\",\"\",[1]BASE!HS70)","v":""},{"$f":"IF([1]BASE!HT70=\"\",\"\",[1]BASE!HT70)","v":""},{"$f":"IF([1]BASE!HU70=\"\",\"\",[1]BASE!HU70)","v":""},{"$f":"IF([1]BASE!HV70=\"\",\"\",[1]BASE!HV70)","v":""}]
[null,null,{"$f":"+[1]BASE!C71","v":55},{"$f":"+[1]BASE!D71","v":1420},{"$f":"+[1]BASE!E71","v":"PERGAMINO - ROJAS"},{"$f":"+[1]BASE!F71","v":132},{"$f":"+[1]BASE!G71","v":36},{"$f":"+[1]BASE!H71","v":"C"},{"$f":"IF([1]BASE!HK71=\"\",\"\",[1]BASE!HK71)","v":""},{"$f":"IF([1]BASE!HL71=\"\",\"\",[1]BASE!HL71)","v":""},{"$f":"IF([1]BASE!HM71=\"\",\"\",[1]BASE!HM71)","v":""},{"$f":"IF([1]BASE!HN71=\"\",\"\",[1]BASE!HN71)","v":""},{"$f":"IF([1]BASE!HO71=\"\",\"\",[1]BASE!HO71)","v":""},{"$f":"IF([1]BASE!HP71=\"\",\"\",[1]BASE!HP71)","v":""},{"$f":"IF([1]BASE!HQ71=\"\",\"\",[1]BASE!HQ71)","v":""},{"$f":"IF([1]BASE!HR71=\"\",\"\",[1]BASE!HR71)","v":""},{"$f":"IF([1]BASE!HS71=\"\",\"\",[1]BASE!HS71)","v":""},{"$f":"IF([1]BASE!HT71=\"\",\"\",[1]BASE!HT71)","v":""},{"$f":"IF([1]BASE!HU71=\"\",\"\",[1]BASE!HU71)","v":""},{"$f":"IF([1]BASE!HV71=\"\",\"\",[1]BASE!HV71)","v":1}]
[null,null,{"$f":"+[1]BASE!C72","v":56},{"$f":"+[1]BASE!D72","v":1419},{"$f":"+[1]BASE!E72","v":"PERGAMINO - SAN NICOLAS"},{"$f":"+[1]BASE!F72","v":132},{"$f":"+[1]BASE!G72","v":70.8},{"$f":"+[1]BASE!H72","v":"C"},{"$f":"IF([1]BASE!HK72=\"\",\"\",[1]BASE!HK72)","v":1},{"$f":"IF([1]BASE!HL72=\"\",\"\",[1]BASE!HL72)","v":""},{"$f":"IF([1]BASE!HM72=\"\",\"\",[1]BASE!HM72)","v":""},{"$f":"IF([1]BASE!HN72=\"\",\"\",[1]BASE!HN72)","v":""},{"$f":"IF([1]BASE!HO72=\"\",\"\",[1]BASE!HO72)","v":""},{"$f":"IF([1]BASE!HP72=\"\",\"\",[1]BASE!HP72)","v":""},{"$f":"IF([1]BASE!HQ72=\"\",\"\",[1]BASE!HQ72)","v":""},{"$f":"IF([1]BASE!HR72=\"\",\"\",[1]BASE!HR72)","v":""},{"$f":"IF([1]BASE!HS72=\"\",\"\",[1]BASE!HS72)","v":""},{"$f":"IF([1]BASE!HT72=\"\",\"\",[1]BASE!HT72)","v":""},{"$f":"IF([1]BASE!HU72=\"\",\"\",[1]BASE!HU72)","v":""},{"$f":"IF([1]BASE!HV72=\"\",\"\",[1]BASE!HV72)","v":""}]
[null,null,{"$f":"+[1]BASE!C73","v":57},{"$f":"+[1]BASE!D73","v":1546},{"$f":"+[1]BASE!E73","v":"PETROQ. BAHIA BLANCA - URBANA BB"},{"$f":"+[1]BASE!F73","v":132},{"$f":"+[1]BASE!G73","v":3.2},{"$f":"+[1]BASE!H73","v":"C"},{"$f":"IF([1]BASE!HK73=\"\",\"\",[1]BASE!HK73)","v":""},{"$f":"IF([1]BASE!HL73=\"\",\"\",[1]BASE!HL73)","v":""},{"$f":"IF([1]BASE!HM73=\"\",\"\",[1]BASE!HM73)","v":""},{"$f":"IF([1]BASE!HN73=\"\",\"\",[1]BASE!HN73)","v":""},{"$f":"IF([1]BASE!HO73=\"\",\"\",[1]BASE!HO73)","v":""},{"$f":"IF([1]BASE!HP73=\"\",\"\",[1]BASE!HP73)","v":""},{"$f":"IF([1]BASE!HQ73=\"\",\"\",[1]BASE!HQ73)","v":""},{"$f":"IF([1]BASE!HR73=\"\",\"\",[1]BASE!HR73)","v":""},{"$f":"IF([1]BASE!HS73=\"\",\"\",[1]BASE!HS73)","v":""},{"$f":"IF([1]BASE!HT73=\"\",\"\",[1]BASE!HT73)","v":""},{"$f":"IF([1]BASE!HU73=\"\",\"\",[1]BASE!HU73)","v":""},{"$f":"IF([1]BASE!HV73=\"\",\"\",[1]BASE!HV73)","v":""}]
[null,null,{"$f":"+[1]BASE!C74","v":58},null,{"$f":"+[1]BASE!E74","v":"C. PIEDRABUENA - ING. WHITE"},{"$f":"+[1]BASE!F74","v":132},{"$f":"+[1]BASE!G74","v":1.1000000000000001},{"$f":"+[1]BASE!H74","v":"C"},{"$f":"IF([1]BASE!HK74=\"\",\"\",[1]BASE!HK74)","v":""},{"$f":"IF([1]BASE!HL74=\"\",\"\",[1]BASE!HL74)","v":""},{"$f":"IF([1]BASE!HM74=\"\",\"\",[1]BASE!HM74)","v":""},{"$f":"IF([1]BASE!HN74=\"\",\"\",[1]BASE!HN74)","v":""},{"$f":"IF([1]BASE!HO74=\"\",\"\",[1]BASE!HO74)","v":""},{"$f":"IF([1]BASE!HP74=\"\",\"\",[1]BASE!HP74)","v":""},{"$f":"IF([1]BASE!HQ74=\"\",\"\",[1]BASE!HQ74)","v":""},{"$f":"IF([1]BASE!HR74=\"\",\"\",[1]BASE!HR74)","v":""},{"$f":"IF([1]BASE!HS74=\"\",\"\",[1]BASE!HS74)","v":""},{"$f":"IF([1]BASE!HT74=\"\",\"\",[1]BASE!HT74)","v":""},{"$f":"IF([1]BASE!HU74=\"\",\"\",[1]BASE!HU74)","v":""},{"$f":"IF([1]BASE!HV74=\"\",\"\",[1]BASE!HV74)","v":""}]
[null,null,{"$f":"+[1]BASE!C75","v":59},{"$f":"+[1]BASE!D75","v":2616},{"$f":"+[1]BASE!E75","v":"PIGUE - GUATRACHE"},{"$f":"+[1]BASE!F75","v":132},{"$f":"+[1]BASE!G75","v":102},{"$f":"+[1]BASE!H75","v":"C"},{"$f":"IF([1]BASE!HK75=\"\",\"\",[1]BASE!HK75)","v":1},{"$f":"IF([1]BASE!HL75=\"\",\"\",[1]BASE!HL75)","v":""},{"$f":"IF([1]BASE!HM75=\"\",\"\",[1]BASE!HM75)","v":""},{"$f":"IF([1]BASE!HN75=\"\",\"\",[1]BASE!HN75)","v":""},{"$f":"IF([1]BASE!HO75=\"\",\"\",[1]BASE!HO75)","v":""},{"$f":"IF([1]BASE!HP75=\"\",\"\",[1]BASE!HP75)","v":""},{"$f":"IF([1]BASE!HQ75=\"\",\"\",[1]BASE!HQ75)","v":""},{"$f":"IF([1]BASE!HR75=\"\",\"\",[1]BASE!HR75)","v":""},{"$f":"IF([1]BASE!HS75=\"\",\"\",[1]BASE!HS75)","v":""},{"$f":"IF([1]BASE!HT75=\"\",\"\",[1]BASE!HT75)","v":""},{"$f":"IF([1]BASE!HU75=\"\",\"\",[1]BASE!HU75)","v":""},{"$f":"IF([1]BASE!HV75=\"\",\"\",[1]BASE!HV75)","v":""}]
[null,null,{"$f":"+[1]BASE!C76","v":60},{"$f":"+[1]BASE!D76","v":"CE-004"},{"$f":"+[1]BASE!E76","v":"PIGÜE - TORNQUIST - BAHIA BLANCA"},{"$f":"+[1]BASE!F76","v":132},{"$f":"+[1]BASE!G76","v":132.30000000000001},{"$f":"+[1]BASE!H76","v":"C"},{"$f":"IF([1]BASE!HK76=\"\",\"\",[1]BASE!HK76)","v":""},{"$f":"IF([1]BASE!HL76=\"\",\"\",[1]BASE!HL76)","v":""},{"$f":"IF([1]BASE!HM76=\"\",\"\",[1]BASE!HM76)","v":""},{"$f":"IF([1]BASE!HN76=\"\",\"\",[1]BASE!HN76)","v":""},{"$f":"IF([1]BASE!HO76=\"\",\"\",[1]BASE!HO76)","v":""},{"$f":"IF([1]BASE!HP76=\"\",\"\",[1]BASE!HP76)","v":""},{"$f":"IF([1]BASE!HQ76=\"\",\"\",[1]BASE!HQ76)","v":""},{"$f":"IF([1]BASE!HR76=\"\",\"\",[1]BASE!HR76)","v":""},{"$f":"IF([1]BASE!HS76=\"\",\"\",[1]BASE!HS76)","v":""},{"$f":"IF([1]BASE!HT76=\"\",\"\",[1]BASE!HT76)","v":""},{"$f":"IF([1]BASE!HU76=\"\",\"\",[1]BASE!HU76)","v":1},{"$f":"IF([1]BASE!HV76=\"\",\"\",[1]BASE!HV76)","v":""}]
[null,null,{"$f":"+[1]BASE!C77","v":61},{"$f":"+[1]BASE!D77","v":1443},{"$f":"+[1]BASE!E77","v":"PINAMAR - VILLA GESELL"},{"$f":"+[1]BASE!F77","v":132},{"$f":"+[1]BASE!G77","v":20.28},{"$f":"+[1]BASE!H77","v":"C"},{"$f":"IF([1]BASE!HK77=\"\",\"\",[1]BASE!HK77)","v":"XXXX"},{"$f":"IF([1]BASE!HL77=\"\",\"\",[1]BASE!HL77)","v":"XXXX"},{"$f":"IF([1]BASE!HM77=\"\",\"\",[1]BASE!HM77)","v":"XXXX"},{"$f":"IF([1]BASE!HN77=\"\",\"\",[1]BASE!HN77)","v":"XXXX"},{"$f":"IF([1]BASE!HO77=\"\",\"\",[1]BASE!HO77)","v":"XXXX"},{"$f":"IF([1]BASE!HP77=\"\",\"\",[1]BASE!HP77)","v":"XXXX"},{"$f":"IF([1]BASE!HQ77=\"\",\"\",[1]BASE!HQ77)","v":"XXXX"},{"$f":"IF([1]BASE!HR77=\"\",\"\",[1]BASE!HR77)","v":"XXXX"},{"$f":"IF([1]BASE!HS77=\"\",\"\",[1]BASE!HS77)","v":"XXXX"},{"$f":"IF([1]BASE!HT77=\"\",\"\",[1]BASE!HT77)","v":"XXXX"},{"$f":"IF([1]BASE!HU77=\"\",\"\",[1]BASE!HU77)","v":"XXXX"},{"$f":"IF([1]BASE!HV77=\"\",\"\",[1]BASE!HV77)","v":"XXXX"}]
[null,null,{"$f":"+[1]BASE!C78","v":62},{"$f":"+[1]BASE!D78","v":1543},{"$f":"+[1]BASE!E78","v":"PUNTA ALTA - BAHIA BLANCA"},{"$f":"+[1]BASE!F78","v":132},{"$f":"+[1]BASE!G78","v":24.1},{"$f":"+[1]BASE!H78","v":"C"},{"$f":"IF([1]BASE!HK78=\"\",\"\",[1]BASE!HK78)","v":""},{"$f":"IF([1]BASE!HL78=\"\",\"\",[1]BASE!HL78)","v":""},{"$f":"IF([1]BASE!HM78=\"\",\"\",[1]BASE!HM78)","v":""},{"$f":"IF([1]BASE!HN78=\"\",\"\",[1]BASE!HN78)","v":1},{"$f":"IF([1]BASE!HO78=\"\",\"\",[1]BASE!HO78)","v":""},{"$f":"IF([1]BASE!HP78=\"\",\"\",[1]BASE!HP78)","v":""},{"$f":"IF([1]BASE!HQ78=\"\",\"\",[1]BASE!HQ78)","v":""},{"$f":"IF([1]BASE!HR78=\"\",\"\",[1]BASE!HR78)","v":""},{"$f":"IF([1]BASE!HS78=\"\",\"\",[1]BASE!HS78)","v":""},{"$f":"IF([1]BASE!HT78=\"\",\"\",[1]BASE!HT78)","v":""},{"$f":"IF([1]BASE!HU78=\"\",\"\",[1]BASE!HU78)","v":""},{"$f":"IF([1]BASE!HV78=\"\",\"\",[1]BASE!HV78)","v":""}]
[null,null,{"$f":"+[1]BASE!C79","v":63},{"$f":"+[1]BASE!D79","v":1544},{"$f":"+[1]BASE!E79","v":"PUNTA ALTA - C. PIEDRABUENA"},{"$f":"+[1]BASE!F79","v":132},{"$f":"+[1]BASE!G79","v":25},{"$f":"+[1]BASE!H79","v":"C"},{"$f":"IF([1]BASE!HK79=\"\",\"\",[1]BASE!HK79)","v":""},{"$f":"IF([1]BASE!HL79=\"\",\"\",[1]BASE!HL79)","v":""},{"$f":"IF([1]BASE!HM79=\"\",\"\",[1]BASE!HM79)","v":""},{"$f":"IF([1]BASE!HN79=\"\",\"\",[1]BASE!HN79)","v":""},{"$f":"IF([1]BASE!HO79=\"\",\"\",[1]BASE!HO79)","v":""},{"$f":"IF([1]BASE!HP79=\"\",\"\",[1]BASE!HP79)","v":""},{"$f":"IF([1]BASE!HQ79=\"\",\"\",[1]BASE!HQ79)","v":""},{"$f":"IF([1]BASE!HR79=\"\",\"\",[1]BASE!HR79)","v":1},{"$f":"IF([1]BASE!HS79=\"\",\"\",[1]BASE!HS79)","v":""},{"$f":"IF([1]BASE!HT79=\"\",\"\",[1]BASE!HT79)","v":""},{"$f":"IF([1]BASE!HU79=\"\",\"\",[1]BASE!HU79)","v":""},{"$f":"IF([1]BASE!HV79=\"\",\"\",[1]BASE!HV79)","v":""}]
[null,null,{"$f":"+[1]BASE!C80","v":64},{"$f":"+[1]BASE!D80","v":2741},{"$f":"+[1]BASE!E80","v":"RAMALLO - URBANA SAN NICOLAS"},{"$f":"+[1]BASE!F80","v":132},{"$f":"+[1]BASE!G80","v":12.86},{"$f":"+[1]BASE!H80","v":"C"},{"$f":"IF([1]BASE!HK80=\"\",\"\",[1]BASE!HK80)","v":""},{"$f":"IF([1]BASE!HL80=\"\",\"\",[1]BASE!HL80)","v":""},{"$f":"IF([1]BASE!HM80=\"\",\"\",[1]BASE!HM80)","v":""},{"$f":"IF([1]BASE!HN80=\"\",\"\",[1]BASE!HN80)","v":""},{"$f":"IF([1]BASE!HO80=\"\",\"\",[1]BASE!HO80)","v":""},{"$f":"IF([1]BASE!HP80=\"\",\"\",[1]BASE!HP80)","v":""},{"$f":"IF([1]BASE!HQ80=\"\",\"\",[1]BASE!HQ80)","v":""},{"$f":"IF([1]BASE!HR80=\"\",\"\",[1]BASE!HR80)","v":""},{"$f":"IF([1]BASE!HS80=\"\",\"\",[1]BASE!HS80)","v":""},{"$f":"IF([1]BASE!HT80=\"\",\"\",[1]BASE!HT80)","v":""},{"$f":"IF([1]BASE!HU80=\"\",\"\",[1]BASE!HU80)","v":""},{"$f":"IF([1]BASE!HV80=\"\",\"\",[1]BASE!HV80)","v":""}]
[null,null,{"$f":"+[1]BASE!C81","v":65},{"$f":"+[1]BASE!D81","v":1418},{"$f":"+[1]BASE!E81","v":"ROJAS - JUNIN"},{"$f":"+[1]BASE!F81","v":132},{"$f":"+[1]BASE!G81","v":47.7},{"$f":"+[1]BASE!H81","v":"C"},{"$f":"IF([1]BASE!HK81=\"\",\"\",[1]BASE!HK81)","v":""},{"$f":"IF([1]BASE!HL81=\"\",\"\",[1]BASE!HL81)","v":""},{"$f":"IF([1]BASE!HM81=\"\",\"\",[1]BASE!HM81)","v":""},{"$f":"IF([1]BASE!HN81=\"\",\"\",[1]BASE!HN81)","v":""},{"$f":"IF([1]BASE!HO81=\"\",\"\",[1]BASE!HO81)","v":""},{"$f":"IF([1]BASE!HP81=\"\",\"\",[1]BASE!HP81)","v":""},{"$f":"IF([1]BASE!HQ81=\"\",\"\",[1]BASE!HQ81)","v":""},{"$f":"IF([1]BASE!HR81=\"\",\"\",[1]BASE!HR81)","v":""},{"$f":"IF([1]BASE!HS81=\"\",\"\",[1]BASE!HS81)","v":""},{"$f":"IF([1]BASE!HT81=\"\",\"\",[1]BASE!HT81)","v":""},{"$f":"IF([1]BASE!HU81=\"\",\"\",[1]BASE!HU81)","v":""},{"$f":"IF([1]BASE!HV81=\"\",\"\",[1]BASE!HV81)","v":""}]
[null,null,{"$f":"+[1]BASE!C82","v":66},{"$f":"+[1]BASE!D82","v":1407},{"$f":"+[1]BASE!E82","v":"SALADILLO - LAS FLORES"},{"$f":"+[1]BASE!F82","v":132},{"$f":"+[1]BASE!G82","v":76.3},{"$f":"+[1]BASE!H82","v":"C"},{"$f":"IF([1]BASE!HK82=\"\",\"\",[1]BASE!HK82)","v":""},{"$f":"IF([1]BASE!HL82=\"\",\"\",[1]BASE!HL82)","v":""},{"$f":"IF([1]BASE!HM82=\"\",\"\",[1]BASE!HM82)","v":""},{"$f":"IF([1]BASE!HN82=\"\",\"\",[1]BASE!HN82)","v":""},{"$f":"IF([1]BASE!HO82=\"\",\"\",[1]BASE!HO82)","v":""},{"$f":"IF([1]BASE!HP82=\"\",\"\",[1]BASE!HP82)","v":""},{"$f":"IF([1]BASE!HQ82=\"\",\"\",[1]BASE!HQ82)","v":""},{"$f":"IF([1]BASE!HR82=\"\",\"\",[1]BASE!HR82)","v":1},{"$f":"IF([1]BASE!HS82=\"\",\"\",[1]BASE!HS82)","v":""},{"$f":"IF([1]BASE!HT82=\"\",\"\",[1]BASE!HT82)","v":""},{"$f":"IF([1]BASE!HU82=\"\",\"\",[1]BASE!HU82)","v":""},{"$f":"IF([1]BASE!HV82=\"\",\"\",[1]BASE!HV82)","v":""}]
[null,null,{"$f":"+[1]BASE!C83","v":67},{"$f":"+[1]BASE!D83","v":1439},{"$f":"+[1]BASE!E83","v":"SAN CLEMENTE - DOLORES"},{"$f":"+[1]BASE!F83","v":132},{"$f":"+[1]BASE!G83","v":102.6},{"$f":"+[1]BASE!H83","v":"C"},{"$f":"IF([1]BASE!HK83=\"\",\"\",[1]BASE!HK83)","v":""},{"$f":"IF([1]BASE!HL83=\"\",\"\",[1]BASE!HL83)","v":""},{"$f":"IF([1]BASE!HM83=\"\",\"\",[1]BASE!HM83)","v":""},{"$f":"IF([1]BASE!HN83=\"\",\"\",[1]BASE!HN83)","v":""},{"$f":"IF([1]BASE!HO83=\"\",\"\",[1]BASE!HO83)","v":""},{"$f":"IF([1]BASE!HP83=\"\",\"\",[1]BASE!HP83)","v":""},{"$f":"IF([1]BASE!HQ83=\"\",\"\",[1]BASE!HQ83)","v":""},{"$f":"IF([1]BASE!HR83=\"\",\"\",[1]BASE!HR83)","v":""},{"$f":"IF([1]BASE!HS83=\"\",\"\",[1]BASE!HS83)","v":1},{"$f":"IF([1]BASE!HT83=\"\",\"\",[1]BASE!HT83)","v":""},{"$f":"IF([1]BASE!HU83=\"\",\"\",[1]BASE!HU83)","v":""},{"$f":"IF([1]BASE!HV83=\"\",\"\",[1]BASE!HV83)","v":""}]
[null,null,{"$f":"+[1]BASE!C84","v":68},{"$f":"+[1]BASE!D84","v":"C-000"},{"$f":"+[1]BASE!E84","v":"SAN CLEMENTE - MAR DEL TUYÚ - MAR DE AJÓ"},{"$f":"+[1]BASE!F84","v":132},{"$f":"+[1]BASE!G84","v":39},{"$f":"+[1]BASE!H84","v":"B"},{"$f":"IF([1]BASE!HK84=\"\",\"\",[1]BASE!HK84)","v":"XXXX"},{"$f":"IF([1]BASE!HL84=\"\",\"\",[1]BASE!HL84)","v":"XXXX"},{"$f":"IF([1]BASE!HM84=\"\",\"\",[1]BASE!HM84)","v":"XXXX"},{"$f":"IF([1]BASE!HN84=\"\",\"\",[1]BASE!HN84)","v":"XXXX"},{"$f":"IF([1]BASE!HO84=\"\",\"\",[1]BASE!HO84)","v":"XXXX"},{"$f":"IF([1]BASE!HP84=\"\",\"\",[1]BASE!HP84)","v":"XXXX"},{"$f":"IF([1]BASE!HQ84=\"\",\"\",[1]BASE!HQ84)","v":"XXXX"},{"$f":"IF([1]BASE!HR84=\"\",\"\",[1]BASE!HR84)","v":"XXXX"},{"$f":"IF([1]BASE!HS84=\"\",\"\",[1]BASE!HS84)","v":"XXXX"},{"$f":"IF([1]BASE!HT84=\"\",\"\",[1]BASE!HT84)","v":"XXXX"},{"$f":"IF([1]BASE!HU84=\"\",\"\",[1]BASE!HU84)","v":"XXXX"},{"$f":"IF([1]BASE!HV84=\"\",\"\",[1]BASE!HV84)","v":"XXXX"}]
[null,null,{"$f":"+[1]BASE!C85","v":69},{"$f":"+[1]BASE!D85","v":4293},{"$f":"+[1]BASE!E85","v":"SAN CLEMENTE - LAS TONINAS"},{"$f":"+[1]BASE!F85","v":132},{"$f":"+[1]BASE!G85","v":14.6},{"$f":"+[1]BASE!H85","v":"B"},{"$f":"IF([1]BASE!HK85=\"\",\"\",[1]BASE!HK85)","v":""},{"$f":"IF([1]BASE!HL85=\"\",\"\",[1]BASE!HL85)","v":""},{"$f":"IF([1]BASE!HM85=\"\",\"\",[1]BASE!HM85)","v":""},{"$f":"IF([1]BASE!HN85=\"\",\"\",[1]BASE!HN85)","v":""},{"$f":"IF([1]BASE!HO85=\"\",\"\",[1]BASE!HO85)","v":""},{"$f":"IF([1]BASE!HP85=\"\",\"\",[1]BASE!HP85)","v":""},{"$f":"IF([1]BASE!HQ85=\"\",\"\",[1]BASE!HQ85)","v":""},{"$f":"IF([1]BASE!HR85=\"\",\"\",[1]BASE!HR85)","v":""},{"$f":"IF([1]BASE!HS85=\"\",\"\",[1]BASE!HS85)","v":""},{"$f":"IF([1]BASE!HT85=\"\",\"\",[1]BASE!HT85)","v":""},{"$f":"IF([1]BASE!HU85=\"\",\"\",[1]BASE!HU85)","v":""},{"$f":"IF([1]BASE!HV85=\"\",\"\",[1]BASE!HV85)","v":""}]
[null,null,{"$f":"+[1]BASE!C86","v":70},{"$f":"+[1]BASE!D86","v":"CE-003"},{"$f":"+[1]BASE!E86","v":"LAS TONINAS-MAR DEL TUYU-MAR DE AJO"},{"$f":"+[1]BASE!F86","v":132},{"$f":"+[1]BASE!G86","v":29.57},{"$f":"+[1]BASE!H86","v":"B"},{"$f":"IF([1]BASE!HK86=\"\",\"\",[1]BASE!HK86)","v":""},{"$f":"IF([1]BASE!HL86=\"\",\"\",[1]BASE!HL86)","v":""},{"$f":"IF([1]BASE!HM86=\"\",\"\",[1]BASE!HM86)","v":""},{"$f":"IF([1]BASE!HN86=\"\",\"\",[1]BASE!HN86)","v":""},{"$f":"IF([1]BASE!HO86=\"\",\"\",[1]BASE!HO86)","v":""},{"$f":"IF([1]BASE!HP86=\"\",\"\",[1]BASE!HP86)","v":""},{"$f":"IF([1]BASE!HQ86=\"\",\"\",[1]BASE!HQ86)","v":""},{"$f":"IF([1]BASE!HR86=\"\",\"\",[1]BASE!HR86)","v":1},{"$f":"IF([1]BASE!HS86=\"\",\"\",[1]BASE!HS86)","v":""},{"$f":"IF([1]BASE!HT86=\"\",\"\",[1]BASE!HT86)","v":""},{"$f":"IF([1]BASE!HU86=\"\",\"\",[1]BASE!HU86)","v":""},{"$f":"IF([1]BASE!HV86=\"\",\"\",[1]BASE!HV86)","v":""}]
[null,null,{"$f":"+[1]BASE!C87","v":71},{"$f":"+[1]BASE!D87","v":1999},{"$f":"+[1]BASE!E87","v":"SAN NICOLÁS - VILLA CONSTITUCIÓN IND."},{"$f":"+[1]BASE!F87","v":132},{"$f":"+[1]BASE!G87","v":14.7},{"$f":"+[1]BASE!H87","v":"C"},{"$f":"IF([1]BASE!HK87=\"\",\"\",[1]BASE!HK87)","v":""},{"$f":"IF([1]BASE!HL87=\"\",\"\",[1]BASE!HL87)","v":""},{"$f":"IF([1]BASE!HM87=\"\",\"\",[1]BASE!HM87)","v":""},{"$f":"IF([1]BASE!HN87=\"\",\"\",[1]BASE!HN87)","v":""},{"$f":"IF([1]BASE!HO87=\"\",\"\",[1]BASE!HO87)","v":""},{"$f":"IF([1]BASE!HP87=\"\",\"\",[1]BASE!HP87)","v":1},{"$f":"IF([1]BASE!HQ87=\"\",\"\",[1]BASE!HQ87)","v":""},{"$f":"IF([1]BASE!HR87=\"\",\"\",[1]BASE!HR87)","v":""},{"$f":"IF([1]BASE!HS87=\"\",\"\",[1]BASE!HS87)","v":""},{"$f":"IF([1]BASE!HT87=\"\",\"\",[1]BASE!HT87)","v":1},{"$f":"IF([1]BASE!HU87=\"\",\"\",[1]BASE!HU87)","v":""},{"$f":"IF([1]BASE!HV87=\"\",\"\",[1]BASE!HV87)","v":""}]
[null,null,{"$f":"+[1]BASE!C88","v":72},{"$f":"+[1]BASE!D88","v":1997},{"$f":"+[1]BASE!E88","v":"SAN NICOLÁS - VILLA CONSTITUCIÓN RES."},{"$f":"+[1]BASE!F88","v":132},{"$f":"+[1]BASE!G88","v":13.6},{"$f":"+[1]BASE!H88","v":"B"},{"$f":"IF([1]BASE!HK88=\"\",\"\",[1]BASE!HK88)","v":""},{"$f":"IF([1]BASE!HL88=\"\",\"\",[1]BASE!HL88)","v":""},{"$f":"IF([1]BASE!HM88=\"\",\"\",[1]BASE!HM88)","v":""},{"$f":"IF([1]BASE!HN88=\"\",\"\",[1]BASE!HN88)","v":""},{"$f":"IF([1]BASE!HO88=\"\",\"\",[1]BASE!HO88)","v":""},{"$f":"IF([1]BASE!HP88=\"\",\"\",[1]BASE!HP88)","v":""},{"$f":"IF([1]BASE!HQ88=\"\",\"\",[1]BASE!HQ88)","v":""},{"$f":"IF([1]BASE!HR88=\"\",\"\",[1]BASE!HR88)","v":""},{"$f":"IF([1]BASE!HS88=\"\",\"\",[1]BASE!HS88)","v":""},{"$f":"IF([1]BASE!HT88=\"\",\"\",[1]BASE!HT88)","v":""},{"$f":"IF([1]BASE!HU88=\"\",\"\",[1]BASE!HU88)","v":""},{"$f":"IF([1]BASE!HV88=\"\",\"\",[1]BASE!HV88)","v":""}]
[null,null,{"$f":"+[1]BASE!C89","v":73},{"$f":"+[1]BASE!D89","v":"CE-000"},{"$f":"+[1]BASE!E89","v":"SAN NICOLAS EXTG - SAN NICOLAS"},{"$f":"+[1]BASE!F89","v":132},{"$f":"+[1]BASE!G89","v":0.4},{"$f":"+[1]BASE!H89","v":"C"},{"$f":"IF([1]BASE!HK89=\"\",\"\",[1]BASE!HK89)","v":"XXXX"},{"$f":"IF([1]BASE!HL89=\"\",\"\",[1]BASE!HL89)","v":"XXXX"},{"$f":"IF([1]BASE!HM89=\"\",\"\",[1]BASE!HM89)","v":"XXXX"},{"$f":"IF([1]BASE!HN89=\"\",\"\",[1]BASE!HN89)","v":"XXXX"},{"$f":"IF([1]BASE!HO89=\"\",\"\",[1]BASE!HO89)","v":"XXXX"},{"$f":"IF([1]BASE!HP89=\"\",\"\",[1]BASE!HP89)","v":"XXXX"},{"$f":"IF([1]BASE!HQ89=\"\",\"\",[1]BASE!HQ89)","v":"XXXX"},{"$f":"IF([1]BASE!HR89=\"\",\"\",[1]BASE!HR89)","v":"XXXX"},{"$f":"IF([1]BASE!HS89=\"\",\"\",[1]BASE!HS89)","v":"XXXX"},{"$f":"IF([1]BASE!HT89=\"\",\"\",[1]BASE!HT89)","v":"XXXX"},{"$f":"IF([1]BASE!HU89=\"\",\"\",[1]BASE!HU89)","v":"XXXX"},{"$f":"IF([1]BASE!HV89=\"\",\"\",[1]BASE!HV89)","v":"XXXX"}]
[null,null,{"$f":"+[1]BASE!C90","v":74},{"$f":"+[1]BASE!D90","v":2957},{"$f":"+[1]BASE!E90","v":"SAN PEDRO - EASTMAN T"},{"$f":"+[1]BASE!F90","v":132},{"$f":"+[1]BASE!G90","v":63.1},{"$f":"+[1]BASE!H90","v":"C"},{"$f":"IF([1]BASE!HK90=\"\",\"\",[1]BASE!HK90)","v":"XXXX"},{"$f":"IF([1]BASE!HL90=\"\",\"\",[1]BASE!HL90)","v":"XXXX"},{"$f":"IF([1]BASE!HM90=\"\",\"\",[1]BASE!HM90)","v":"XXXX"},{"$f":"IF([1]BASE!HN90=\"\",\"\",[1]BASE!HN90)","v":"XXXX"},{"$f":"IF([1]BASE!HO90=\"\",\"\",[1]BASE!HO90)","v":"XXXX"},{"$f":"IF([1]BASE!HP90=\"\",\"\",[1]BASE!HP90)","v":"XXXX"},{"$f":"IF([1]BASE!HQ90=\"\",\"\",[1]BASE!HQ90)","v":"XXXX"},{"$f":"IF([1]BASE!HR90=\"\",\"\",[1]BASE!HR90)","v":"XXXX"},{"$f":"IF([1]BASE!HS90=\"\",\"\",[1]BASE!HS90)","v":"XXXX"},{"$f":"IF([1]BASE!HT90=\"\",\"\",[1]BASE!HT90)","v":"XXXX"},{"$f":"IF([1]BASE!HU90=\"\",\"\",[1]BASE!HU90)","v":"XXXX"},{"$f":"IF([1]BASE!HV90=\"\",\"\",[1]BASE!HV90)","v":"XXXX"}]
[null,null,{"$f":"+[1]BASE!C91","v":75},{"$f":"+[1]BASE!D91","v":1427},{"$f":"+[1]BASE!E91","v":"SAN PEDRO - PAPEL PRENSA"},{"$f":"+[1]BASE!F91","v":132},{"$f":"+[1]BASE!G91","v":10.9},{"$f":"+[1]BASE!H91","v":"B"},{"$f":"IF([1]BASE!HK91=\"\",\"\",[1]BASE!HK91)","v":""},{"$f":"IF([1]BASE!HL91=\"\",\"\",[1]BASE!HL91)","v":""},{"$f":"IF([1]BASE!HM91=\"\",\"\",[1]BASE!HM91)","v":""},{"$f":"IF([1]BASE!HN91=\"\",\"\",[1]BASE!HN91)","v":""},{"$f":"IF([1]BASE!HO91=\"\",\"\",[1]BASE!HO91)","v":""},{"$f":"IF([1]BASE!HP91=\"\",\"\",[1]BASE!HP91)","v":""},{"$f":"IF([1]BASE!HQ91=\"\",\"\",[1]BASE!HQ91)","v":""},{"$f":"IF([1]BASE!HR91=\"\",\"\",[1]BASE!HR91)","v":""},{"$f":"IF([1]BASE!HS91=\"\",\"\",[1]BASE!HS91)","v":""},{"$f":"IF([1]BASE!HT91=\"\",\"\",[1]BASE!HT91)","v":""},{"$f":"IF([1]BASE!HU91=\"\",\"\",[1]BASE!HU91)","v":""},{"$f":"IF([1]BASE!HV91=\"\",\"\",[1]BASE!HV91)","v":""}]
[null,null,{"$f":"+[1]BASE!C92","v":76},{"$f":"+[1]BASE!D92","v":"CE-000"},{"$f":"+[1]BASE!E92","v":"SAN PEDRO - SAN NICOLÁS"},{"$f":"+[1]BASE!F92","v":132},{"$f":"+[1]BASE!G92","v":65},{"$f":"+[1]BASE!H92","v":"C"},{"$f":"IF([1]BASE!HK92=\"\",\"\",[1]BASE!HK92)","v":"XXXX"},{"$f":"IF([1]BASE!HL92=\"\",\"\",[1]BASE!HL92)","v":"XXXX"},{"$f":"IF([1]BASE!HM92=\"\",\"\",[1]BASE!HM92)","v":"XXXX"},{"$f":"IF([1]BASE!HN92=\"\",\"\",[1]BASE!HN92)","v":"XXXX"},{"$f":"IF([1]BASE!HO92=\"\",\"\",[1]BASE!HO92)","v":"XXXX"},{"$f":"IF([1]BASE!HP92=\"\",\"\",[1]BASE!HP92)","v":"XXXX"},{"$f":"IF([1]BASE!HQ92=\"\",\"\",[1]BASE!HQ92)","v":"XXXX"},{"$f":"IF([1]BASE!HR92=\"\",\"\",[1]BASE!HR92)","v":"XXXX"},{"$f":"IF([1]BASE!HS92=\"\",\"\",[1]BASE!HS92)","v":"XXXX"},{"$f":"IF([1]BASE!HT92=\"\",\"\",[1]BASE!HT92)","v":"XXXX"},{"$f":"IF([1]BASE!HU92=\"\",\"\",[1]BASE!HU92)","v":"XXXX"},{"$f":"IF([1]BASE!HV92=\"\",\"\",[1]BASE!HV92)","v":"XXXX"}]
[null,null,{"$f":"+[1]BASE!C93","v":77},{"$f":"+[1]BASE!D93","v":4277},{"$f":"+[1]BASE!E93","v":"SAN PEDRO - RAMALLO INDUSTRIAL"},{"$f":"+[1]BASE!F93","v":132},{"$f":"+[1]BASE!G93","v":58},{"$f":"+[1]BASE!H93","v":"C"},{"$f":"IF([1]BASE!HK93=\"\",\"\",[1]BASE!HK93)","v":""},{"$f":"IF([1]BASE!HL93=\"\",\"\",[1]BASE!HL93)","v":""},{"$f":"IF([1]BASE!HM93=\"\",\"\",[1]BASE!HM93)","v":""},{"$f":"IF([1]BASE!HN93=\"\",\"\",[1]BASE!HN93)","v":""},{"$f":"IF([1]BASE!HO93=\"\",\"\",[1]BASE!HO93)","v":""},{"$f":"IF([1]BASE!HP93=\"\",\"\",[1]BASE!HP93)","v":""},{"$f":"IF([1]BASE!HQ93=\"\",\"\",[1]BASE!HQ93)","v":""},{"$f":"IF([1]BASE!HR93=\"\",\"\",[1]BASE!HR93)","v":""},{"$f":"IF([1]BASE!HS93=\"\",\"\",[1]BASE!HS93)","v":""},{"$f":"IF([1]BASE!HT93=\"\",\"\",[1]BASE!HT93)","v":""},{"$f":"IF([1]BASE!HU93=\"\",\"\",[1]BASE!HU93)","v":""},{"$f":"IF([1]BASE!HV93=\"\",\"\",[1]BASE!HV93)","v":""}]
[null,null,{"$f":"+[1]BASE!C94","v":78},{"$f":"+[1]BASE!D94","v":4278},{"$f":"+[1]BASE!E94","v":"SAN NICOLÁS - RAMALLO INDUSTRIAL"},{"$f":"+[1]BASE!F94","v":132},{"$f":"+[1]BASE!G94","v":23.52},{"$f":"+[1]BASE!H94","v":"C"},{"$f":"IF([1]BASE!HK94=\"\",\"\",[1]BASE!HK94)","v":"XXXX"},{"$f":"IF([1]BASE!HL94=\"\",\"\",[1]BASE!HL94)","v":"XXXX"},{"$f":"IF([1]BASE!HM94=\"\",\"\",[1]BASE!HM94)","v":"XXXX"},{"$f":"IF([1]BASE!HN94=\"\",\"\",[1]BASE!HN94)","v":"XXXX"},{"$f":"IF([1]BASE!HO94=\"\",\"\",[1]BASE!HO94)","v":"XXXX"},{"$f":"IF([1]BASE!HP94=\"\",\"\",[1]BASE!HP94)","v":"XXXX"},{"$f":"IF([1]BASE!HQ94=\"\",\"\",[1]BASE!HQ94)","v":"XXXX"},{"$f":"IF([1]BASE!HR94=\"\",\"\",[1]BASE!HR94)","v":"XXXX"},{"$f":"IF([1]BASE!HS94=\"\",\"\",[1]BASE!HS94)","v":"XXXX"},{"$f":"IF([1]BASE!HT94=\"\",\"\",[1]BASE!HT94)","v":"XXXX"},{"$f":"IF([1]BASE!HU94=\"\",\"\",[1]BASE!HU94)","v":"XXXX"},{"$f":"IF([1]BASE!HV94=\"\",\"\",[1]BASE!HV94)","v":"XXXX"}]
[null,null,{"$f":"+[1]BASE!C95","v":79},{"$f":"+[1]BASE!D95","v":1517},{"$f":"+[1]BASE!E95","v":"TANDIL - BALCARCE"},{"$f":"+[1]BASE!F95","v":132},{"$f":"+[1]BASE!G95","v":103.6},{"$f":"+[1]BASE!H95","v":"C"},{"$f":"IF([1]BASE!HK95=\"\",\"\",[1]BASE!HK95)","v":""},{"$f":"IF([1]BASE!HL95=\"\",\"\",[1]BASE!HL95)","v":""},{"$f":"IF([1]BASE!HM95=\"\",\"\",[1]BASE!HM95)","v":""},{"$f":"IF([1]BASE!HN95=\"\",\"\",[1]BASE!HN95)","v":""},{"$f":"IF([1]BASE!HO95=\"\",\"\",[1]BASE!HO95)","v":""},{"$f":"IF([1]BASE!HP95=\"\",\"\",[1]BASE!HP95)","v":""},{"$f":"IF([1]BASE!HQ95=\"\",\"\",[1]BASE!HQ95)","v":""},{"$f":"IF([1]BASE!HR95=\"\",\"\",[1]BASE!HR95)","v":""},{"$f":"IF([1]BASE!HS95=\"\",\"\",[1]BASE!HS95)","v":""},{"$f":"IF([1]BASE!HT95=\"\",\"\",[1]BASE!HT95)","v":""},{"$f":"IF([1]BASE!HU95=\"\",\"\",[1]BASE!HU95)","v":""},{"$f":"IF([1]BASE!HV95=\"\",\"\",[1]BASE!HV95)","v":""}]
[null,null,{"$f":"+[1]BASE!C96","v":80},{"$f":"+[1]BASE!D96","v":1519},{"$f":"+[1]BASE!E96","v":"TANDIL - NECOCHEA"},{"$f":"+[1]BASE!F96","v":132},{"$f":"+[1]BASE!G96","v":149.19999999999999},{"$f":"+[1]BASE!H96","v":"C"},{"$f":"IF([1]BASE!HK96=\"\",\"\",[1]BASE!HK96)","v":""},{"$f":"IF([1]BASE!HL96=\"\",\"\",[1]BASE!HL96)","v":""},{"$f":"IF([1]BASE!HM96=\"\",\"\",[1]BASE!HM96)","v":1},{"$f":"IF([1]BASE!HN96=\"\",\"\",[1]BASE!HN96)","v":""},{"$f":"IF([1]BASE!HO96=\"\",\"\",[1]BASE!HO96)","v":""},{"$f":"IF([1]BASE!HP96=\"\",\"\",[1]BASE!HP96)","v":""},{"$f":"IF([1]BASE!HQ96=\"\",\"\",[1]BASE!HQ96)","v":""},{"$f":"IF([1]BASE!HR96=\"\",\"\",[1]BASE!HR96)","v":""},{"$f":"IF([1]BASE!HS96=\"\",\"\",[1]BASE!HS96)","v":""},{"$f":"IF([1]BASE!HT96=\"\",\"\",[1]BASE!HT96)","v":""},{"$f":"IF([1]BASE!HU96=\"\",\"\",[1]BASE!HU96)","v":""},{"$f":"IF([1]BASE!HV96=\"\",\"\",[1]BASE!HV96)","v":""}]
[null,null,{"$f":"+[1]BASE!C97","v":81},{"$f":"+[1]BASE!D97","v":1518},{"$f":"+[1]BASE!E97","v":"TANDIL - BARKER"},{"$f":"+[1]BASE!F97","v":132},{"$f":"+[1]BASE!G97","v":47.7},{"$f":"+[1]BASE!H97","v":"C"},{"$f":"IF([1]BASE!HK97=\"\",\"\",[1]BASE!HK97)","v":""},{"$f":"IF([1]BASE!HL97=\"\",\"\",[1]BASE!HL97)","v":""},{"$f":"IF([1]BASE!HM97=\"\",\"\",[1]BASE!HM97)","v":""},{"$f":"IF([1]BASE!HN97=\"\",\"\",[1]BASE!HN97)","v":""},{"$f":"IF([1]BASE!HO97=\"\",\"\",[1]BASE!HO97)","v":""},{"$f":"IF([1]BASE!HP97=\"\",\"\",[1]BASE!HP97)","v":""},{"$f":"IF([1]BASE!HQ97=\"\",\"\",[1]BASE!HQ97)","v":""},{"$f":"IF([1]BASE!HR97=\"\",\"\",[1]BASE!HR97)","v":""},{"$f":"IF([1]BASE!HS97=\"\",\"\",[1]BASE!HS97)","v":""},{"$f":"IF([1]BASE!HT97=\"\",\"\",[1]BASE!HT97)","v":""},{"$f":"IF([1]BASE!HU97=\"\",\"\",[1]BASE!HU97)","v":""},{"$f":"IF([1]BASE!HV97=\"\",\"\",[1]BASE!HV97)","v":""}]
[null,null,{"$f":"+[1]BASE!C98","v":82},{"$f":"+[1]BASE!D98","v":2712},{"$f":"+[1]BASE!E98","v":"TRENQUE LAUQUEN - GRAL. PICO"},{"$f":"+[1]BASE!F98","v":132},{"$f":"+[1]BASE!G98","v":77},{"$f":"+[1]BASE!H98","v":"C"},{"$f":"IF([1]BASE!HK98=\"\",\"\",[1]BASE!HK98)","v":""},{"$f":"IF([1]BASE!HL98=\"\",\"\",[1]BASE!HL98)","v":""},{"$f":"IF([1]BASE!HM98=\"\",\"\",[1]BASE!HM98)","v":""},{"$f":"IF([1]BASE!HN98=\"\",\"\",[1]BASE!HN98)","v":""},{"$f":"IF([1]BASE!HO98=\"\",\"\",[1]BASE!HO98)","v":""},{"$f":"IF([1]BASE!HP98=\"\",\"\",[1]BASE!HP98)","v":""},{"$f":"IF([1]BASE!HQ98=\"\",\"\",[1]BASE!HQ98)","v":""},{"$f":"IF([1]BASE!HR98=\"\",\"\",[1]BASE!HR98)","v":""},{"$f":"IF([1]BASE!HS98=\"\",\"\",[1]BASE!HS98)","v":""},{"$f":"IF([1]BASE!HT98=\"\",\"\",[1]BASE!HT98)","v":""},{"$f":"IF([1]BASE!HU98=\"\",\"\",[1]BASE!HU98)","v":""},{"$f":"IF([1]BASE!HV98=\"\",\"\",[1]BASE!HV98)","v":""}]
[null,null,{"$f":"+[1]BASE!C99","v":83},{"$f":"+[1]BASE!D99","v":1402},{"$f":"+[1]BASE!E99","v":"TRENQUE LAUQUEN - HENDERSON"},{"$f":"+[1]BASE!F99","v":132},{"$f":"+[1]BASE!G99","v":105.4},{"$f":"+[1]BASE!H99","v":"A"},{"$f":"IF([1]BASE!HK99=\"\",\"\",[1]BASE!HK99)","v":""},{"$f":"IF([1]BASE!HL99=\"\",\"\",[1]BASE!HL99)","v":""},{"$f":"IF([1]BASE!HM99=\"\",\"\",[1]BASE!HM99)","v":""},{"$f":"IF([1]BASE!HN99=\"\",\"\",[1]BASE!HN99)","v":1},{"$f":"IF([1]BASE!HO99=\"\",\"\",[1]BASE!HO99)","v":""},{"$f":"IF([1]BASE!HP99=\"\",\"\",[1]BASE!HP99)","v":1},{"$f":"IF([1]BASE!HQ99=\"\",\"\",[1]BASE!HQ99)","v":""},{"$f":"IF([1]BASE!HR99=\"\",\"\",[1]BASE!HR99)","v":""},{"$f":"IF([1]BASE!HS99=\"\",\"\",[1]BASE!HS99)","v":""},{"$f":"IF([1]BASE!HT99=\"\",\"\",[1]BASE!HT99)","v":""},{"$f":"IF([1]BASE!HU99=\"\",\"\",[1]BASE!HU99)","v":""},{"$f":"IF([1]BASE!HV99=\"\",\"\",[1]BASE!HV99)","v":""}]
[null,null,{"$f":"+[1]BASE!C100","v":84},{"$f":"+[1]BASE!D100","v":1382},{"$f":"+[1]BASE!E100","v":"URBANA SAN NICOLÁS - SAN NICOLAS"},{"$f":"+[1]BASE!F100","v":132},{"$f":"+[1]BASE!G100","v":6.5},{"$f":"+[1]BASE!H100","v":"C"},{"$f":"IF([1]BASE!HK100=\"\",\"\",[1]BASE!HK100)","v":""},{"$f":"IF([1]BASE!HL100=\"\",\"\",[1]BASE!HL100)","v":""},{"$f":"IF([1]BASE!HM100=\"\",\"\",[1]BASE!HM100)","v":""},{"$f":"IF([1]BASE!HN100=\"\",\"\",[1]BASE!HN100)","v":""},{"$f":"IF([1]BASE!HO100=\"\",\"\",[1]BASE!HO100)","v":""},{"$f":"IF([1]BASE!HP100=\"\",\"\",[1]BASE!HP100)","v":""},{"$f":"IF([1]BASE!HQ100=\"\",\"\",[1]BASE!HQ100)","v":""},{"$f":"IF([1]BASE!HR100=\"\",\"\",[1]BASE!HR100)","v":""},{"$f":"IF([1]BASE!HS100=\"\",\"\",[1]BASE!HS100)","v":""},{"$f":"IF([1]BASE!HT100=\"\",\"\",[1]BASE!HT100)","v":""},{"$f":"IF([1]BASE!HU100=\"\",\"\",[1]BASE!HU100)","v":""},{"$f":"IF([1]BASE!HV100=\"\",\"\",[1]BASE!HV100)","v":""}]
[null,null,{"$f":"+[1]BASE!C101","v":85},{"$f":"+[1]BASE!D101","v":1547},{"$f":"+[1]BASE!E101","v":"URBANA BB - C. PIEDRABUENA"},{"$f":"+[1]BASE!F101","v":132},{"$f":"+[1]BASE!G101","v":1.9},{"$f":"+[1]BASE!H101","v":"C"},{"$f":"IF([1]BASE!HK101=\"\",\"\",[1]BASE!HK101)","v":""},{"$f":"IF([1]BASE!HL101=\"\",\"\",[1]BASE!HL101)","v":""},{"$f":"IF([1]BASE!HM101=\"\",\"\",[1]BASE!HM101)","v":""},{"$f":"IF([1]BASE!HN101=\"\",\"\",[1]BASE!HN101)","v":""},{"$f":"IF([1]BASE!HO101=\"\",\"\",[1]BASE!HO101)","v":""},{"$f":"IF([1]BASE!HP101=\"\",\"\",[1]BASE!HP101)","v":""},{"$f":"IF([1]BASE!HQ101=\"\",\"\",[1]BASE!HQ101)","v":""},{"$f":"IF([1]BASE!HR101=\"\",\"\",[1]BASE!HR101)","v":""},{"$f":"IF([1]BASE!HS101=\"\",\"\",[1]BASE!HS101)","v":""},{"$f":"IF([1]BASE!HT101=\"\",\"\",[1]BASE!HT101)","v":""},{"$f":"IF([1]BASE!HU101=\"\",\"\",[1]BASE!HU101)","v":""},{"$f":"IF([1]BASE!HV101=\"\",\"\",[1]BASE!HV101)","v":""}]
[null,null,{"$f":"+[1]BASE!C102","v":86},{"$f":"+[1]BASE!D102","v":1445},{"$f":"+[1]BASE!E102","v":"VILLA GESELL - GRAL. MADARIAGA"},{"$f":"+[1]BASE!F102","v":132},{"$f":"+[1]BASE!G102","v":35},{"$f":"+[1]BASE!H102","v":"C"},{"$f":"IF([1]BASE!HK102=\"\",\"\",[1]BASE!HK102)","v":""},{"$f":"IF([1]BASE!HL102=\"\",\"\",[1]BASE!HL102)","v":""},{"$f":"IF([1]BASE!HM102=\"\",\"\",[1]BASE!HM102)","v":""},{"$f":"IF([1]BASE!HN102=\"\",\"\",[1]BASE!HN102)","v":""},{"$f":"IF([1]BASE!HO102=\"\",\"\",[1]BASE!HO102)","v":""},{"$f":"IF([1]BASE!HP102=\"\",\"\",[1]BASE!HP102)","v":""},{"$f":"IF([1]BASE!HQ102=\"\",\"\",[1]BASE!HQ102)","v":""},{"$f":"IF([1]BASE!HR102=\"\",\"\",[1]BASE!HR102)","v":1},{"$f":"IF([1]BASE!HS102=\"\",\"\",[1]BASE!HS102)","v":""},{"$f":"IF([1]BASE!HT102=\"\",\"\",[1]BASE!HT102)","v":""},{"$f":"IF([1]BASE!HU102=\"\",\"\",[1]BASE!HU102)","v":""},{"$f":"IF([1]BASE!HV102=\"\",\"\",[1]BASE!HV102)","v":""}]
[null,null,{"$f":"+[1]BASE!C103","v":87},{"$f":"+[1]BASE!D103","v":2715},{"$f":"+[1]BASE!E103","v":"VILLA LIA \"T\" - ANTONIO DE ARECO"},{"$f":"+[1]BASE!F103","v":132},{"$f":"+[1]BASE!G103","v":18.399999999999999},{"$f":"+[1]BASE!H103","v":"C"},{"$f":"IF([1]BASE!HK103=\"\",\"\",[1]BASE!HK103)","v":""},{"$f":"IF([1]BASE!HL103=\"\",\"\",[1]BASE!HL103)","v":""},{"$f":"IF([1]BASE!HM103=\"\",\"\",[1]BASE!HM103)","v":""},{"$f":"IF([1]BASE!HN103=\"\",\"\",[1]BASE!HN103)","v":""},{"$f":"IF([1]BASE!HO103=\"\",\"\",[1]BASE!HO103)","v":""},{"$f":"IF([1]BASE!HP103=\"\",\"\",[1]BASE!HP103)","v":""},{"$f":"IF([1]BASE!HQ103=\"\",\"\",[1]BASE!HQ103)","v":1},{"$f":"IF([1]BASE!HR103=\"\",\"\",[1]BASE!HR103)","v":""},{"$f":"IF([1]BASE!HS103=\"\",\"\",[1]BASE!HS103)","v":""},{"$f":"IF([1]BASE!HT103=\"\",\"\",[1]BASE!HT103)","v":""},{"$f":"IF([1]BASE!HU103=\"\",\"\",[1]BASE!HU103)","v":""},{"$f":"IF([1]BASE!HV103=\"\",\"\",[1]BASE!HV103)","v":""}]
[null,null,{"$f":"+[1]BASE!C104","v":88},{"$f":"+[1]BASE!D104","v":2714},{"$f":"+[1]BASE!E104","v":"VILLA LIA \"T\" - NUEVA CAMPANA"},{"$f":"+[1]BASE!F104","v":132},{"$f":"+[1]BASE!G104","v":35},{"$f":"+[1]BASE!H104","v":"C"},{"$f":"IF([1]BASE!HK104=\"\",\"\",[1]BASE!HK104)","v":""},{"$f":"IF([1]BASE!HL104=\"\",\"\",[1]BASE!HL104)","v":""},{"$f":"IF([1]BASE!HM104=\"\",\"\",[1]BASE!HM104)","v":""},{"$f":"IF([1]BASE!HN104=\"\",\"\",[1]BASE!HN104)","v":""},{"$f":"IF([1]BASE!HO104=\"\",\"\",[1]BASE!HO104)","v":""},{"$f":"IF([1]BASE!HP104=\"\",\"\",[1]BASE!HP104)","v":1},{"$f":"IF([1]BASE!HQ104=\"\",\"\",[1]BASE!HQ104)","v":""},{"$f":"IF([1]BASE!HR104=\"\",\"\",[1]BASE!HR104)","v":""},{"$f":"IF([1]BASE!HS104=\"\",\"\",[1]BASE!HS104)","v":""},{"$f":"IF([1]BASE!HT104=\"\",\"\",[1]BASE!HT104)","v":""},{"$f":"IF([1]BASE!HU104=\"\",\"\",[1]BASE!HU104)","v":""},{"$f":"IF([1]BASE!HV104=\"\",\"\",[1]BASE!HV104)","v":""}]
[null,null,{"$f":"+[1]BASE!C105","v":89},{"$f":"+[1]BASE!D105","v":2713},{"$f":"+[1]BASE!E105","v":"VILLA LIA \"T\" - VILLA LIA"},{"$f":"+[1]BASE!F105","v":132},{"$f":"+[1]BASE!G105","v":8},{"$f":"+[1]BASE!H105","v":"C"},{"$f":"IF([1]BASE!HK105=\"\",\"\",[1]BASE!HK105)","v":""},{"$f":"IF([1]BASE!HL105=\"\",\"\",[1]BASE!HL105)","v":""},{"$f":"IF([1]BASE!HM105=\"\",\"\",[1]BASE!HM105)","v":""},{"$f":"IF([1]BASE!HN105=\"\",\"\",[1]BASE!HN105)","v":""},{"$f":"IF([1]BASE!HO105=\"\",\"\",[1]BASE!HO105)","v":""},{"$f":"IF([1]BASE!HP105=\"\",\"\",[1]BASE!HP105)","v":""},{"$f":"IF([1]BASE!HQ105=\"\",\"\",[1]BASE!HQ105)","v":""},{"$f":"IF([1]BASE!HR105=\"\",\"\",[1]BASE!HR105)","v":""},{"$f":"IF([1]BASE!HS105=\"\",\"\",[1]BASE!HS105)","v":""},{"$f":"IF([1]BASE!HT105=\"\",\"\",[1]BASE!HT105)","v":""},{"$f":"IF([1]BASE!HU105=\"\",\"\",[1]BASE!HU105)","v":""},{"$f":"IF([1]BASE!HV105=\"\",\"\",[1]BASE!HV105)","v":""}]
[null,null,{"$f":"+[1]BASE!C106","v":90},{"$f":"+[1]BASE!D106","v":1424},{"$f":"+[1]BASE!E106","v":"ZARATE - ATUCHA I"},{"$f":"+[1]BASE!F106","v":132},{"$f":"+[1]BASE!G106","v":22.1},{"$f":"+[1]BASE!H106","v":"C"},{"$f":"IF([1]BASE!HK106=\"\",\"\",[1]BASE!HK106)","v":""},{"$f":"IF([1]BASE!HL106=\"\",\"\",[1]BASE!HL106)","v":""},{"$f":"IF([1]BASE!HM106=\"\",\"\",[1]BASE!HM106)","v":""},{"$f":"IF([1]BASE!HN106=\"\",\"\",[1]BASE!HN106)","v":1},{"$f":"IF([1]BASE!HO106=\"\",\"\",[1]BASE!HO106)","v":""},{"$f":"IF([1]BASE!HP106=\"\",\"\",[1]BASE!HP106)","v":""},{"$f":"IF([1]BASE!HQ106=\"\",\"\",[1]BASE!HQ106)","v":""},{"$f":"IF([1]BASE!HR106=\"\",\"\",[1]BASE!HR106)","v":""},{"$f":"IF([1]BASE!HS106=\"\",\"\",[1]BASE!HS106)","v":""},{"$f":"IF([1]BASE!HT106=\"\",\"\",[1]BASE!HT106)","v":""},{"$f":"IF([1]BASE!HU106=\"\",\"\",[1]BASE!HU106)","v":""},{"$f":"IF([1]BASE!HV106=\"\",\"\",[1]BASE!HV106)","v":""}]
[null,null,{"$f":"+[1]BASE!C107","v":91},{"$f":"+[1]BASE!D107","v":2955},{"$f":"+[1]BASE!E107","v":"ZARATE - EASTMAN T"},{"$f":"+[1]BASE!F107","v":132},{"$f":"+[1]BASE!G107","v":11},{"$f":"+[1]BASE!H107","v":"C"},{"$f":"IF([1]BASE!HK107=\"\",\"\",[1]BASE!HK107)","v":"XXXX"},{"$f":"IF([1]BASE!HL107=\"\",\"\",[1]BASE!HL107)","v":"XXXX"},{"$f":"IF([1]BASE!HM107=\"\",\"\",[1]BASE!HM107)","v":"XXXX"},{"$f":"IF([1]BASE!HN107=\"\",\"\",[1]BASE!HN107)","v":"XXXX"},{"$f":"IF([1]BASE!HO107=\"\",\"\",[1]BASE!HO107)","v":"XXXX"},{"$f":"IF([1]BASE!HP107=\"\",\"\",[1]BASE!HP107)","v":"XXXX"},{"$f":"IF([1]BASE!HQ107=\"\",\"\",[1]BASE!HQ107)","v":"XXXX"},{"$f":"IF([1]BASE!HR107=\"\",\"\",[1]BASE!HR107)","v":"XXXX"},{"$f":"IF([1]BASE!HS107=\"\",\"\",[1]BASE!HS107)","v":"XXXX"},{"$f":"IF([1]BASE!HT107=\"\",\"\",[1]BASE!HT107)","v":"XXXX"},{"$f":"IF([1]BASE!HU107=\"\",\"\",[1]BASE!HU107)","v":"XXXX"},{"$f":"IF([1]BASE!HV107=\"\",\"\",[1]BASE!HV107)","v":"XXXX"}]
[null,null,{"$f":"+[1]BASE!C108","v":92},{"$f":"+[1]BASE!D108","v":1423},{"$f":"+[1]BASE!E108","v":"ZARATE - MATHEU"},{"$f":"+[1]BASE!F108","v":132},{"$f":"+[1]BASE!G108","v":37.700000000000003},{"$f":"+[1]BASE!H108","v":"C"},{"$f":"IF([1]BASE!HK108=\"\",\"\",[1]BASE!HK108)","v":"XXXX"},{"$f":"IF([1]BASE!HL108=\"\",\"\",[1]BASE!HL108)","v":"XXXX"},{"$f":"IF([1]BASE!HM108=\"\",\"\",[1]BASE!HM108)","v":"XXXX"},{"$f":"IF([1]BASE!HN108=\"\",\"\",[1]BASE!HN108)","v":"XXXX"},{"$f":"IF([1]BASE!HO108=\"\",\"\",[1]BASE!HO108)","v":"XXXX"},{"$f":"IF([1]BASE!HP108=\"\",\"\",[1]BASE!HP108)","v":"XXXX"},{"$f":"IF([1]BASE!HQ108=\"\",\"\",[1]BASE!HQ108)","v":"XXXX"},{"$f":"IF([1]BASE!HR108=\"\",\"\",[1]BASE!HR108)","v":"XXXX"},{"$f":"IF([1]BASE!HS108=\"\",\"\",[1]BASE!HS108)","v":"XXXX"},{"$f":"IF([1]BASE!HT108=\"\",\"\",[1]BASE!HT108)","v":"XXXX"},{"$f":"IF([1]BASE!HU108=\"\",\"\",[1]BASE!HU108)","v":"XXXX"},{"$f":"IF([1]BASE!HV108=\"\",\"\",[1]BASE!HV108)","v":"XXXX"}]
[null,null,{"$f":"+[1]BASE!C109","v":93},{"$f":"+[1]BASE!D109","v":1434},{"$f":"+[1]BASE!E109","v":"9 DE JULIO 66 - BRAGADO"},{"$f":"+[1]BASE!F109","v":66},{"$f":"+[1]BASE!G109","v":60.94},{"$f":"+[1]BASE!H109","v":"C"},{"$f":"IF([1]BASE!HK109=\"\",\"\",[1]BASE!HK109)","v":"XXXX"},{"$f":"IF([1]BASE!HL109=\"\",\"\",[1]BASE!HL109)","v":"XXXX"},{"$f":"IF([1]BASE!HM109=\"\",\"\",[1]BASE!HM109)","v":"XXXX"},{"$f":"IF([1]BASE!HN109=\"\",\"\",[1]BASE!HN109)","v":"XXXX"},{"$f":"IF([1]BASE!HO109=\"\",\"\",[1]BASE!HO109)","v":"XXXX"},{"$f":"IF([1]BASE!HP109=\"\",\"\",[1]BASE!HP109)","v":"XXXX"},{"$f":"IF([1]BASE!HQ109=\"\",\"\",[1]BASE!HQ109)","v":"XXXX"},{"$f":"IF([1]BASE!HR109=\"\",\"\",[1]BASE!HR109)","v":"XXXX"},{"$f":"IF([1]BASE!HS109=\"\",\"\",[1]BASE!HS109)","v":"XXXX"},{"$f":"IF([1]BASE!HT109=\"\",\"\",[1]BASE!HT109)","v":"XXXX"},{"$f":"IF([1]BASE!HU109=\"\",\"\",[1]BASE!HU109)","v":"XXXX"},{"$f":"IF([1]BASE!HV109=\"\",\"\",[1]BASE!HV109)","v":"XXXX"}]
[null,null,{"$f":"+[1]BASE!C110","v":94},{"$f":"+[1]BASE!D110","v":"CE-000"},{"$f":"+[1]BASE!E110","v":"CAP. SARMIENTO - ANTONIO DE ARECO - LUJAN"},{"$f":"+[1]BASE!F110","v":66},{"$f":"+[1]BASE!G110","v":81.3},{"$f":"+[1]BASE!H110","v":"C"},{"$f":"IF([1]BASE!HK110=\"\",\"\",[1]BASE!HK110)","v":"XXXX"},{"$f":"IF([1]BASE!HL110=\"\",\"\",[1]BASE!HL110)","v":"XXXX"},{"$f":"IF([1]BASE!HM110=\"\",\"\",[1]BASE!HM110)","v":"XXXX"},{"$f":"IF([1]BASE!HN110=\"\",\"\",[1]BASE!HN110)","v":"XXXX"},{"$f":"IF([1]BASE!HO110=\"\",\"\",[1]BASE!HO110)","v":"XXXX"},{"$f":"IF([1]BASE!HP110=\"\",\"\",[1]BASE!HP110)","v":"XXXX"},{"$f":"IF([1]BASE!HQ110=\"\",\"\",[1]BASE!HQ110)","v":"XXXX"},{"$f":"IF([1]BASE!HR110=\"\",\"\",[1]BASE!HR110)","v":"XXXX"},{"$f":"IF([1]BASE!HS110=\"\",\"\",[1]BASE!HS110)","v":"XXXX"},{"$f":"IF([1]BASE!HT110=\"\",\"\",[1]BASE!HT110)","v":"XXXX"},{"$f":"IF([1]BASE!HU110=\"\",\"\",[1]BASE!HU110)","v":"XXXX"},{"$f":"IF([1]BASE!HV110=\"\",\"\",[1]BASE!HV110)","v":"XXXX"}]
[null,null,{"$f":"+[1]BASE!C111","v":95},{"$f":"+[1]BASE!D111","v":1421},{"$f":"+[1]BASE!E111","v":"ARRECIFES - CAP. SARMIENTO"},{"$f":"+[1]BASE!F111","v":66},{"$f":"+[1]BASE!G111","v":31.9},{"$f":"+[1]BASE!H111","v":"C"},{"$f":"IF([1]BASE!HK111=\"\",\"\",[1]BASE!HK111)","v":""},{"$f":"IF([1]BASE!HL111=\"\",\"\",[1]BASE!HL111)","v":""},{"$f":"IF([1]BASE!HM111=\"\",\"\",[1]BASE!HM111)","v":""},{"$f":"IF([1]BASE!HN111=\"\",\"\",[1]BASE!HN111)","v":""},{"$f":"IF([1]BASE!HO111=\"\",\"\",[1]BASE!HO111)","v":""},{"$f":"IF([1]BASE!HP111=\"\",\"\",[1]BASE!HP111)","v":""},{"$f":"IF([1]BASE!HQ111=\"\",\"\",[1]BASE!HQ111)","v":""},{"$f":"IF([1]BASE!HR111=\"\",\"\",[1]BASE!HR111)","v":""},{"$f":"IF([1]BASE!HS111=\"\",\"\",[1]BASE!HS111)","v":1},{"$f":"IF([1]BASE!HT111=\"\",\"\",[1]BASE!HT111)","v":""},{"$f":"IF([1]BASE!HU111=\"\",\"\",[1]BASE!HU111)","v":""},{"$f":"IF([1]BASE!HV111=\"\",\"\",[1]BASE!HV111)","v":""}]
[null,null,{"$f":"+[1]BASE!C112","v":96},{"$f":"+[1]BASE!D112","v":1536},{"$f":"+[1]BASE!E112","v":"CARLOS CASARES - 9 DE JULIO 66"},{"$f":"+[1]BASE!F112","v":66},{"$f":"+[1]BASE!G112","v":46.8},{"$f":"+[1]BASE!H112","v":"C"},{"$f":"IF([1]BASE!HK112=\"\",\"\",[1]BASE!HK112)","v":""},{"$f":"IF([1]BASE!HL112=\"\",\"\",[1]BASE!HL112)","v":""},{"$f":"IF([1]BASE!HM112=\"\",\"\",[1]BASE!HM112)","v":1},{"$f":"IF([1]BASE!HN112=\"\",\"\",[1]BASE!HN112)","v":2},{"$f":"IF([1]BASE!HO112=\"\",\"\",[1]BASE!HO112)","v":""},{"$f":"IF([1]BASE!HP112=\"\",\"\",[1]BASE!HP112)","v":""},{"$f":"IF([1]BASE!HQ112=\"\",\"\",[1]BASE!HQ112)","v":""},{"$f":"IF([1]BASE!HR112=\"\",\"\",[1]BASE!HR112)","v":1},{"$f":"IF([1]BASE!HS112=\"\",\"\",[1]BASE!HS112)","v":""},{"$f":"IF([1]BASE!HT112=\"\",\"\",[1]BASE!HT112)","v":""},{"$f":"IF([1]BASE!HU112=\"\",\"\",[1]BASE!HU112)","v":""},{"$f":"IF([1]BASE!HV112=\"\",\"\",[1]BASE!HV112)","v":""}]
[null,null,{"$f":"+[1]BASE!C113","v":97},{"$f":"+[1]BASE!D113","v":1530},{"$f":"+[1]BASE!E113","v":"PEHUAJO - CARLOS CASARES"},{"$f":"+[1]BASE!F113","v":66},{"$f":"+[1]BASE!G113","v":53.1},{"$f":"+[1]BASE!H113","v":"C"},{"$f":"IF([1]BASE!HK113=\"\",\"\",[1]BASE!HK113)","v":""},{"$f":"IF([1]BASE!HL113=\"\",\"\",[1]BASE!HL113)","v":""},{"$f":"IF([1]BASE!HM113=\"\",\"\",[1]BASE!HM113)","v":""},{"$f":"IF([1]BASE!HN113=\"\",\"\",[1]BASE!HN113)","v":""},{"$f":"IF([1]BASE!HO113=\"\",\"\",[1]BASE!HO113)","v":""},{"$f":"IF([1]BASE!HP113=\"\",\"\",[1]BASE!HP113)","v":""},{"$f":"IF([1]BASE!HQ113=\"\",\"\",[1]BASE!HQ113)","v":""},{"$f":"IF([1]BASE!HR113=\"\",\"\",[1]BASE!HR113)","v":""},{"$f":"IF([1]BASE!HS113=\"\",\"\",[1]BASE!HS113)","v":""},{"$f":"IF([1]BASE!HT113=\"\",\"\",[1]BASE!HT113)","v":""},{"$f":"IF([1]BASE!HU113=\"\",\"\",[1]BASE!HU113)","v":""},{"$f":"IF([1]BASE!HV113=\"\",\"\",[1]BASE!HV113)","v":""}]
[null,null,{"$f":"+[1]BASE!C114","v":98},{"$f":"+[1]BASE!D114","v":1441},{"$f":"+[1]BASE!E114","v":"PERGAMINO - ARRECIFES"},{"$f":"+[1]BASE!F114","v":66},{"$f":"+[1]BASE!G114","v":43.8},{"$f":"+[1]BASE!H114","v":"B"},{"$f":"IF([1]BASE!HK114=\"\",\"\",[1]BASE!HK114)","v":""},{"$f":"IF([1]BASE!HL114=\"\",\"\",[1]BASE!HL114)","v":""},{"$f":"IF([1]BASE!HM114=\"\",\"\",[1]BASE!HM114)","v":1},{"$f":"IF([1]BASE!HN114=\"\",\"\",[1]BASE!HN114)","v":1},{"$f":"IF([1]BASE!HO114=\"\",\"\",[1]BASE!HO114)","v":""},{"$f":"IF([1]BASE!HP114=\"\",\"\",[1]BASE!HP114)","v":""},{"$f":"IF([1]BASE!HQ114=\"\",\"\",[1]BASE!HQ114)","v":""},{"$f":"IF([1]BASE!HR114=\"\",\"\",[1]BASE!HR114)","v":""},{"$f":"IF([1]BASE!HS114=\"\",\"\",[1]BASE!HS114)","v":""},{"$f":"IF([1]BASE!HT114=\"\",\"\",[1]BASE!HT114)","v":""},{"$f":"IF([1]BASE!HU114=\"\",\"\",[1]BASE!HU114)","v":""},{"$f":"IF([1]BASE!HV114=\"\",\"\",[1]BASE!HV114)","v":""}]
[null,null,{"$f":"+[1]BASE!C115","v":99},{"$f":"+[1]BASE!D115","v":1436},{"$f":"+[1]BASE!E115","v":"TRENQUE LAUQUEN - PEHUAJO"},{"$f":"+[1]BASE!F115","v":66},{"$f":"+[1]BASE!G115","v":80.099999999999994},{"$f":"+[1]BASE!H115","v":"B"},{"$f":"IF([1]BASE!HK115=\"\",\"\",[1]BASE!HK115)","v":""},{"$f":"IF([1]BASE!HL115=\"\",\"\",[1]BASE!HL115)","v":""},{"$f":"IF([1]BASE!HM115=\"\",\"\",[1]BASE!HM115)","v":""},{"$f":"IF([1]BASE!HN115=\"\",\"\",[1]BASE!HN115)","v":""},{"$f":"IF([1]BASE!HO115=\"\",\"\",[1]BASE!HO115)","v":""},{"$f":"IF([1]BASE!HP115=\"\",\"\",[1]BASE!HP115)","v":""},{"$f":"IF([1]BASE!HQ115=\"\",\"\",[1]BASE!HQ115)","v":""},{"$f":"IF([1]BASE!HR115=\"\",\"\",[1]BASE!HR115)","v":""},{"$f":"IF([1]BASE!HS115=\"\",\"\",[1]BASE!HS115)","v":""},{"$f":"IF([1]BASE!HT115=\"\",\"\",[1]BASE!HT115)","v":""},{"$f":"IF([1]BASE!HU115=\"\",\"\",[1]BASE!HU115)","v":""},{"$f":"IF([1]BASE!HV115=\"\",\"\",[1]BASE!HV115)","v":1}]
[null,null,{"$f":"+[1]BASE!C116","v":100},{"$f":"+[1]BASE!D116","v":3556},{"$f":"+[1]BASE!E116","v":"NUEVA CAMPANA - MINETTI (CORCEMAR)"},{"$f":"+[1]BASE!F116","v":132},{"$f":"+[1]BASE!G116","v":5},{"$f":"+[1]BASE!H116","v":"C"},{"$f":"IF([1]BASE!HK116=\"\",\"\",[1]BASE!HK116)","v":""},{"$f":"IF([1]BASE!HL116=\"\",\"\",[1]BASE!HL116)","v":""},{"$f":"IF([1]BASE!HM116=\"\",\"\",[1]BASE!HM116)","v":""},{"$f":"IF([1]BASE!HN116=\"\",\"\",[1]BASE!HN116)","v":""},{"$f":"IF([1]BASE!HO116=\"\",\"\",[1]BASE!HO116)","v":""},{"$f":"IF([1]BASE!HP116=\"\",\"\",[1]BASE!HP116)","v":""},{"$f":"IF([1]BASE!HQ116=\"\",\"\",[1]BASE!HQ116)","v":""},{"$f":"IF([1]BASE!HR116=\"\",\"\",[1]BASE!HR116)","v":""},{"$f":"IF([1]BASE!HS116=\"\",\"\",[1]BASE!HS116)","v":""},{"$f":"IF([1]BASE!HT116=\"\",\"\",[1]BASE!HT116)","v":""},{"$f":"IF([1]BASE!HU116=\"\",\"\",[1]BASE!HU116)","v":""},{"$f":"IF([1]BASE!HV116=\"\",\"\",[1]BASE!HV116)","v":""}]
[null,null,{"$f":"+[1]BASE!C117","v":101},{"$f":"+[1]BASE!D117","v":3557},{"$f":"+[1]BASE!E117","v":"(CORCEMAR) MINETTI - ZARATE"},{"$f":"+[1]BASE!F117","v":132},{"$f":"+[1]BASE!G117","v":7},{"$f":"+[1]BASE!H117","v":"C"},{"$f":"IF([1]BASE!HK117=\"\",\"\",[1]BASE!HK117)","v":""},{"$f":"IF([1]BASE!HL117=\"\",\"\",[1]BASE!HL117)","v":""},{"$f":"IF([1]BASE!HM117=\"\",\"\",[1]BASE!HM117)","v":""},{"$f":"IF([1]BASE!HN117=\"\",\"\",[1]BASE!HN117)","v":""},{"$f":"IF([1]BASE!HO117=\"\",\"\",[1]BASE!HO117)","v":""},{"$f":"IF([1]BASE!HP117=\"\",\"\",[1]BASE!HP117)","v":""},{"$f":"IF([1]BASE!HQ117=\"\",\"\",[1]BASE!HQ117)","v":""},{"$f":"IF([1]BASE!HR117=\"\",\"\",[1]BASE!HR117)","v":""},{"$f":"IF([1]BASE!HS117=\"\",\"\",[1]BASE!HS117)","v":""},{"$f":"IF([1]BASE!HT117=\"\",\"\",[1]BASE!HT117)","v":""},{"$f":"IF([1]BASE!HU117=\"\",\"\",[1]BASE!HU117)","v":""},{"$f":"IF([1]BASE!HV117=\"\",\"\",[1]BASE!HV117)","v":""}]
[null,null,{"$f":"+[1]BASE!C118","v":102},{"$f":"+[1]BASE!D118","v":3285},{"$f":"+[1]BASE!E118","v":"EASTMAN T - PROTISA"},{"$f":"+[1]BASE!F118","v":132},{"$f":"+[1]BASE!G118","v":5.5},{"$f":"+[1]BASE!H118","v":"C"},{"$f":"IF([1]BASE!HK118=\"\",\"\",[1]BASE!HK118)","v":"XXXX"},{"$f":"IF([1]BASE!HL118=\"\",\"\",[1]BASE!HL118)","v":"XXXX"},{"$f":"IF([1]BASE!HM118=\"\",\"\",[1]BASE!HM118)","v":"XXXX"},{"$f":"IF([1]BASE!HN118=\"\",\"\",[1]BASE!HN118)","v":"XXXX"},{"$f":"IF([1]BASE!HO118=\"\",\"\",[1]BASE!HO118)","v":"XXXX"},{"$f":"IF([1]BASE!HP118=\"\",\"\",[1]BASE!HP118)","v":"XXXX"},{"$f":"IF([1]BASE!HQ118=\"\",\"\",[1]BASE!HQ118)","v":"XXXX"},{"$f":"IF([1]BASE!HR118=\"\",\"\",[1]BASE!HR118)","v":"XXXX"},{"$f":"IF([1]BASE!HS118=\"\",\"\",[1]BASE!HS118)","v":"XXXX"},{"$f":"IF([1]BASE!HT118=\"\",\"\",[1]BASE!HT118)","v":"XXXX"},{"$f":"IF([1]BASE!HU118=\"\",\"\",[1]BASE!HU118)","v":"XXXX"},{"$f":"IF([1]BASE!HV118=\"\",\"\",[1]BASE!HV118)","v":"XXXX"}]
[null,null,{"$f":"+[1]BASE!C119","v":103},{"$f":"+[1]BASE!D119","v":3286},{"$f":"+[1]BASE!E119","v":"PROTISA - EASTMAN"},{"$f":"+[1]BASE!F119","v":132},{"$f":"+[1]BASE!G119","v":1},{"$f":"+[1]BASE!H119","v":"C"},{"$f":"IF([1]BASE!HK119=\"\",\"\",[1]BASE!HK119)","v":""},{"$f":"IF([1]BASE!HL119=\"\",\"\",[1]BASE!HL119)","v":""},{"$f":"IF([1]BASE!HM119=\"\",\"\",[1]BASE!HM119)","v":""},{"$f":"IF([1]BASE!HN119=\"\",\"\",[1]BASE!HN119)","v":""},{"$f":"IF([1]BASE!HO119=\"\",\"\",[1]BASE!HO119)","v":""},{"$f":"IF([1]BASE!HP119=\"\",\"\",[1]BASE!HP119)","v":""},{"$f":"IF([1]BASE!HQ119=\"\",\"\",[1]BASE!HQ119)","v":""},{"$f":"IF([1]BASE!HR119=\"\",\"\",[1]BASE!HR119)","v":""},{"$f":"IF([1]BASE!HS119=\"\",\"\",[1]BASE!HS119)","v":""},{"$f":"IF([1]BASE!HT119=\"\",\"\",[1]BASE!HT119)","v":""},{"$f":"IF([1]BASE!HU119=\"\",\"\",[1]BASE!HU119)","v":""},{"$f":"IF([1]BASE!HV119=\"\",\"\",[1]BASE!HV119)","v":""}]
[null,null,{"$f":"+[1]BASE!C120","v":104},{"$f":"+[1]BASE!D120","v":3482},{"$f":"+[1]BASE!E120","v":"BAHIA BLANCA - PETROQ. BAHIA BLANCA 2"},{"$f":"+[1]BASE!F120","v":132},{"$f":"+[1]BASE!G120","v":29.8},{"$f":"+[1]BASE!H120","v":"C"},{"$f":"IF([1]BASE!HK120=\"\",\"\",[1]BASE!HK120)","v":""},{"$f":"IF([1]BASE!HL120=\"\",\"\",[1]BASE!HL120)","v":""},{"$f":"IF([1]BASE!HM120=\"\",\"\",[1]BASE!HM120)","v":""},{"$f":"IF([1]BASE!HN120=\"\",\"\",[1]BASE!HN120)","v":""},{"$f":"IF([1]BASE!HO120=\"\",\"\",[1]BASE!HO120)","v":""},{"$f":"IF([1]BASE!HP120=\"\",\"\",[1]BASE!HP120)","v":""},{"$f":"IF([1]BASE!HQ120=\"\",\"\",[1]BASE!HQ120)","v":""},{"$f":"IF([1]BASE!HR120=\"\",\"\",[1]BASE!HR120)","v":""},{"$f":"IF([1]BASE!HS120=\"\",\"\",[1]BASE!HS120)","v":""},{"$f":"IF([1]BASE!HT120=\"\",\"\",[1]BASE!HT120)","v":""},{"$f":"IF([1]BASE!HU120=\"\",\"\",[1]BASE!HU120)","v":""},{"$f":"IF([1]BASE!HV120=\"\",\"\",[1]BASE!HV120)","v":""}]
[null,null,{"$f":"+[1]BASE!C121","v":105},{"$f":"+[1]BASE!D121","v":3483},{"$f":"+[1]BASE!E121","v":"BAHIA BLANCA - PETROQ. BAHIA BLANCA 3"},{"$f":"+[1]BASE!F121","v":132},{"$f":"+[1]BASE!G121","v":29.8},{"$f":"+[1]BASE!H121","v":"C"},{"$f":"IF([1]BASE!HK121=\"\",\"\",[1]BASE!HK121)","v":""},{"$f":"IF([1]BASE!HL121=\"\",\"\",[1]BASE!HL121)","v":""},{"$f":"IF([1]BASE!HM121=\"\",\"\",[1]BASE!HM121)","v":""},{"$f":"IF([1]BASE!HN121=\"\",\"\",[1]BASE!HN121)","v":""},{"$f":"IF([1]BASE!HO121=\"\",\"\",[1]BASE!HO121)","v":""},{"$f":"IF([1]BASE!HP121=\"\",\"\",[1]BASE!HP121)","v":""},{"$f":"IF([1]BASE!HQ121=\"\",\"\",[1]BASE!HQ121)","v":""},{"$f":"IF([1]BASE!HR121=\"\",\"\",[1]BASE!HR121)","v":""},{"$f":"IF([1]BASE!HS121=\"\",\"\",[1]BASE!HS121)","v":""},{"$f":"IF([1]BASE!HT121=\"\",\"\",[1]BASE!HT121)","v":""},{"$f":"IF([1]BASE!HU121=\"\",\"\",[1]BASE!HU121)","v":""},{"$f":"IF([1]BASE!HV121=\"\",\"\",[1]BASE!HV121)","v":""}]
[null,null,{"$f":"+[1]BASE!C122","v":106},{"$f":"+[1]BASE!D122","v":3541},{"$f":"+[1]BASE!E122","v":"PETROQ. BAHIA BLANCA - PROFERTIL"},{"$f":"+[1]BASE!F122","v":132},{"$f":"+[1]BASE!G122","v":1.8},{"$f":"+[1]BASE!H122","v":"C"},{"$f":"IF([1]BASE!HK122=\"\",\"\",[1]BASE!HK122)","v":""},{"$f":"IF([1]BASE!HL122=\"\",\"\",[1]BASE!HL122)","v":""},{"$f":"IF([1]BASE!HM122=\"\",\"\",[1]BASE!HM122)","v":""},{"$f":"IF([1]BASE!HN122=\"\",\"\",[1]BASE!HN122)","v":""},{"$f":"IF([1]BASE!HO122=\"\",\"\",[1]BASE!HO122)","v":""},{"$f":"IF([1]BASE!HP122=\"\",\"\",[1]BASE!HP122)","v":""},{"$f":"IF([1]BASE!HQ122=\"\",\"\",[1]BASE!HQ122)","v":""},{"$f":"IF([1]BASE!HR122=\"\",\"\",[1]BASE!HR122)","v":""},{"$f":"IF([1]BASE!HS122=\"\",\"\",[1]BASE!HS122)","v":""},{"$f":"IF([1]BASE!HT122=\"\",\"\",[1]BASE!HT122)","v":""},{"$f":"IF([1]BASE!HU122=\"\",\"\",[1]BASE!HU122)","v":""},{"$f":"IF([1]BASE!HV122=\"\",\"\",[1]BASE!HV122)","v":""}]
[null,null,{"$f":"+[1]BASE!C123","v":107},{"$f":"+[1]BASE!D123","v":3575},{"$f":"+[1]BASE!E123","v":"NUEVA CAMPANA - PRAXAIR"},{"$f":"+[1]BASE!F123","v":132},{"$f":"+[1]BASE!G123","v":6.1},{"$f":"+[1]BASE!H123","v":"C"},{"$f":"IF([1]BASE!HK123=\"\",\"\",[1]BASE!HK123)","v":""},{"$f":"IF([1]BASE!HL123=\"\",\"\",[1]BASE!HL123)","v":""},{"$f":"IF([1]BASE!HM123=\"\",\"\",[1]BASE!HM123)","v":""},{"$f":"IF([1]BASE!HN123=\"\",\"\",[1]BASE!HN123)","v":""},{"$f":"IF([1]BASE!HO123=\"\",\"\",[1]BASE!HO123)","v":""},{"$f":"IF([1]BASE!HP123=\"\",\"\",[1]BASE!HP123)","v":""},{"$f":"IF([1]BASE!HQ123=\"\",\"\",[1]BASE!HQ123)","v":""},{"$f":"IF([1]BASE!HR123=\"\",\"\",[1]BASE!HR123)","v":""},{"$f":"IF([1]BASE!HS123=\"\",\"\",[1]BASE!HS123)","v":""},{"$f":"IF([1]BASE!HT123=\"\",\"\",[1]BASE!HT123)","v":""},{"$f":"IF([1]BASE!HU123=\"\",\"\",[1]BASE!HU123)","v":""},{"$f":"IF([1]BASE!HV123=\"\",\"\",[1]BASE!HV123)","v":""}]
[null,null,{"$f":"+[1]BASE!C124","v":108},{"$f":"+[1]BASE!D124","v":3576},{"$f":"+[1]BASE!E124","v":"PRAXAIR - CAMPANA"},{"$f":"+[1]BASE!F124","v":132},{"$f":"+[1]BASE!G124","v":1.1000000000000001},{"$f":"+[1]BASE!H124","v":"C"},{"$f":"IF([1]BASE!HK124=\"\",\"\",[1]BASE!HK124)","v":""},{"$f":"IF([1]BASE!HL124=\"\",\"\",[1]BASE!HL124)","v":""},{"$f":"IF([1]BASE!HM124=\"\",\"\",[1]BASE!HM124)","v":""},{"$f":"IF([1]BASE!HN124=\"\",\"\",[1]BASE!HN124)","v":""},{"$f":"IF([1]BASE!HO124=\"\",\"\",[1]BASE!HO124)","v":""},{"$f":"IF([1]BASE!HP124=\"\",\"\",[1]BASE!HP124)","v":""},{"$f":"IF([1]BASE!HQ124=\"\",\"\",[1]BASE!HQ124)","v":""},{"$f":"IF([1]BASE!HR124=\"\",\"\",[1]BASE!HR124)","v":""},{"$f":"IF([1]BASE!HS124=\"\",\"\",[1]BASE!HS124)","v":""},{"$f":"IF([1]BASE!HT124=\"\",\"\",[1]BASE!HT124)","v":""},{"$f":"IF([1]BASE!HU124=\"\",\"\",[1]BASE!HU124)","v":""},{"$f":"IF([1]BASE!HV124=\"\",\"\",[1]BASE!HV124)","v":""}]
[null,null,{"$f":"+[1]BASE!C125","v":109},{"$f":"+[1]BASE!D125","v":3596},{"$f":"+[1]BASE!E125","v":"PUNTA ALTA - CORONEL ROSALES"},{"$f":"+[1]BASE!F125","v":132},{"$f":"+[1]BASE!G125","v":4.0999999999999996},{"$f":"+[1]BASE!H125","v":"C"},{"$f":"IF([1]BASE!HK125=\"\",\"\",[1]BASE!HK125)","v":""},{"$f":"IF([1]BASE!HL125=\"\",\"\",[1]BASE!HL125)","v":""},{"$f":"IF([1]BASE!HM125=\"\",\"\",[1]BASE!HM125)","v":""},{"$f":"IF([1]BASE!HN125=\"\",\"\",[1]BASE!HN125)","v":""},{"$f":"IF([1]BASE!HO125=\"\",\"\",[1]BASE!HO125)","v":""},{"$f":"IF([1]BASE!HP125=\"\",\"\",[1]BASE!HP125)","v":""},{"$f":"IF([1]BASE!HQ125=\"\",\"\",[1]BASE!HQ125)","v":""},{"$f":"IF([1]BASE!HR125=\"\",\"\",[1]BASE!HR125)","v":""},{"$f":"IF([1]BASE!HS125=\"\",\"\",[1]BASE!HS125)","v":""},{"$f":"IF([1]BASE!HT125=\"\",\"\",[1]BASE!HT125)","v":""},{"$f":"IF([1]BASE!HU125=\"\",\"\",[1]BASE!HU125)","v":""},{"$f":"IF([1]BASE!HV125=\"\",\"\",[1]BASE!HV125)","v":""}]
[null,null,{"$f":"+[1]BASE!C126","v":110},{"$f":"+[1]BASE!D126","v":3535},{"$f":"+[1]BASE!E126","v":"PAPEL PRENSA - BARADERO"},{"$f":"+[1]BASE!F126","v":132},{"$f":"+[1]BASE!G126","v":24},{"$f":"+[1]BASE!H126","v":"C"},{"$f":"IF([1]BASE!HK126=\"\",\"\",[1]BASE!HK126)","v":""},{"$f":"IF([1]BASE!HL126=\"\",\"\",[1]BASE!HL126)","v":""},{"$f":"IF([1]BASE!HM126=\"\",\"\",[1]BASE!HM126)","v":""},{"$f":"IF([1]BASE!HN126=\"\",\"\",[1]BASE!HN126)","v":""},{"$f":"IF([1]BASE!HO126=\"\",\"\",[1]BASE!HO126)","v":""},{"$f":"IF([1]BASE!HP126=\"\",\"\",[1]BASE!HP126)","v":""},{"$f":"IF([1]BASE!HQ126=\"\",\"\",[1]BASE!HQ126)","v":""},{"$f":"IF([1]BASE!HR126=\"\",\"\",[1]BASE!HR126)","v":""},{"$f":"IF([1]BASE!HS126=\"\",\"\",[1]BASE!HS126)","v":1},{"$f":"IF([1]BASE!HT126=\"\",\"\",[1]BASE!HT126)","v":""},{"$f":"IF([1]BASE!HU126=\"\",\"\",[1]BASE!HU126)","v":""},{"$f":"IF([1]BASE!HV126=\"\",\"\",[1]BASE!HV126)","v":""}]
[null,null,{"$f":"+[1]BASE!C127","v":111},{"$f":"+[1]BASE!D127","v":3715},{"$f":"+[1]BASE!E127","v":"SALTO BA - CHACABUCO"},{"$f":"+[1]BASE!F127","v":132},{"$f":"+[1]BASE!G127","v":60.1},{"$f":"+[1]BASE!H127","v":"C"},{"$f":"IF([1]BASE!HK127=\"\",\"\",[1]BASE!HK127)","v":"XXXX"},{"$f":"IF([1]BASE!HL127=\"\",\"\",[1]BASE!HL127)","v":"XXXX"},{"$f":"IF([1]BASE!HM127=\"\",\"\",[1]BASE!HM127)","v":"XXXX"},{"$f":"IF([1]BASE!HN127=\"\",\"\",[1]BASE!HN127)","v":"XXXX"},{"$f":"IF([1]BASE!HO127=\"\",\"\",[1]BASE!HO127)","v":"XXXX"},{"$f":"IF([1]BASE!HP127=\"\",\"\",[1]BASE!HP127)","v":"XXXX"},{"$f":"IF([1]BASE!HQ127=\"\",\"\",[1]BASE!HQ127)","v":"XXXX"},{"$f":"IF([1]BASE!HR127=\"\",\"\",[1]BASE!HR127)","v":"XXXX"},{"$f":"IF([1]BASE!HS127=\"\",\"\",[1]BASE!HS127)","v":"XXXX"},{"$f":"IF([1]BASE!HT127=\"\",\"\",[1]BASE!HT127)","v":"XXXX"},{"$f":"IF([1]BASE!HU127=\"\",\"\",[1]BASE!HU127)","v":"XXXX"},{"$f":"IF([1]BASE!HV127=\"\",\"\",[1]BASE!HV127)","v":"XXXX"}]
[null,null,{"$f":"+[1]BASE!C128","v":112},{"$f":"+[1]BASE!D128","v":3689},{"$f":"+[1]BASE!E128","v":"LA PAMPITA - LAPRIDA"},{"$f":"+[1]BASE!F128","v":132},{"$f":"+[1]BASE!G128","v":72.2},{"$f":"+[1]BASE!H128","v":"C"},{"$f":"IF([1]BASE!HK128=\"\",\"\",[1]BASE!HK128)","v":""},{"$f":"IF([1]BASE!HL128=\"\",\"\",[1]BASE!HL128)","v":""},{"$f":"IF([1]BASE!HM128=\"\",\"\",[1]BASE!HM128)","v":""},{"$f":"IF([1]BASE!HN128=\"\",\"\",[1]BASE!HN128)","v":""},{"$f":"IF([1]BASE!HO128=\"\",\"\",[1]BASE!HO128)","v":""},{"$f":"IF([1]BASE!HP128=\"\",\"\",[1]BASE!HP128)","v":""},{"$f":"IF([1]BASE!HQ128=\"\",\"\",[1]BASE!HQ128)","v":""},{"$f":"IF([1]BASE!HR128=\"\",\"\",[1]BASE!HR128)","v":""},{"$f":"IF([1]BASE!HS128=\"\",\"\",[1]BASE!HS128)","v":1},{"$f":"IF([1]BASE!HT128=\"\",\"\",[1]BASE!HT128)","v":""},{"$f":"IF([1]BASE!HU128=\"\",\"\",[1]BASE!HU128)","v":""},{"$f":"IF([1]BASE!HV128=\"\",\"\",[1]BASE!HV128)","v":""}]
[null,null,{"$f":"+[1]BASE!C129","v":113},{"$f":"+[1]BASE!D129","v":3690},{"$f":"+[1]BASE!E129","v":"OLAVARRIA - LA PAMPITA"},{"$f":"+[1]BASE!F129","v":132},{"$f":"+[1]BASE!G129","v":27.5},{"$f":"+[1]BASE!H129","v":"C"},{"$f":"IF([1]BASE!HK129=\"\",\"\",[1]BASE!HK129)","v":""},{"$f":"IF([1]BASE!HL129=\"\",\"\",[1]BASE!HL129)","v":""},{"$f":"IF([1]BASE!HM129=\"\",\"\",[1]BASE!HM129)","v":""},{"$f":"IF([1]BASE!HN129=\"\",\"\",[1]BASE!HN129)","v":""},{"$f":"IF([1]BASE!HO129=\"\",\"\",[1]BASE!HO129)","v":""},{"$f":"IF([1]BASE!HP129=\"\",\"\",[1]BASE!HP129)","v":""},{"$f":"IF([1]BASE!HQ129=\"\",\"\",[1]BASE!HQ129)","v":""},{"$f":"IF([1]BASE!HR129=\"\",\"\",[1]BASE!HR129)","v":""},{"$f":"IF([1]BASE!HS129=\"\",\"\",[1]BASE!HS129)","v":""},{"$f":"IF([1]BASE!HT129=\"\",\"\",[1]BASE!HT129)","v":""},{"$f":"IF([1]BASE!HU129=\"\",\"\",[1]BASE!HU129)","v":""},{"$f":"IF([1]BASE!HV129=\"\",\"\",[1]BASE!HV129)","v":""}]
[null,null,{"$f":"+[1]BASE!C130","v":114},{"$f":"+[1]BASE!D130","v":3796},{"$f":"+[1]BASE!E130","v":"C. SARMIENTO - S.A. DE ARECO"},{"$f":"+[1]BASE!F130","v":66},{"$f":"+[1]BASE!G130","v":31.5},{"$f":"+[1]BASE!H130","v":"C"},{"$f":"IF([1]BASE!HK130=\"\",\"\",[1]BASE!HK130)","v":""},{"$f":"IF([1]BASE!HL130=\"\",\"\",[1]BASE!HL130)","v":1},{"$f":"IF([1]BASE!HM130=\"\",\"\",[1]BASE!HM130)","v":""},{"$f":"IF([1]BASE!HN130=\"\",\"\",[1]BASE!HN130)","v":""},{"$f":"IF([1]BASE!HO130=\"\",\"\",[1]BASE!HO130)","v":""},{"$f":"IF([1]BASE!HP130=\"\",\"\",[1]BASE!HP130)","v":""},{"$f":"IF([1]BASE!HQ130=\"\",\"\",[1]BASE!HQ130)","v":""},{"$f":"IF([1]BASE!HR130=\"\",\"\",[1]BASE!HR130)","v":""},{"$f":"IF([1]BASE!HS130=\"\",\"\",[1]BASE!HS130)","v":""},{"$f":"IF([1]BASE!HT130=\"\",\"\",[1]BASE!HT130)","v":""},{"$f":"IF([1]BASE!HU130=\"\",\"\",[1]BASE!HU130)","v":""},{"$f":"IF([1]BASE!HV130=\"\",\"\",[1]BASE!HV130)","v":""}]
[null,null,{"$f":"+[1]BASE!C131","v":115},{"$f":"+[1]BASE!D131","v":3797},{"$f":"+[1]BASE!E131","v":"S.A. DE ARECO - LUJAN BAS"},{"$f":"+[1]BASE!F131","v":66},{"$f":"+[1]BASE!G131","v":49.8},{"$f":"+[1]BASE!H131","v":"C"},{"$f":"IF([1]BASE!HK131=\"\",\"\",[1]BASE!HK131)","v":""},{"$f":"IF([1]BASE!HL131=\"\",\"\",[1]BASE!HL131)","v":""},{"$f":"IF([1]BASE!HM131=\"\",\"\",[1]BASE!HM131)","v":1},{"$f":"IF([1]BASE!HN131=\"\",\"\",[1]BASE!HN131)","v":""},{"$f":"IF([1]BASE!HO131=\"\",\"\",[1]BASE!HO131)","v":""},{"$f":"IF([1]BASE!HP131=\"\",\"\",[1]BASE!HP131)","v":""},{"$f":"IF([1]BASE!HQ131=\"\",\"\",[1]BASE!HQ131)","v":""},{"$f":"IF([1]BASE!HR131=\"\",\"\",[1]BASE!HR131)","v":""},{"$f":"IF([1]BASE!HS131=\"\",\"\",[1]BASE!HS131)","v":""},{"$f":"IF([1]BASE!HT131=\"\",\"\",[1]BASE!HT131)","v":1},{"$f":"IF([1]BASE!HU131=\"\",\"\",[1]BASE!HU131)","v":""},{"$f":"IF([1]BASE!HV131=\"\",\"\",[1]BASE!HV131)","v":""}]
[null,null,{"$f":"+[1]BASE!C132","v":116},{"$f":"+[1]BASE!D132","v":3829},{"$f":"+[1]BASE!E132","v":"OLAVARRIA - BARKER"},{"$f":"+[1]BASE!F132","v":132},{"$f":"+[1]BASE!G132","v":139.4},{"$f":"+[1]BASE!H132","v":"C"},{"$f":"IF([1]BASE!HK132=\"\",\"\",[1]BASE!HK132)","v":""},{"$f":"IF([1]BASE!HL132=\"\",\"\",[1]BASE!HL132)","v":1},{"$f":"IF([1]BASE!HM132=\"\",\"\",[1]BASE!HM132)","v":""},{"$f":"IF([1]BASE!HN132=\"\",\"\",[1]BASE!HN132)","v":""},{"$f":"IF([1]BASE!HO132=\"\",\"\",[1]BASE!HO132)","v":""},{"$f":"IF([1]BASE!HP132=\"\",\"\",[1]BASE!HP132)","v":""},{"$f":"IF([1]BASE!HQ132=\"\",\"\",[1]BASE!HQ132)","v":""},{"$f":"IF([1]BASE!HR132=\"\",\"\",[1]BASE!HR132)","v":1},{"$f":"IF([1]BASE!HS132=\"\",\"\",[1]BASE!HS132)","v":""},{"$f":"IF([1]BASE!HT132=\"\",\"\",[1]BASE!HT132)","v":""},{"$f":"IF([1]BASE!HU132=\"\",\"\",[1]BASE!HU132)","v":""},{"$f":"IF([1]BASE!HV132=\"\",\"\",[1]BASE!HV132)","v":""}]
[null,null,{"$f":"+[1]BASE!C133","v":117},{"$f":"+[1]BASE!D133","v":4067},{"$f":"+[1]BASE!E133","v":"CHILLAR - OLAVARRIA "},{"$f":"+[1]BASE!F133","v":132},{"$f":"+[1]BASE!G133","v":73.430000000000007},{"$f":"+[1]BASE!H133","v":"C"},{"$f":"IF([1]BASE!HK133=\"\",\"\",[1]BASE!HK133)","v":""},{"$f":"IF([1]BASE!HL133=\"\",\"\",[1]BASE!HL133)","v":""},{"$f":"IF([1]BASE!HM133=\"\",\"\",[1]BASE!HM133)","v":""},{"$f":"IF([1]BASE!HN133=\"\",\"\",[1]BASE!HN133)","v":""},{"$f":"IF([1]BASE!HO133=\"\",\"\",[1]BASE!HO133)","v":""},{"$f":"IF([1]BASE!HP133=\"\",\"\",[1]BASE!HP133)","v":""},{"$f":"IF([1]BASE!HQ133=\"\",\"\",[1]BASE!HQ133)","v":""},{"$f":"IF([1]BASE!HR133=\"\",\"\",[1]BASE!HR133)","v":""},{"$f":"IF([1]BASE!HS133=\"\",\"\",[1]BASE!HS133)","v":""},{"$f":"IF([1]BASE!HT133=\"\",\"\",[1]BASE!HT133)","v":""},{"$f":"IF([1]BASE!HU133=\"\",\"\",[1]BASE!HU133)","v":""},{"$f":"IF([1]BASE!HV133=\"\",\"\",[1]BASE!HV133)","v":""}]
[null,null,{"$f":"+[1]BASE!C134","v":118},{"$f":"+[1]BASE!D134","v":4070},{"$f":"+[1]BASE!E134","v":"CHILLAR  - GONZALEZ CHAVES"},{"$f":"+[1]BASE!F134","v":132},{"$f":"+[1]BASE!G134","v":89.14},{"$f":"+[1]BASE!H134","v":"C"},{"$f":"IF([1]BASE!HK134=\"\",\"\",[1]BASE!HK134)","v":""},{"$f":"IF([1]BASE!HL134=\"\",\"\",[1]BASE!HL134)","v":""},{"$f":"IF([1]BASE!HM134=\"\",\"\",[1]BASE!HM134)","v":""},{"$f":"IF([1]BASE!HN134=\"\",\"\",[1]BASE!HN134)","v":""},{"$f":"IF([1]BASE!HO134=\"\",\"\",[1]BASE!HO134)","v":""},{"$f":"IF([1]BASE!HP134=\"\",\"\",[1]BASE!HP134)","v":""},{"$f":"IF([1]BASE!HQ134=\"\",\"\",[1]BASE!HQ134)","v":""},{"$f":"IF([1]BASE!HR134=\"\",\"\",[1]BASE!HR134)","v":""},{"$f":"IF([1]BASE!HS134=\"\",\"\",[1]BASE!HS134)","v":""},{"$f":"IF([1]BASE!HT134=\"\",\"\",[1]BASE!HT134)","v":""},{"$f":"IF([1]BASE!HU134=\"\",\"\",[1]BASE!HU134)","v":""},{"$f":"IF([1]BASE!HV134=\"\",\"\",[1]BASE!HV134)","v":""}]
[null,null,{"$f":"+[1]BASE!C135","v":119},{"$f":"+[1]BASE!D135","v":4077},{"$f":"+[1]BASE!E135","v":"CACHARI - RAUCH"},{"$f":"+[1]BASE!F135","v":132},{"$f":"+[1]BASE!G135","v":19.600000000000001},{"$f":"+[1]BASE!H135","v":"C"},{"$f":"IF([1]BASE!HK135=\"\",\"\",[1]BASE!HK135)","v":""},{"$f":"IF([1]BASE!HL135=\"\",\"\",[1]BASE!HL135)","v":""},{"$f":"IF([1]BASE!HM135=\"\",\"\",[1]BASE!HM135)","v":""},{"$f":"IF([1]BASE!HN135=\"\",\"\",[1]BASE!HN135)","v":1},{"$f":"IF([1]BASE!HO135=\"\",\"\",[1]BASE!HO135)","v":""},{"$f":"IF([1]BASE!HP135=\"\",\"\",[1]BASE!HP135)","v":""},{"$f":"IF([1]BASE!HQ135=\"\",\"\",[1]BASE!HQ135)","v":""},{"$f":"IF([1]BASE!HR135=\"\",\"\",[1]BASE!HR135)","v":""},{"$f":"IF([1]BASE!HS135=\"\",\"\",[1]BASE!HS135)","v":""},{"$f":"IF([1]BASE!HT135=\"\",\"\",[1]BASE!HT135)","v":""},{"$f":"IF([1]BASE!HU135=\"\",\"\",[1]BASE!HU135)","v":""},{"$f":"IF([1]BASE!HV135=\"\",\"\",[1]BASE!HV135)","v":""}]
[null,null,{"$f":"+[1]BASE!C136","v":120},{"$f":"+[1]BASE!D136","v":4075},{"$f":"+[1]BASE!E136","v":"AZUL - CACHARI"},{"$f":"+[1]BASE!F136","v":132},{"$f":"+[1]BASE!G136","v":55.7},{"$f":"+[1]BASE!H136","v":"C"},{"$f":"IF([1]BASE!HK136=\"\",\"\",[1]BASE!HK136)","v":""},{"$f":"IF([1]BASE!HL136=\"\",\"\",[1]BASE!HL136)","v":1},{"$f":"IF([1]BASE!HM136=\"\",\"\",[1]BASE!HM136)","v":""},{"$f":"IF([1]BASE!HN136=\"\",\"\",[1]BASE!HN136)","v":""},{"$f":"IF([1]BASE!HO136=\"\",\"\",[1]BASE!HO136)","v":""},{"$f":"IF([1]BASE!HP136=\"\",\"\",[1]BASE!HP136)","v":""},{"$f":"IF([1]BASE!HQ136=\"\",\"\",[1]BASE!HQ136)","v":""},{"$f":"IF([1]BASE!HR136=\"\",\"\",[1]BASE!HR136)","v":""},{"$f":"IF([1]BASE!HS136=\"\",\"\",[1]BASE!HS136)","v":""},{"$f":"IF([1]BASE!HT136=\"\",\"\",[1]BASE!HT136)","v":""},{"$f":"IF([1]BASE!HU136=\"\",\"\",[1]BASE!HU136)","v":1},{"$f":"IF([1]BASE!HV136=\"\",\"\",[1]BASE!HV136)","v":""}]
[null,null,{"$f":"+[1]BASE!C137","v":121},{"$f":"+[1]BASE!D137","v":4076},{"$f":"+[1]BASE!E137","v":"CACHARI - LAS FLORES"},{"$f":"+[1]BASE!F137","v":132},{"$f":"+[1]BASE!G137","v":51.3},{"$f":"+[1]BASE!H137","v":"C"},{"$f":"IF([1]BASE!HK137=\"\",\"\",[1]BASE!HK137)","v":""},{"$f":"IF([1]BASE!HL137=\"\",\"\",[1]BASE!HL137)","v":""},{"$f":"IF([1]BASE!HM137=\"\",\"\",[1]BASE!HM137)","v":""},{"$f":"IF([1]BASE!HN137=\"\",\"\",[1]BASE!HN137)","v":""},{"$f":"IF([1]BASE!HO137=\"\",\"\",[1]BASE!HO137)","v":""},{"$f":"IF([1]BASE!HP137=\"\",\"\",[1]BASE!HP137)","v":""},{"$f":"IF([1]BASE!HQ137=\"\",\"\",[1]BASE!HQ137)","v":""},{"$f":"IF([1]BASE!HR137=\"\",\"\",[1]BASE!HR137)","v":""},{"$f":"IF([1]BASE!HS137=\"\",\"\",[1]BASE!HS137)","v":""},{"$f":"IF([1]BASE!HT137=\"\",\"\",[1]BASE!HT137)","v":""},{"$f":"IF([1]BASE!HU137=\"\",\"\",[1]BASE!HU137)","v":""},{"$f":"IF([1]BASE!HV137=\"\",\"\",[1]BASE!HV137)","v":""}]
[null,null,{"$f":"+[1]BASE!C138","v":122},{"$f":"+[1]BASE!D138","v":4074},{"$f":"+[1]BASE!E138","v":"INDIO RICO - PRINGLES"},{"$f":"+[1]BASE!F138","v":132},{"$f":"+[1]BASE!G138","v":44.4},{"$f":"+[1]BASE!H138","v":"C"},{"$f":"IF([1]BASE!HK138=\"\",\"\",[1]BASE!HK138)","v":""},{"$f":"IF([1]BASE!HL138=\"\",\"\",[1]BASE!HL138)","v":""},{"$f":"IF([1]BASE!HM138=\"\",\"\",[1]BASE!HM138)","v":""},{"$f":"IF([1]BASE!HN138=\"\",\"\",[1]BASE!HN138)","v":""},{"$f":"IF([1]BASE!HO138=\"\",\"\",[1]BASE!HO138)","v":""},{"$f":"IF([1]BASE!HP138=\"\",\"\",[1]BASE!HP138)","v":""},{"$f":"IF([1]BASE!HQ138=\"\",\"\",[1]BASE!HQ138)","v":""},{"$f":"IF([1]BASE!HR138=\"\",\"\",[1]BASE!HR138)","v":""},{"$f":"IF([1]BASE!HS138=\"\",\"\",[1]BASE!HS138)","v":""},{"$f":"IF([1]BASE!HT138=\"\",\"\",[1]BASE!HT138)","v":""},{"$f":"IF([1]BASE!HU138=\"\",\"\",[1]BASE!HU138)","v":""},{"$f":"IF([1]BASE!HV138=\"\",\"\",[1]BASE!HV138)","v":""}]
[null,null,{"$f":"+[1]BASE!C139","v":123},{"$f":"+[1]BASE!D139","v":4096},{"$f":"+[1]BASE!E139","v":"MONTE - ROSAS"},{"$f":"+[1]BASE!F139","v":132},{"$f":"+[1]BASE!G139","v":58.4},{"$f":"+[1]BASE!H139","v":"C"},{"$f":"IF([1]BASE!HK139=\"\",\"\",[1]BASE!HK139)","v":""},{"$f":"IF([1]BASE!HL139=\"\",\"\",[1]BASE!HL139)","v":""},{"$f":"IF([1]BASE!HM139=\"\",\"\",[1]BASE!HM139)","v":1},{"$f":"IF([1]BASE!HN139=\"\",\"\",[1]BASE!HN139)","v":1},{"$f":"IF([1]BASE!HO139=\"\",\"\",[1]BASE!HO139)","v":""},{"$f":"IF([1]BASE!HP139=\"\",\"\",[1]BASE!HP139)","v":""},{"$f":"IF([1]BASE!HQ139=\"\",\"\",[1]BASE!HQ139)","v":""},{"$f":"IF([1]BASE!HR139=\"\",\"\",[1]BASE!HR139)","v":""},{"$f":"IF([1]BASE!HS139=\"\",\"\",[1]BASE!HS139)","v":""},{"$f":"IF([1]BASE!HT139=\"\",\"\",[1]BASE!HT139)","v":""},{"$f":"IF([1]BASE!HU139=\"\",\"\",[1]BASE!HU139)","v":""},{"$f":"IF([1]BASE!HV139=\"\",\"\",[1]BASE!HV139)","v":""}]
[null,null,{"$f":"+[1]BASE!C140","v":124},{"$f":"+[1]BASE!D140","v":4097},{"$f":"+[1]BASE!E140","v":"ROSAS - NEWTON"},{"$f":"+[1]BASE!F140","v":132},{"$f":"+[1]BASE!G140","v":11},{"$f":"+[1]BASE!H140","v":"C"},{"$f":"IF([1]BASE!HK140=\"\",\"\",[1]BASE!HK140)","v":""},{"$f":"IF([1]BASE!HL140=\"\",\"\",[1]BASE!HL140)","v":""},{"$f":"IF([1]BASE!HM140=\"\",\"\",[1]BASE!HM140)","v":""},{"$f":"IF([1]BASE!HN140=\"\",\"\",[1]BASE!HN140)","v":""},{"$f":"IF([1]BASE!HO140=\"\",\"\",[1]BASE!HO140)","v":""},{"$f":"IF([1]BASE!HP140=\"\",\"\",[1]BASE!HP140)","v":""},{"$f":"IF([1]BASE!HQ140=\"\",\"\",[1]BASE!HQ140)","v":""},{"$f":"IF([1]BASE!HR140=\"\",\"\",[1]BASE!HR140)","v":""},{"$f":"IF([1]BASE!HS140=\"\",\"\",[1]BASE!HS140)","v":""},{"$f":"IF([1]BASE!HT140=\"\",\"\",[1]BASE!HT140)","v":""},{"$f":"IF([1]BASE!HU140=\"\",\"\",[1]BASE!HU140)","v":""},{"$f":"IF([1]BASE!HV140=\"\",\"\",[1]BASE!HV140)","v":""}]
[null,null,{"$f":"+[1]BASE!C141","v":125},{"$f":"+[1]BASE!D141","v":4095},{"$f":"+[1]BASE!E141","v":"LAS FLORES - ROSAS"},{"$f":"+[1]BASE!F141","v":132},{"$f":"+[1]BASE!G141","v":28.4},{"$f":"+[1]BASE!H141","v":"C"},{"$f":"IF([1]BASE!HK141=\"\",\"\",[1]BASE!HK141)","v":""},{"$f":"IF([1]BASE!HL141=\"\",\"\",[1]BASE!HL141)","v":""},{"$f":"IF([1]BASE!HM141=\"\",\"\",[1]BASE!HM141)","v":""},{"$f":"IF([1]BASE!HN141=\"\",\"\",[1]BASE!HN141)","v":""},{"$f":"IF([1]BASE!HO141=\"\",\"\",[1]BASE!HO141)","v":""},{"$f":"IF([1]BASE!HP141=\"\",\"\",[1]BASE!HP141)","v":""},{"$f":"IF([1]BASE!HQ141=\"\",\"\",[1]BASE!HQ141)","v":""},{"$f":"IF([1]BASE!HR141=\"\",\"\",[1]BASE!HR141)","v":""},{"$f":"IF([1]BASE!HS141=\"\",\"\",[1]BASE!HS141)","v":""},{"$f":"IF([1]BASE!HT141=\"\",\"\",[1]BASE!HT141)","v":""},{"$f":"IF([1]BASE!HU141=\"\",\"\",[1]BASE!HU141)","v":""},{"$f":"IF([1]BASE!HV141=\"\",\"\",[1]BASE!HV141)","v":""}]
[null,null,{"$f":"+[1]BASE!C142","v":126},{"$f":"+[1]BASE!D142","v":4830},{"$f":"+[1]BASE!E142","v":"LOS CHAÑARES - PTQ. BAHIA BLANCA"},{"$f":"+[1]BASE!F142","v":132},{"$f":"+[1]BASE!G142","v":15.701000000000001},{"$f":"+[1]BASE!H142","v":"C"},{"$f":"IF([1]BASE!HK142=\"\",\"\",[1]BASE!HK142)","v":""},{"$f":"IF([1]BASE!HL142=\"\",\"\",[1]BASE!HL142)","v":""},{"$f":"IF([1]BASE!HM142=\"\",\"\",[1]BASE!HM142)","v":1},{"$f":"IF([1]BASE!HN142=\"\",\"\",[1]BASE!HN142)","v":""},{"$f":"IF([1]BASE!HO142=\"\",\"\",[1]BASE!HO142)","v":""},{"$f":"IF([1]BASE!HP142=\"\",\"\",[1]BASE!HP142)","v":""},{"$f":"IF([1]BASE!HQ142=\"\",\"\",[1]BASE!HQ142)","v":""},{"$f":"IF([1]BASE!HR142=\"\",\"\",[1]BASE!HR142)","v":""},{"$f":"IF([1]BASE!HS142=\"\",\"\",[1]BASE!HS142)","v":""},{"$f":"IF([1]BASE!HT142=\"\",\"\",[1]BASE!HT142)","v":""},{"$f":"IF([1]BASE!HU142=\"\",\"\",[1]BASE!HU142)","v":""},{"$f":"IF([1]BASE!HV142=\"\",\"\",[1]BASE!HV142)","v":""}]
[null,null,{"$f":"+[1]BASE!C143","v":127},{"$f":"+[1]BASE!D143","v":4831},{"$f":"+[1]BASE!E143","v":"NORTE II - LOS CHAÑARES"},{"$f":"+[1]BASE!F143","v":132},{"$f":"+[1]BASE!G143","v":15.725},{"$f":"+[1]BASE!H143","v":"C"},{"$f":"IF([1]BASE!HK143=\"\",\"\",[1]BASE!HK143)","v":""},{"$f":"IF([1]BASE!HL143=\"\",\"\",[1]BASE!HL143)","v":""},{"$f":"IF([1]BASE!HM143=\"\",\"\",[1]BASE!HM143)","v":""},{"$f":"IF([1]BASE!HN143=\"\",\"\",[1]BASE!HN143)","v":""},{"$f":"IF([1]BASE!HO143=\"\",\"\",[1]BASE!HO143)","v":""},{"$f":"IF([1]BASE!HP143=\"\",\"\",[1]BASE!HP143)","v":1},{"$f":"IF([1]BASE!HQ143=\"\",\"\",[1]BASE!HQ143)","v":""},{"$f":"IF([1]BASE!HR143=\"\",\"\",[1]BASE!HR143)","v":""},{"$f":"IF([1]BASE!HS143=\"\",\"\",[1]BASE!HS143)","v":""},{"$f":"IF([1]BASE!HT143=\"\",\"\",[1]BASE!HT143)","v":""},{"$f":"IF([1]BASE!HU143=\"\",\"\",[1]BASE!HU143)","v":""},{"$f":"IF([1]BASE!HV143=\"\",\"\",[1]BASE!HV143)","v":""}]
[null,null,{"$f":"+[1]BASE!C144","v":128},{"$f":"+[1]BASE!D144","v":4701},{"$f":"+[1]BASE!E144","v":"CHACABUCO - CHACABUCO IND."},{"$f":"+[1]BASE!F144","v":132},{"$f":"+[1]BASE!G144","v":15.9},{"$f":"+[1]BASE!H144","v":"C"},{"$f":"IF([1]BASE!HK144=\"\",\"\",[1]BASE!HK144)","v":""},{"$f":"IF([1]BASE!HL144=\"\",\"\",[1]BASE!HL144)","v":""},{"$f":"IF([1]BASE!HM144=\"\",\"\",[1]BASE!HM144)","v":""},{"$f":"IF([1]BASE!HN144=\"\",\"\",[1]BASE!HN144)","v":""},{"$f":"IF([1]BASE!HO144=\"\",\"\",[1]BASE!HO144)","v":""},{"$f":"IF([1]BASE!HP144=\"\",\"\",[1]BASE!HP144)","v":""},{"$f":"IF([1]BASE!HQ144=\"\",\"\",[1]BASE!HQ144)","v":""},{"$f":"IF([1]BASE!HR144=\"\",\"\",[1]BASE!HR144)","v":""},{"$f":"IF([1]BASE!HS144=\"\",\"\",[1]BASE!HS144)","v":""},{"$f":"IF([1]BASE!HT144=\"\",\"\",[1]BASE!HT144)","v":""},{"$f":"IF([1]BASE!HU144=\"\",\"\",[1]BASE!HU144)","v":""},{"$f":"IF([1]BASE!HV144=\"\",\"\",[1]BASE!HV144)","v":""}]
[null,null,{"$f":"+[1]BASE!C145","v":129},{"$f":"+[1]BASE!D145","v":4702},{"$f":"+[1]BASE!E145","v":"CHACABUCO IND. - SALTO BA"},{"$f":"+[1]BASE!F145","v":132},{"$f":"+[1]BASE!G145","v":48.6},{"$f":"+[1]BASE!H145","v":"C"},{"$f":"IF([1]BASE!HK145=\"\",\"\",[1]BASE!HK145)","v":""},{"$f":"IF([1]BASE!HL145=\"\",\"\",[1]BASE!HL145)","v":""},{"$f":"IF([1]BASE!HM145=\"\",\"\",[1]BASE!HM145)","v":""},{"$f":"IF([1]BASE!HN145=\"\",\"\",[1]BASE!HN145)","v":""},{"$f":"IF([1]BASE!HO145=\"\",\"\",[1]BASE!HO145)","v":""},{"$f":"IF([1]BASE!HP145=\"\",\"\",[1]BASE!HP145)","v":""},{"$f":"IF([1]BASE!HQ145=\"\",\"\",[1]BASE!HQ145)","v":""},{"$f":"IF([1]BASE!HR145=\"\",\"\",[1]BASE!HR145)","v":""},{"$f":"IF([1]BASE!HS145=\"\",\"\",[1]BASE!HS145)","v":""},{"$f":"IF([1]BASE!HT145=\"\",\"\",[1]BASE!HT145)","v":""},{"$f":"IF([1]BASE!HU145=\"\",\"\",[1]BASE!HU145)","v":""},{"$f":"IF([1]BASE!HV145=\"\",\"\",[1]BASE!HV145)","v":1}]
[null,null,{"$f":"+[1]BASE!C146","v":130},{"$f":"+[1]BASE!D146","v":4935},{"$f":"+[1]BASE!E146","v":"LAS PALMAS - SAN PEDRO"},{"$f":"+[1]BASE!F146","v":132},{"$f":"+[1]BASE!G146","v":67.3},{"$f":"+[1]BASE!H146","v":"C"},{"$f":"IF([1]BASE!HK146=\"\",\"\",[1]BASE!HK146)","v":""},{"$f":"IF([1]BASE!HL146=\"\",\"\",[1]BASE!HL146)","v":""},{"$f":"IF([1]BASE!HM146=\"\",\"\",[1]BASE!HM146)","v":""},{"$f":"IF([1]BASE!HN146=\"\",\"\",[1]BASE!HN146)","v":""},{"$f":"IF([1]BASE!HO146=\"\",\"\",[1]BASE!HO146)","v":""},{"$f":"IF([1]BASE!HP146=\"\",\"\",[1]BASE!HP146)","v":""},{"$f":"IF([1]BASE!HQ146=\"\",\"\",[1]BASE!HQ146)","v":""},{"$f":"IF([1]BASE!HR146=\"\",\"\",[1]BASE!HR146)","v":""},{"$f":"IF([1]BASE!HS146=\"\",\"\",[1]BASE!HS146)","v":""},{"$f":"IF([1]BASE!HT146=\"\",\"\",[1]BASE!HT146)","v":""},{"$f":"IF([1]BASE!HU146=\"\",\"\",[1]BASE!HU146)","v":""},{"$f":"IF([1]BASE!HV146=\"\",\"\",[1]BASE!HV146)","v":1}]
[null,null,{"$f":"+[1]BASE!C147","v":131},{"$f":"+[1]BASE!D147","v":4933},{"$f":"+[1]BASE!E147","v":"ZARATE - LAS PALMAS"},{"$f":"+[1]BASE!F147","v":132},{"$f":"+[1]BASE!G147","v":8.6999999999999993},{"$f":"+[1]BASE!H147","v":"C"},{"$f":"IF([1]BASE!HK147=\"\",\"\",[1]BASE!HK147)","v":""},{"$f":"IF([1]BASE!HL147=\"\",\"\",[1]BASE!HL147)","v":""},{"$f":"IF([1]BASE!HM147=\"\",\"\",[1]BASE!HM147)","v":""},{"$f":"IF([1]BASE!HN147=\"\",\"\",[1]BASE!HN147)","v":""},{"$f":"IF([1]BASE!HO147=\"\",\"\",[1]BASE!HO147)","v":""},{"$f":"IF([1]BASE!HP147=\"\",\"\",[1]BASE!HP147)","v":""},{"$f":"IF([1]BASE!HQ147=\"\",\"\",[1]BASE!HQ147)","v":""},{"$f":"IF([1]BASE!HR147=\"\",\"\",[1]BASE!HR147)","v":""},{"$f":"IF([1]BASE!HS147=\"\",\"\",[1]BASE!HS147)","v":""},{"$f":"IF([1]BASE!HT147=\"\",\"\",[1]BASE!HT147)","v":""},{"$f":"IF([1]BASE!HU147=\"\",\"\",[1]BASE!HU147)","v":""},{"$f":"IF([1]BASE!HV147=\"\",\"\",[1]BASE!HV147)","v":""}]
[null,null,{"$f":"+[1]BASE!C148","v":132},null,{"$f":"+[1]BASE!E148","v":"LAS PALMAS - PROTISA"},{"$f":"+[1]BASE!F148","v":132},{"$f":"+[1]BASE!G148","v":4.4000000000000004},{"$f":"+[1]BASE!H148","v":"C"},{"$f":"IF([1]BASE!HK148=\"\",\"\",[1]BASE!HK148)","v":""},{"$f":"IF([1]BASE!HL148=\"\",\"\",[1]BASE!HL148)","v":""},{"$f":"IF([1]BASE!HM148=\"\",\"\",[1]BASE!HM148)","v":""},{"$f":"IF([1]BASE!HN148=\"\",\"\",[1]BASE!HN148)","v":""},{"$f":"IF([1]BASE!HO148=\"\",\"\",[1]BASE!HO148)","v":""},{"$f":"IF([1]BASE!HP148=\"\",\"\",[1]BASE!HP148)","v":""},{"$f":"IF([1]BASE!HQ148=\"\",\"\",[1]BASE!HQ148)","v":""},{"$f":"IF([1]BASE!HR148=\"\",\"\",[1]BASE!HR148)","v":""},{"$f":"IF([1]BASE!HS148=\"\",\"\",[1]BASE!HS148)","v":""},{"$f":"IF([1]BASE!HT148=\"\",\"\",[1]BASE!HT148)","v":""},{"$f":"IF([1]BASE!HU148=\"\",\"\",[1]BASE!HU148)","v":""},{"$f":"IF([1]BASE!HV148=\"\",\"\",[1]BASE!HV148)","v":""}]
[null,null,{"$f":"+[1]BASE!C149","v":133},{"$f":"+[1]BASE!D149","v":4671},{"$f":"+[1]BASE!E149","v":"PERGAMINO - COLON"},{"$f":"+[1]BASE!F149","v":132},{"$f":"+[1]BASE!G149","v":52.7},{"$f":"+[1]BASE!H149","v":"C"},{"$f":"IF([1]BASE!HK149=\"\",\"\",[1]BASE!HK149)","v":""},{"$f":"IF([1]BASE!HL149=\"\",\"\",[1]BASE!HL149)","v":""},{"$f":"IF([1]BASE!HM149=\"\",\"\",[1]BASE!HM149)","v":""},{"$f":"IF([1]BASE!HN149=\"\",\"\",[1]BASE!HN149)","v":""},{"$f":"IF([1]BASE!HO149=\"\",\"\",[1]BASE!HO149)","v":""},{"$f":"IF([1]BASE!HP149=\"\",\"\",[1]BASE!HP149)","v":""},{"$f":"IF([1]BASE!HQ149=\"\",\"\",[1]BASE!HQ149)","v":""},{"$f":"IF([1]BASE!HR149=\"\",\"\",[1]BASE!HR149)","v":""},{"$f":"IF([1]BASE!HS149=\"\",\"\",[1]BASE!HS149)","v":""},{"$f":"IF([1]BASE!HT149=\"\",\"\",[1]BASE!HT149)","v":""},{"$f":"IF([1]BASE!HU149=\"\",\"\",[1]BASE!HU149)","v":""},{"$f":"IF([1]BASE!HV149=\"\",\"\",[1]BASE!HV149)","v":""}]
[null,null,{"$f":"+[1]BASE!C150","v":134},{"$f":"+[1]BASE!D150","v":1434},{"$f":"+[1]BASE!E150","v":"9 DE JULIO 66 - BRAGADO"},{"$f":"+[1]BASE!F150","v":66},{"$f":"+[1]BASE!G150","v":60.94},{"$f":"+[1]BASE!H150","v":"C"},{"$f":"IF([1]BASE!HK150=\"\",\"\",[1]BASE!HK150)","v":""},{"$f":"IF([1]BASE!HL150=\"\",\"\",[1]BASE!HL150)","v":""},{"$f":"IF([1]BASE!HM150=\"\",\"\",[1]BASE!HM150)","v":""},{"$f":"IF([1]BASE!HN150=\"\",\"\",[1]BASE!HN150)","v":""},{"$f":"IF([1]BASE!HO150=\"\",\"\",[1]BASE!HO150)","v":""},{"$f":"IF([1]BASE!HP150=\"\",\"\",[1]BASE!HP150)","v":""},{"$f":"IF([1]BASE!HQ150=\"\",\"\",[1]BASE!HQ150)","v":""},{"$f":"IF([1]BASE!HR150=\"\",\"\",[1]BASE!HR150)","v":""},{"$f":"IF([1]BASE!HS150=\"\",\"\",[1]BASE!HS150)","v":""},{"$f":"IF([1]BASE!HT150=\"\",\"\",[1]BASE!HT150)","v":2},{"$f":"IF([1]BASE!HU150=\"\",\"\",[1]BASE!HU150)","v":""},{"$f":"IF([1]BASE!HV150=\"\",\"\",[1]BASE!HV150)","v":""}]
[null,null,{"$f":"+[1]BASE!C151","v":135},{"$f":"+[1]BASE!D151","v":4715},{"$f":"+[1]BASE!E151","v":"LUJAN GBA - LUJAN II GBA"},{"$f":"+[1]BASE!F151","v":132},{"$f":"+[1]BASE!G151","v":9.02},{"$f":"+[1]BASE!H151","v":"C"},{"$f":"IF([1]BASE!HK151=\"\",\"\",[1]BASE!HK151)","v":""},{"$f":"IF([1]BASE!HL151=\"\",\"\",[1]BASE!HL151)","v":""},{"$f":"IF([1]BASE!HM151=\"\",\"\",[1]BASE!HM151)","v":""},{"$f":"IF([1]BASE!HN151=\"\",\"\",[1]BASE!HN151)","v":""},{"$f":"IF([1]BASE!HO151=\"\",\"\",[1]BASE!HO151)","v":""},{"$f":"IF([1]BASE!HP151=\"\",\"\",[1]BASE!HP151)","v":""},{"$f":"IF([1]BASE!HQ151=\"\",\"\",[1]BASE!HQ151)","v":""},{"$f":"IF([1]BASE!HR151=\"\",\"\",[1]BASE!HR151)","v":1},{"$f":"IF([1]BASE!HS151=\"\",\"\",[1]BASE!HS151)","v":""},{"$f":"IF([1]BASE!HT151=\"\",\"\",[1]BASE!HT151)","v":""},{"$f":"IF([1]BASE!HU151=\"\",\"\",[1]BASE!HU151)","v":""},{"$f":"IF([1]BASE!HV151=\"\",\"\",[1]BASE!HV151)","v":""}]
[null,null,{"$f":"+[1]BASE!C152","v":136},{"$f":"+[1]BASE!D152","v":4716},{"$f":"+[1]BASE!E152","v":"LUJAN  II - MALV.1- CATONAS 1 - MORON 1"},{"$f":"+[1]BASE!F152","v":132},{"$f":"+[1]BASE!G152","v":38.29},{"$f":"+[1]BASE!H152","v":"A"},{"$f":"IF([1]BASE!HK152=\"\",\"\",[1]BASE!HK152)","v":""},{"$f":"IF([1]BASE!HL152=\"\",\"\",[1]BASE!HL152)","v":""},{"$f":"IF([1]BASE!HM152=\"\",\"\",[1]BASE!HM152)","v":""},{"$f":"IF([1]BASE!HN152=\"\",\"\",[1]BASE!HN152)","v":""},{"$f":"IF([1]BASE!HO152=\"\",\"\",[1]BASE!HO152)","v":""},{"$f":"IF([1]BASE!HP152=\"\",\"\",[1]BASE!HP152)","v":""},{"$f":"IF([1]BASE!HQ152=\"\",\"\",[1]BASE!HQ152)","v":""},{"$f":"IF([1]BASE!HR152=\"\",\"\",[1]BASE!HR152)","v":1},{"$f":"IF([1]BASE!HS152=\"\",\"\",[1]BASE!HS152)","v":""},{"$f":"IF([1]BASE!HT152=\"\",\"\",[1]BASE!HT152)","v":""},{"$f":"IF([1]BASE!HU152=\"\",\"\",[1]BASE!HU152)","v":""},{"$f":"IF([1]BASE!HV152=\"\",\"\",[1]BASE!HV152)","v":""}]
[null,null,{"$f":"+[1]BASE!C153","v":137},{"$f":"+[1]BASE!D153","v":4888},{"$f":"+[1]BASE!E153","v":"ZARATE -CAMPANA III"},{"$f":"+[1]BASE!F153","v":132},{"$f":"+[1]BASE!G153","v":16.8},{"$f":"+[1]BASE!H153","v":"C"},{"$f":"IF([1]BASE!HK153=\"\",\"\",[1]BASE!HK153)","v":""},{"$f":"IF([1]BASE!HL153=\"\",\"\",[1]BASE!HL153)","v":""},{"$f":"IF([1]BASE!HM153=\"\",\"\",[1]BASE!HM153)","v":""},{"$f":"IF([1]BASE!HN153=\"\",\"\",[1]BASE!HN153)","v":""},{"$f":"IF([1]BASE!HO153=\"\",\"\",[1]BASE!HO153)","v":""},{"$f":"IF([1]BASE!HP153=\"\",\"\",[1]BASE!HP153)","v":""},{"$f":"IF([1]BASE!HQ153=\"\",\"\",[1]BASE!HQ153)","v":""},{"$f":"IF([1]BASE!HR153=\"\",\"\",[1]BASE!HR153)","v":""},{"$f":"IF([1]BASE!HS153=\"\",\"\",[1]BASE!HS153)","v":""},{"$f":"IF([1]BASE!HT153=\"\",\"\",[1]BASE!HT153)","v":""},{"$f":"IF([1]BASE!HU153=\"\",\"\",[1]BASE!HU153)","v":""},{"$f":"IF([1]BASE!HV153=\"\",\"\",[1]BASE!HV153)","v":""}]
[null,null,{"$f":"+[1]BASE!C154","v":138},{"$f":"+[1]BASE!D154","v":4889},{"$f":"+[1]BASE!E154","v":"CAMPANBA III - MATHEU"},{"$f":"+[1]BASE!F154","v":132},{"$f":"+[1]BASE!G154","v":24.7},{"$f":"+[1]BASE!H154","v":"C"},{"$f":"IF([1]BASE!HK154=\"\",\"\",[1]BASE!HK154)","v":""},{"$f":"IF([1]BASE!HL154=\"\",\"\",[1]BASE!HL154)","v":""},{"$f":"IF([1]BASE!HM154=\"\",\"\",[1]BASE!HM154)","v":""},{"$f":"IF([1]BASE!HN154=\"\",\"\",[1]BASE!HN154)","v":""},{"$f":"IF([1]BASE!HO154=\"\",\"\",[1]BASE!HO154)","v":""},{"$f":"IF([1]BASE!HP154=\"\",\"\",[1]BASE!HP154)","v":""},{"$f":"IF([1]BASE!HQ154=\"\",\"\",[1]BASE!HQ154)","v":""},{"$f":"IF([1]BASE!HR154=\"\",\"\",[1]BASE!HR154)","v":""},{"$f":"IF([1]BASE!HS154=\"\",\"\",[1]BASE!HS154)","v":""},{"$f":"IF([1]BASE!HT154=\"\",\"\",[1]BASE!HT154)","v":""},{"$f":"IF([1]BASE!HU154=\"\",\"\",[1]BASE!HU154)","v":""},{"$f":"IF([1]BASE!HV154=\"\",\"\",[1]BASE!HV154)","v":""}]
[null,null,{"$f":"+[1]BASE!C155","v":139},{"$f":"+[1]BASE!D155","v":4914},{"$f":"+[1]BASE!E155","v":"RAMALLO - SIDERAR"},{"$f":"+[1]BASE!F155","v":132},{"$f":"+[1]BASE!G155","v":6.75},{"$f":"+[1]BASE!H155","v":"C"},{"$f":"IF([1]BASE!HK155=\"\",\"\",[1]BASE!HK155)","v":""},{"$f":"IF([1]BASE!HL155=\"\",\"\",[1]BASE!HL155)","v":""},{"$f":"IF([1]BASE!HM155=\"\",\"\",[1]BASE!HM155)","v":""},{"$f":"IF([1]BASE!HN155=\"\",\"\",[1]BASE!HN155)","v":""},{"$f":"IF([1]BASE!HO155=\"\",\"\",[1]BASE!HO155)","v":""},{"$f":"IF([1]BASE!HP155=\"\",\"\",[1]BASE!HP155)","v":""},{"$f":"IF([1]BASE!HQ155=\"\",\"\",[1]BASE!HQ155)","v":""},{"$f":"IF([1]BASE!HR155=\"\",\"\",[1]BASE!HR155)","v":""},{"$f":"IF([1]BASE!HS155=\"\",\"\",[1]BASE!HS155)","v":""},{"$f":"IF([1]BASE!HT155=\"\",\"\",[1]BASE!HT155)","v":""},{"$f":"IF([1]BASE!HU155=\"\",\"\",[1]BASE!HU155)","v":""},{"$f":"IF([1]BASE!HV155=\"\",\"\",[1]BASE!HV155)","v":""}]
[null,null,{"$f":"+[1]BASE!C156","v":140},{"$f":"+[1]BASE!D156","v":4915},{"$f":"+[1]BASE!E156","v":"SIDERAR - SAN NICOLÁS"},{"$f":"+[1]BASE!F156","v":132},{"$f":"+[1]BASE!G156","v":1.31},{"$f":"+[1]BASE!H156","v":"C"},{"$f":"IF([1]BASE!HK156=\"\",\"\",[1]BASE!HK156)","v":""},{"$f":"IF([1]BASE!HL156=\"\",\"\",[1]BASE!HL156)","v":""},{"$f":"IF([1]BASE!HM156=\"\",\"\",[1]BASE!HM156)","v":""},{"$f":"IF([1]BASE!HN156=\"\",\"\",[1]BASE!HN156)","v":""},{"$f":"IF([1]BASE!HO156=\"\",\"\",[1]BASE!HO156)","v":""},{"$f":"IF([1]BASE!HP156=\"\",\"\",[1]BASE!HP156)","v":""},{"$f":"IF([1]BASE!HQ156=\"\",\"\",[1]BASE!HQ156)","v":""},{"$f":"IF([1]BASE!HR156=\"\",\"\",[1]BASE!HR156)","v":""},{"$f":"IF([1]BASE!HS156=\"\",\"\",[1]BASE!HS156)","v":""},{"$f":"IF([1]BASE!HT156=\"\",\"\",[1]BASE!HT156)","v":""},{"$f":"IF([1]BASE!HU156=\"\",\"\",[1]BASE!HU156)","v":""},{"$f":"IF([1]BASE!HV156=\"\",\"\",[1]BASE!HV156)","v":""}]
[null,null,{"$f":"+[1]BASE!C157","v":141},null,{"$f":"+[1]BASE!E157","v":"RAMALLO IND - RAMALLO"},{"$f":"+[1]BASE!F157","v":132},{"$f":"+[1]BASE!G157","v":17.66},{"$f":"+[1]BASE!H157","v":"C"},{"$f":"IF([1]BASE!HK157=\"\",\"\",[1]BASE!HK157)","v":""},{"$f":"IF([1]BASE!HL157=\"\",\"\",[1]BASE!HL157)","v":""},{"$f":"IF([1]BASE!HM157=\"\",\"\",[1]BASE!HM157)","v":""},{"$f":"IF([1]BASE!HN157=\"\",\"\",[1]BASE!HN157)","v":""},{"$f":"IF([1]BASE!HO157=\"\",\"\",[1]BASE!HO157)","v":""},{"$f":"IF([1]BASE!HP157=\"\",\"\",[1]BASE!HP157)","v":""},{"$f":"IF([1]BASE!HQ157=\"\",\"\",[1]BASE!HQ157)","v":""},{"$f":"IF([1]BASE!HR157=\"\",\"\",[1]BASE!HR157)","v":""},{"$f":"IF([1]BASE!HS157=\"\",\"\",[1]BASE!HS157)","v":""},{"$f":"IF([1]BASE!HT157=\"\",\"\",[1]BASE!HT157)","v":""},{"$f":"IF([1]BASE!HU157=\"\",\"\",[1]BASE!HU157)","v":""},{"$f":"IF([1]BASE!HV157=\"\",\"\",[1]BASE!HV157)","v":""}]
[null,null,{"$f":"+[1]BASE!C158","v":142},{"$f":"+[1]BASE!D158","v":4964},{"$f":"+[1]BASE!E158","v":"PINAMAR - VALERIA DEL MAR"},{"$f":"+[1]BASE!F158","v":132},{"$f":"+[1]BASE!G158","v":6},{"$f":"+[1]BASE!H158","v":"C"},{"$f":"IF([1]BASE!HK158=\"\",\"\",[1]BASE!HK158)","v":""},{"$f":"IF([1]BASE!HL158=\"\",\"\",[1]BASE!HL158)","v":""},{"$f":"IF([1]BASE!HM158=\"\",\"\",[1]BASE!HM158)","v":""},{"$f":"IF([1]BASE!HN158=\"\",\"\",[1]BASE!HN158)","v":""},{"$f":"IF([1]BASE!HO158=\"\",\"\",[1]BASE!HO158)","v":""},{"$f":"IF([1]BASE!HP158=\"\",\"\",[1]BASE!HP158)","v":""},{"$f":"IF([1]BASE!HQ158=\"\",\"\",[1]BASE!HQ158)","v":""},{"$f":"IF([1]BASE!HR158=\"\",\"\",[1]BASE!HR158)","v":""},{"$f":"IF([1]BASE!HS158=\"\",\"\",[1]BASE!HS158)","v":""},{"$f":"IF([1]BASE!HT158=\"\",\"\",[1]BASE!HT158)","v":""},{"$f":"IF([1]BASE!HU158=\"\",\"\",[1]BASE!HU158)","v":""},{"$f":"IF([1]BASE!HV158=\"\",\"\",[1]BASE!HV158)","v":""}]
[null,null,{"$f":"+[1]BASE!C159","v":143},{"$f":"+[1]BASE!D159","v":4965},{"$f":"+[1]BASE!E159","v":"VALERIA DEL MAR - VILLA GESELL"},{"$f":"+[1]BASE!F159","v":132},{"$f":"+[1]BASE!G159","v":14.28},{"$f":"+[1]BASE!H159","v":"C"},{"$f":"IF([1]BASE!HK159=\"\",\"\",[1]BASE!HK159)","v":""},{"$f":"IF([1]BASE!HL159=\"\",\"\",[1]BASE!HL159)","v":""},{"$f":"IF([1]BASE!HM159=\"\",\"\",[1]BASE!HM159)","v":""},{"$f":"IF([1]BASE!HN159=\"\",\"\",[1]BASE!HN159)","v":""},{"$f":"IF([1]BASE!HO159=\"\",\"\",[1]BASE!HO159)","v":""},{"$f":"IF([1]BASE!HP159=\"\",\"\",[1]BASE!HP159)","v":""},{"$f":"IF([1]BASE!HQ159=\"\",\"\",[1]BASE!HQ159)","v":""},{"$f":"IF([1]BASE!HR159=\"\",\"\",[1]BASE!HR159)","v":""},{"$f":"IF([1]BASE!HS159=\"\",\"\",[1]BASE!HS159)","v":1},{"$f":"IF([1]BASE!HT159=\"\",\"\",[1]BASE!HT159)","v":""},{"$f":"IF([1]BASE!HU159=\"\",\"\",[1]BASE!HU159)","v":""},{"$f":"IF([1]BASE!HV159=\"\",\"\",[1]BASE!HV159)","v":""}]
[null,null,{"$f":"+[1]BASE!C160","v":144},null,{"$f":"+[1]BASE!E160","v":"BAHIA BLANCA - MONTE HERMOSO"},{"$f":"+[1]BASE!F160","v":132},{"$f":"+[1]BASE!G160","v":90},{"$f":"+[1]BASE!H160","v":"C"},{"$f":"IF([1]BASE!HK160=\"\",\"\",[1]BASE!HK160)","v":""},{"$f":"IF([1]BASE!HL160=\"\",\"\",[1]BASE!HL160)","v":""},{"$f":"IF([1]BASE!HM160=\"\",\"\",[1]BASE!HM160)","v":1},{"$f":"IF([1]BASE!HN160=\"\",\"\",[1]BASE!HN160)","v":""},{"$f":"IF([1]BASE!HO160=\"\",\"\",[1]BASE!HO160)","v":""},{"$f":"IF([1]BASE!HP160=\"\",\"\",[1]BASE!HP160)","v":""},{"$f":"IF([1]BASE!HQ160=\"\",\"\",[1]BASE!HQ160)","v":""},{"$f":"IF([1]BASE!HR160=\"\",\"\",[1]BASE!HR160)","v":""},{"$f":"IF([1]BASE!HS160=\"\",\"\",[1]BASE!HS160)","v":""},{"$f":"IF([1]BASE!HT160=\"\",\"\",[1]BASE!HT160)","v":""},{"$f":"IF([1]BASE!HU160=\"\",\"\",[1]BASE!HU160)","v":""},{"$f":"IF([1]BASE!HV160=\"\",\"\",[1]BASE!HV160)","v":""}]
[null,null,{"$f":"+[1]BASE!C161","v":145},null,{"$f":"+[1]BASE!E161","v":"MONTE HERMOSO - CORONEL DORREGO"},{"$f":"+[1]BASE!F161","v":132},{"$f":"+[1]BASE!G161","v":35.4},{"$f":"+[1]BASE!H161","v":0},{"$f":"IF([1]BASE!HK161=\"\",\"\",[1]BASE!HK161)","v":""},{"$f":"IF([1]BASE!HL161=\"\",\"\",[1]BASE!HL161)","v":""},{"$f":"IF([1]BASE!HM161=\"\",\"\",[1]BASE!HM161)","v":""},{"$f":"IF([1]BASE!HN161=\"\",\"\",[1]BASE!HN161)","v":""},{"$f":"IF([1]BASE!HO161=\"\",\"\",[1]BASE!HO161)","v":""},{"$f":"IF([1]BASE!HP161=\"\",\"\",[1]BASE!HP161)","v":1},{"$f":"IF([1]BASE!HQ161=\"\",\"\",[1]BASE!HQ161)","v":""},{"$f":"IF([1]BASE!HR161=\"\",\"\",[1]BASE!HR161)","v":""},{"$f":"IF([1]BASE!HS161=\"\",\"\",[1]BASE!HS161)","v":""},{"$f":"IF([1]BASE!HT161=\"\",\"\",[1]BASE!HT161)","v":""},{"$f":"IF([1]BASE!HU161=\"\",\"\",[1]BASE!HU161)","v":""},{"$f":"IF([1]BASE!HV161=\"\",\"\",[1]BASE!HV161)","v":""}]
[]
[]
[null,null,null,null,"Longitud Total ",{"$f":"ROUND(SUM($G$16:$G$162)-SUMIF(T16:T162,\"XXXX\",$G$16:$G$162),2)","v":6162.72},"km"]
[null,null,null,null,null,null,"Indisponibilidades Forzadas ",null,{"$f":"SUM(I16:I162)","v":4},5,14,12,1,7,2,13,9,9,4,5]
[null,null,null,null,null,null,"TASA DE FALLA ",null,{"$f":"+[1]BASE!HK166","v":1.1399999999999999},{"$f":"+[1]BASE!HL166","v":1.1499999999999999},{"$f":"+[1]BASE!HM166","v":1.18},{"$f":"+[1]BASE!HN166","v":1.25},{"$f":"+[1]BASE!HO166","v":1.35},{"$f":"+[1]BASE!HP166","v":1.25},{"$f":"+[1]BASE!HQ166","v":1.25},{"$f":"+[1]BASE!HR166","v":1.23},{"$f":"+[1]BASE!HS166","v":1.31},{"$f":"+[1]BASE!HT166","v":1.33},{"$f":"+[1]BASE!HU166","v":1.41},{"$f":"+[1]BASE!HV166","v":1.38},{"$f":"+[1]BASE!HW166","v":1.38}]
[]
[null,null,null,null,null,null,null,null,null,null,null,"TASA DE FALLA",null,{"$f":"U165","v":1.38},"SALIDAS x AÑO / 100 km"]

{"sheet":"DATO","index":15,"n_rows":22,"n_cols":29,"rows_kept":22,"cut":false,"hidden":false,"merged":[]}
["Mes","Mes","Dia","Año"]
["enero","01",31,2006]
["febrero","02",{"$f":"IF(MOD(E14,4)=0,29,28)","v":29},{"$f":"+D2+1","v":2007}]
["marzo","03",31,2008]
["abril","04",30,2009]
["mayo","05",31,2010]
["junio","06",30,2011]
["julio","07",31,2012]
["agosto","08",31,2013]
["septiembre","09",30,2014]
["octubre","10",31,2015]
["noviembre","11",30,2016]
["diciembre","12",31,null,null,null,null,null,"Total"]
[11,5,{"$f":"CELL(\"CONTENIDO\",OFFSET(A1,B14,0))","v":"mayo"},{"$f":"CELL(\"CONTENIDO\",OFFSET(C1,B14,0))","v":31},{"$f":"CELL(\"CONTENIDO\",OFFSET(D1,A14,0))","v":2016},{"$f":"\"Desde el 01 al \" & D14 & \" de \" & C14 & \" de \" & E14","v":"Desde el 01 al 31 de mayo de 2016"},{"$f":"CELL(\"CONTENIDO\",OFFSET(B1,B14,0))","v":"05"},{"$f":"RIGHT(E14,2)","v":"16"},"B14"]
[null,{"$f":"\"\\\\rugor\\files\\Transporte\\Transporte\\AA PROCESO AUT ARCHIVOS J\\TRANSBA\\\" &E14","v":"\\\\rugor\\files\\Transporte\\Transporte\\AA PROCESO AUT ARCHIVOS J\\TRANSBA\\2016"},null,null,null,null,{"$f":"\"J\"&G14&H14&\"TBA\"","v":"J0516TBA"}]
[null,{"$f":"\"\\\\rugor\\files\\Transporte\\transporte\\AA PROCESO AUT\\INTERCAMBIO\\\" &H14&G14","v":"\\\\rugor\\files\\Transporte\\transporte\\AA PROCESO AUT\\INTERCAMBIO\\1605"}]
["Hoja","FilaInicio","FilasPlantilla","Columnas","NombreHoja","OrigenDeDatos","Col00","Col01","Col02","Col03","Col04","Col05","Col06","Col07","Col08","Col09","Col10","Col11","Col12","Col13","Col14","Col15","FILHTOTAL","COLHTOTAL","FILHCALC","COLHCALC","FILTRANSP","COLTRANSP","COL TSAL"]
["MODELO L",21,20,12,{"$f":"\"LI-\" & $G$14","v":"LI-05"},"TRANSBA_INDISPONIBILIDADES_LINEAS_TRANSBA.XLS",3,5,4,6,7,8,9,11,12,15,0,28,16,0,0,0,18,9,42,29,19,29,15]
["MODELO T",22,20,13,{"$f":"\"T-\" & $G$14","v":"T-05"},"TRANSBA_INDISPONIBILIDADES_TRAFOS_TRANSBA.XLS",3,5,4,6,7,8,9,11,12,15,16,18,28,17,0,0,22,9,43,29,20,29,15]
["MODELO S",22,20,10,{"$f":"\"SA-\" & $G$14","v":"SA-05"},"TRANSBA_INDISPONIBILIDADES_SALIDAS_TRANSBA.XLS",3,5,4,6,7,8,10,11,14,15,21,0,0,0,0,0,24,9,43,22,20,22,14]
["MODELO R",21,20,12,{"$f":"\"RE-\" & $G$14","v":"RE-05"},"TRANSBA_INDISPONIBILIDADES_REACTIVOS_TRANSBA.XLS",3,5,4,6,7,8,9,10,12,13,16,17,29,18,0,0,26,9,43,30,20,30,16]
["MODELO VST",19,24,4,{"$f":"\"CAUSAS-VST-\" & $G$14","v":"CAUSAS-VST-05"},"TRANSBA_CAUSAS_VST.XLS",3,4,5,6,7,0,0,0,0,0,0,0,0,0,0,0,999,999,0,0,0,0,0]