{"text_format":"1","workbook":"xlsx","n_sheets":10,"sheets":["TOT-0316","LI-03 (1)","LI-03 (2)","LI-TRANSPORTEL-03 (1)","T-03 (1)","T-03 (2)","SA-03 (1)","SUP-TRANSPORTEL","Tasa de Falla","DATO"],"not_rendered":{"charts":0,"images":3,"macros":1,"external_links":3,"defined_names":1,"comments":0,"pivot_tables":0},"unopened":[],"bounds":{"document_bytes":16777216,"sheet_cells":100000,"rows_first":2000,"rows_last":500,"rows_between":2000,"halvings":0,"cell_chars":16384,"cell_head_chars":4096},"cells_cut":0,"cells_raw":0,"read":"whole","date_system":"1900"}

{"sheet":"TOT-0316","index":0,"n_rows":34,"n_cols":10,"rows_kept":34,"cut":false,"hidden":false,"merged":[]}
[]
[null,"ANEXO VI  al Memorsndum   D.T.E.E. N°     356    / 2017"]
[]
["ENTE NACIONAL REGULADOR "]
["DE LA ELECTRICIDAD"]
[]
[null,"SISTEMA DE TRANSPORTE DE ENERGÍA ELÉCTRICA POR DISTRIBUCIÓN TRONCAL"]
[]
[null,"TRANSNOA S.A."]
[]
[null,"TOTAL DE PENALIZACIONES"]
[]
[null,1]
[null,"Desde el 01 al 31 de Marzo de 2016"]
[]
[null,"Sanciones duplicadas por tasa de falla > 4 Sal. x año/100km."]
[]
[null,null,"1.-","LÍNEAS"]
[null,null,null,"1.1.-","Equipamiento propio",null,null,null,null,{"$f":"'LI-03 (2)'!AA41","v":145628.88}]
[null,null,null,"1.2.-","Equipamiento del T.I. TRANSPORTEL - La Rioja Sur",null,null,null,null,{"$f":"'LI-TRANSPORTEL-03 (1)'!AA42","v":754.06}]
[]
[null,null,"2.-","CONEXIÓN"]
[null,null,null,"2.1.-","Transformación"]
[null,null,null,null,"2.1.1.-","Equipamiento propio",null,null,null,{"$f":"'T-03 (2)'!AC52","v":30892.75}]
[null,null,null,"2.2.-","Salidas"]
[null,null,null,null,"2.2.1.-","Equipamiento propio",null,null,null,{"$f":"'SA-03 (1)'!V44","v":242.12}]
[]
[]
[null,null,"3.1.-","SUPERVISIÓN del T.I. TRANSPORTEL  - La Rioja Sur",null,null,null,null,null,{"$f":"'SUP-TRANSPORTEL'!I44","v":272.5775993232258}]
[]
[]
[null,null,null,null,null,null,"TOTAL ",{"$f":"SUM(J18:J30)","v":177790.38759932324}]
[]
[null,null,"Valores remuneratorios según Acuerdo SE - ENRE -TRANSNOA 2016-2017"]

{"sheet":"LI-03 (1)","index":1,"n_rows":39,"n_cols":27,"rows_kept":39,"cut":false,"hidden":false,"merged":[]}
[]
[null,{"$f":"+'TOT-0316'!B2","v":"ANEXO VI  al Memorsndum   D.T.E.E. N°     356    / 2017"}]
[]
[" ENTE NACIONAL REGULADOR "]
["       DE LA ELECTRICIDAD"]
[]
[]
[null,null,null,null,null,"SISTEMA DE TRANSPORTE DE ENERGÍA ELÉCTRICA POR DISTRIBUCIÓN TRONCAL - TRANSNOA S.A."]
[]
[null,null,null,null,null,"1.- LÍNEAS"]
[]
[null,null,null,null,null,"1.1.- Equipamiento propio"]
[]
[null,{"$f":"'TOT-0316'!B14","v":"Desde el 01 al 31 de Marzo de 2016"}]
[]
[null,null,null,null,null,"$/100 km-h : LINEAS 132 kV ",514.20399999999995,null,null,null,"FACTOR DE PENALIZACION  K =",{"$f":"30*'TOT-0316'!B13","v":30},{"$f":"IF(L16=30,\" \",IF(L16=60,\"Coeficiente duplicado por tasa de falla >4 Sal. x año/100 km.\",\"REVISAR COEFICIENTE\"))","v":" "}]
[null,null,3,4,5,6,7,8,9,10,11,12,13,14,15,16,17,18,19,20,21,22,23,24,25,26,27]
[null,null,"N°","INDISP","ID EQUIPO","LÍNEAS","U\n[kV]","Long.\n[km]","$/h","Salida","Entrada","Hs. \nIndisp","Minutos\nIndisp.","Tipo \nSal.(²)","C.R.\n%","PENALIZ.\nPROGRAM.","REDUCC.\nPROGRAM.","PENALIZACION FORZADA\nPor Salida    1ras. 3 hs.   hs. Restantes",null,null,"REDUCC. FORZADA\nPor Salida     1ras. 3 hs.     hs. Restantes",null,null,"RESTANTE\nFORZADA","REDUCC.\nRESTANTE","Informó\nen Térm.","TOTAL\nPENALIZAC."]
[]
[]
[null,null,1,299985,5522,"SENDA HACHADA - TARTAGAL",132,58.5,{"$f":"$G$16/100*IF(H21>25,H21,25)","v":300.80933999999996},"2016-03-01T02:44:00","2016-03-01T02:47:00",{"$f":"IF(F21=\"\",\"\",(K21-J21)*24)","v":4.9999999988358468E-2},{"$f":"IF(F21=\"\",\"\",ROUND((K21-J21)*24*60,0))","v":3},"F",{"$f":"IF(F21=\"\",\"\",\"--\")","v":"--"},{"$f":"IF(N21=\"P\",ROUND(M21/60,2)*I21*$L$16*0.01,\"--\")","v":"--"},{"$f":"IF(N21=\"RP\",I21*O21*ROUND(L21/60,2)*0.01*M21/100,\"--\")","v":"--"},{"$f":"IF(N21=\"F\",I21*$L$16,\"--\")","v":9024.2801999999992},{"$f":"IF(AND(M21>10,N21=\"F\"),I21*$L$16*IF(M21>180,3,ROUND((M21)/60,2)),\"--\")","v":"--"},{"$f":"IF(AND(M21>180,N21=\"F\"),(ROUND(M21/60,2)-3)*I21*$L$16*0.1,\"--\")","v":"--"},{"$f":"IF(N21=\"R\",I21*$L$16*O21/100,\"--\")","v":"--"},{"$f":"IF(AND(M21>10,N21=\"R\"),I21*$L$16*O21/100*IF(M21>180,3,ROUND(M21/60,2)),\"--\")","v":"--"},{"$f":"IF(AND(M21>180,N21=\"R\"),(ROUND(M21/60,2)-3)*I21*$L$16*0.1*O21/100,\"--\")","v":"--"},{"$f":"IF(N21=\"RF\",ROUND(M21/60,2)*I21*$L$16*0.1,\"--\")","v":"--"},{"$f":"IF(N21=\"RR\",ROUND(M21/60,2)*I21*$L$16*0.1*O21/100,\"--\")","v":"--"},"SI",{"$f":"IF(F21=\"\",\"\",SUM(P21:Y21)*IF(Z21=\"SI\",1,2))","v":9024.2801999999992}]
[null,null,2,299987,5482,"EL BRACHO - TERMAS NORTE",132,78.400000000000006,403.13593600000002,"2016-03-01T08:11:00","2016-03-01T15:26:00",7.2500000000582077,435,"P","--",876.82066080000004,"--","--","--","--","--","--","--","--","--","SI",876.82066080000004]
[null,null,3,299989,5522,"SENDA HACHADA - TARTAGAL",132,58.5,300.80933999999996,"2016-03-02T06:39:00","2016-03-02T06:44:00",8.3333333255723119E-2,5,"F","--","--","--",9024.2801999999992,"--","--","--","--","--","--","--","SI",9024.2801999999992]
[null,null,4,299992,5482,"EL BRACHO - TERMAS NORTE",132,78.400000000000006,403.13593600000002,"2016-03-02T07:52:00","2016-03-02T15:58:00",8.1000000000349246,486,"P","--",979.62032448000002,"--","--","--","--","--","--","--","--","--","SI",979.62032448000002]
[null,null,5,300007,291,"LIBERTADOR NOA - PICHANAL",132,76,390.79503999999997,"2016-03-03T03:31:00","2016-03-03T03:35:00",6.6666666709352285E-2,4,"F","--","--","--",11723.851199999999,"--","--","--","--","--","--","--","SI",11723.851199999999]
[null,null,6,300020,5482,"EL BRACHO - TERMAS NORTE",132,78.400000000000006,403.13593600000002,"2016-03-03T07:53:00","2016-03-03T15:54:00",8.0166666666045785,481,"P","--",969.94506201600007,"--","--","--","--","--","--","--","--","--","SI",969.94506201600007]
[null,null,7,300021,5522,"SENDA HACHADA - TARTAGAL",132,58.5,300.80933999999996,"2016-03-04T05:06:00","2016-03-04T06:38:00",1.5333333332673647,92,"P","--",138.07148705999998,"--","--","--","--","--","--","--","--","--","SI",138.07148705999998]
[null,null,8,300025,5482,"EL BRACHO - TERMAS NORTE",132,78.400000000000006,403.13593600000002,"2016-03-04T08:20:00","2016-03-04T15:28:00",7.1333333333604969,428,"P","--",862.30776710399994,"--","--","--","--","--","--","--","--","--","SI",862.30776710399994]
[null,null,9,300026,309,"TUCUMAN OESTE - TUCUMAN NORTE",132,7,128.55099999999999,"2016-03-04T23:42:00","2016-03-05T00:43:00",1.0166666666627862,61,"F","--","--","--",3856.5299999999997,3933.6605999999997,"--","--","--","--","--","--","SI",7790.1905999999999]
[null,null,10,300083,5565,"SANTIAGO CENTRO - SANTIAGO ESTE",132,10.66,128.55099999999999,"2016-03-07T07:59:00","2016-03-07T09:42:00",{"$f":"IF(F30=\"\",\"\",(K30-J30)*24)","v":1.7166666666744277},{"$f":"IF(F30=\"\",\"\",ROUND((K30-J30)*24*60,0))","v":103},"P","--",66.332315999999992,"--","--","--","--","--","--","--","--","--","SI",66.332315999999992]
[null,null,11,300084,311,"AGUILARES - VILLA QUINTEROS",132,21,128.55099999999999,"2016-03-07T09:02:00","2016-03-07T17:03:00",8.0166666667792015,481,"P","--",309.29370599999993,"--","--","--","--","--","--","--","--","--","SI",309.29370599999993]
[null,null,12,300110,308,"C.H. EL CADILLAL - TUCUMAN NORTE",132,21.780000686645508,128.55099999999999,"2016-03-08T02:21:00","2016-03-08T03:01:00",0.66666666674427688,40,"F","--","--","--",3856.5299999999997,2583.8751000000002,"--","--","--","--","--","--","SI",6440.4050999999999]
[null,null,13,300114,4788,"INDEPENDENCIA- LULES - PAPEL. TUC.",132,19.299999237060547,128.55099999999999,"2016-03-10T08:28:00","2016-03-10T17:29:00",9.0166666667209938,541,"P","--",347.85900600000002,"--","--","--","--","--","--","--","--","--","SI",347.85900600000002]
[null,null,14,300115,5295,"EL BRACHO - LA GUARIDA - LA BANDA ESTE",132,140.9,724.51343599999996,"2016-03-10T09:03:00","2016-03-10T16:20:00",{"$f":"IF(F34=\"\",\"\",(K34-J34)*24)","v":7.2833333333255723},{"$f":"IF(F34=\"\",\"\",ROUND((K34-J34)*24*60,0))","v":437},"P",{"$f":"IF(F34=\"\",\"\",\"--\")","v":"--"},{"$f":"IF(N34=\"P\",ROUND(M34/60,2)*I34*$L$16*0.01,\"--\")","v":1582.3373442239999},{"$f":"IF(N34=\"RP\",I34*O34*ROUND(L34/60,2)*0.01*M34/100,\"--\")","v":"--"},{"$f":"IF(N34=\"F\",I34*$L$16,\"--\")","v":"--"},{"$f":"IF(AND(M34>10,N34=\"F\"),I34*$L$16*IF(M34>180,3,ROUND((M34)/60,2)),\"--\")","v":"--"},{"$f":"IF(AND(M34>180,N34=\"F\"),(ROUND(M34/60,2)-3)*I34*$L$16*0.1,\"--\")","v":"--"},{"$f":"IF(N34=\"R\",I34*$L$16*O34/100,\"--\")","v":"--"},{"$f":"IF(AND(M34>10,N34=\"R\"),I34*$L$16*O34/100*IF(M34>180,3,ROUND(M34/60,2)),\"--\")","v":"--"},{"$f":"IF(AND(M34>180,N34=\"R\"),(ROUND(M34/60,2)-3)*I34*$L$16*0.1*O34/100,\"--\")","v":"--"},{"$f":"IF(N34=\"RF\",ROUND(M34/60,2)*I34*$L$16*0.1,\"--\")","v":"--"},{"$f":"IF(N34=\"RR\",ROUND(M34/60,2)*I34*$L$16*0.1*O34/100,\"--\")","v":"--"},"SI",{"$f":"IF(F34=\"\",\"\",SUM(P34:Y34)*IF(Z34=\"SI\",1,2))","v":1582.3373442239999}]
[null,null,15,300116,4811,"ROSARIO DE LA FRONTERA - COBOS",132,130.4,670.52201600000001,"2016-03-10T10:04:00","2016-03-10T13:21:00",{"$f":"IF(F35=\"\",\"\",(K35-J35)*24)","v":3.28333333338378},{"$f":"IF(F35=\"\",\"\",ROUND((K35-J35)*24*60,0))","v":197},"P",{"$f":"IF(F35=\"\",\"\",\"--\")","v":"--"},{"$f":"IF(N35=\"P\",ROUND(M35/60,2)*I35*$L$16*0.01,\"--\")","v":659.7936637439999},{"$f":"IF(N35=\"RP\",I35*O35*ROUND(L35/60,2)*0.01*M35/100,\"--\")","v":"--"},{"$f":"IF(N35=\"F\",I35*$L$16,\"--\")","v":"--"},{"$f":"IF(AND(M35>10,N35=\"F\"),I35*$L$16*IF(M35>180,3,ROUND((M35)/60,2)),\"--\")","v":"--"},{"$f":"IF(AND(M35>180,N35=\"F\"),(ROUND(M35/60,2)-3)*I35*$L$16*0.1,\"--\")","v":"--"},{"$f":"IF(N35=\"R\",I35*$L$16*O35/100,\"--\")","v":"--"},{"$f":"IF(AND(M35>10,N35=\"R\"),I35*$L$16*O35/100*IF(M35>180,3,ROUND(M35/60,2)),\"--\")","v":"--"},{"$f":"IF(AND(M35>180,N35=\"R\"),(ROUND(M35/60,2)-3)*I35*$L$16*0.1*O35/100,\"--\")","v":"--"},{"$f":"IF(N35=\"RF\",ROUND(M35/60,2)*I35*$L$16*0.1,\"--\")","v":"--"},{"$f":"IF(N35=\"RR\",ROUND(M35/60,2)*I35*$L$16*0.1*O35/100,\"--\")","v":"--"},"SI",{"$f":"IF(F35=\"\",\"\",SUM(P35:Y35)*IF(Z35=\"SI\",1,2))","v":659.7936637439999}]
[null,null,16,300119,4558,"SUNCHO CORRAL - ANATUYA",132,81,416.50523999999996,"2016-03-10T14:28:00","2016-03-10T16:50:00",{"$f":"IF(F36=\"\",\"\",(K36-J36)*24)","v":2.3666666666977108},{"$f":"IF(F36=\"\",\"\",ROUND((K36-J36)*24*60,0))","v":142},"P",{"$f":"IF(F36=\"\",\"\",\"--\")","v":"--"},{"$f":"IF(N36=\"P\",ROUND(M36/60,2)*I36*$L$16*0.01,\"--\")","v":296.13522563999999},{"$f":"IF(N36=\"RP\",I36*O36*ROUND(L36/60,2)*0.01*M36/100,\"--\")","v":"--"},{"$f":"IF(N36=\"F\",I36*$L$16,\"--\")","v":"--"},{"$f":"IF(AND(M36>10,N36=\"F\"),I36*$L$16*IF(M36>180,3,ROUND((M36)/60,2)),\"--\")","v":"--"},{"$f":"IF(AND(M36>180,N36=\"F\"),(ROUND(M36/60,2)-3)*I36*$L$16*0.1,\"--\")","v":"--"},{"$f":"IF(N36=\"R\",I36*$L$16*O36/100,\"--\")","v":"--"},{"$f":"IF(AND(M36>10,N36=\"R\"),I36*$L$16*O36/100*IF(M36>180,3,ROUND(M36/60,2)),\"--\")","v":"--"},{"$f":"IF(AND(M36>180,N36=\"R\"),(ROUND(M36/60,2)-3)*I36*$L$16*0.1*O36/100,\"--\")","v":"--"},{"$f":"IF(N36=\"RF\",ROUND(M36/60,2)*I36*$L$16*0.1,\"--\")","v":"--"},{"$f":"IF(N36=\"RR\",ROUND(M36/60,2)*I36*$L$16*0.1*O36/100,\"--\")","v":"--"},"SI",{"$f":"IF(F36=\"\",\"\",SUM(P36:Y36)*IF(Z36=\"SI\",1,2))","v":296.13522563999999}]
[]
[]
[null,null,"(²)","P - PROGRAMADA  ; F - FORZADA",null,null,null,null,null,null,null,null,null,null,null,{"$f":"SUM(P19:P38)","v":7088.5165630679994},0,37485.471599999997,6517.5357000000004,0,0,0,0,0,0,null,{"$f":"ROUND(SUM(AA19:AA38),2)","v":51091.519999999997}]

{"sheet":"LI-03 (2)","index":2,"n_rows":41,"n_cols":27,"rows_kept":41,"cut":false,"hidden":false,"merged":[]}
[]
[null,{"$f":"+'TOT-0316'!B2","v":"ANEXO VI  al Memorsndum   D.T.E.E. N°     356    / 2017"}]
[]
[" ENTE NACIONAL REGULADOR "]
["       DE LA ELECTRICIDAD"]
[]
[]
[null,null,null,null,null,"SISTEMA DE TRANSPORTE DE ENERGÍA ELÉCTRICA POR DISTRIBUCIÓN TRONCAL - TRANSNOA S.A."]
[]
[null,null,null,null,null,"1.- LÍNEAS"]
[]
[null,null,null,null,null,"1.1.- Equipamiento propio"]
[]
[null,{"$f":"'TOT-0316'!B14","v":"Desde el 01 al 31 de Marzo de 2016"}]
[]
[null,null,null,null,null,"$/100 km-h : LINEAS 132 kV ",514.20399999999995,null,null,null,"FACTOR DE PENALIZACION  K =",{"$f":"30*'TOT-0316'!B13","v":30},{"$f":"IF(L16=30,\" \",IF(L16=60,\"Coeficiente duplicado por tasa de falla >4 Sal. x año/100 km.\",\"REVISAR COEFICIENTE\"))","v":" "}]
[null,null,3,4,5,6,7,8,9,10,11,12,13,14,15,16,17,18,19,20,21,22,23,24,25,26,27]
[null,null,"N°","INDISP","ID EQUIPO","LÍNEAS","U\n[kV]","Long.\n[km]","$/h","Salida","Entrada","Hs. \nIndisp","Minutos\nIndisp.","Tipo \nSal.(²)","C.R.\n%","PENALIZ.\nPROGRAM.","REDUCC.\nPROGRAM.","PENALIZACION FORZADA\nPor Salida    1ras. 3 hs.   hs. Restantes",null,null,"REDUCC. FORZADA\nPor Salida     1ras. 3 hs.     hs. Restantes",null,null,"RESTANTE\nFORZADA","REDUCC.\nRESTANTE","Informó\nen Térm.","TOTAL\nPENALIZAC."]
[null,null,null,null,null,null,null,null,null,null,null,null,null,null,null,null,null,null,null,null,null,null,null,null,null,null,{"$f":"'LI-03 (1)'!AA39","v":51091.519999999997}]
[]
[null,null,17,300323,5554,"STGO. CENTRO - FERNANDEZ - SUNCHO CORRAL",132,103,{"$f":"$G$16/100*IF(H21>25,H21,25)","v":529.63011999999992},"2016-03-17T12:39:00","2016-03-17T13:09:00",{"$f":"IF(F21=\"\",\"\",(K21-J21)*24)","v":0.50000000005820766},{"$f":"IF(F21=\"\",\"\",ROUND((K21-J21)*24*60,0))","v":30},"F",{"$f":"IF(F21=\"\",\"\",\"--\")","v":"--"},{"$f":"IF(N21=\"P\",ROUND(M21/60,2)*I21*$L$16*0.01,\"--\")","v":"--"},{"$f":"IF(N21=\"RP\",I21*O21*ROUND(L21/60,2)*0.01*M21/100,\"--\")","v":"--"},{"$f":"IF(N21=\"F\",I21*$L$16,\"--\")","v":15888.903599999998},{"$f":"IF(AND(M21>10,N21=\"F\"),I21*$L$16*IF(M21>180,3,ROUND((M21)/60,2)),\"--\")","v":7944.4517999999989},{"$f":"IF(AND(M21>180,N21=\"F\"),(ROUND(M21/60,2)-3)*I21*$L$16*0.1,\"--\")","v":"--"},{"$f":"IF(N21=\"R\",I21*$L$16*O21/100,\"--\")","v":"--"},{"$f":"IF(AND(M21>10,N21=\"R\"),I21*$L$16*O21/100*IF(M21>180,3,ROUND(M21/60,2)),\"--\")","v":"--"},{"$f":"IF(AND(M21>180,N21=\"R\"),(ROUND(M21/60,2)-3)*I21*$L$16*0.1*O21/100,\"--\")","v":"--"},{"$f":"IF(N21=\"RF\",ROUND(M21/60,2)*I21*$L$16*0.1,\"--\")","v":"--"},{"$f":"IF(N21=\"RR\",ROUND(M21/60,2)*I21*$L$16*0.1*O21/100,\"--\")","v":"--"},"SI",{"$f":"IF(F21=\"\",\"\",SUM(P21:Y21)*IF(Z21=\"SI\",1,2))","v":23833.355399999997}]
[null,null,18,300324,291,"LIBERTADOR NOA - PICHANAL",132,76,{"$f":"$G$16/100*IF(H22>25,H22,25)","v":390.79503999999997},"2016-03-18T06:09:00","2016-03-18T06:16:00",{"$f":"IF(F22=\"\",\"\",(K22-J22)*24)","v":0.11666666669771075},{"$f":"IF(F22=\"\",\"\",ROUND((K22-J22)*24*60,0))","v":7},"F",{"$f":"IF(F22=\"\",\"\",\"--\")","v":"--"},{"$f":"IF(N22=\"P\",ROUND(M22/60,2)*I22*$L$16*0.01,\"--\")","v":"--"},{"$f":"IF(N22=\"RP\",I22*O22*ROUND(L22/60,2)*0.01*M22/100,\"--\")","v":"--"},{"$f":"IF(N22=\"F\",I22*$L$16,\"--\")","v":11723.851199999999},{"$f":"IF(AND(M22>10,N22=\"F\"),I22*$L$16*IF(M22>180,3,ROUND((M22)/60,2)),\"--\")","v":"--"},{"$f":"IF(AND(M22>180,N22=\"F\"),(ROUND(M22/60,2)-3)*I22*$L$16*0.1,\"--\")","v":"--"},{"$f":"IF(N22=\"R\",I22*$L$16*O22/100,\"--\")","v":"--"},{"$f":"IF(AND(M22>10,N22=\"R\"),I22*$L$16*O22/100*IF(M22>180,3,ROUND(M22/60,2)),\"--\")","v":"--"},{"$f":"IF(AND(M22>180,N22=\"R\"),(ROUND(M22/60,2)-3)*I22*$L$16*0.1*O22/100,\"--\")","v":"--"},{"$f":"IF(N22=\"RF\",ROUND(M22/60,2)*I22*$L$16*0.1,\"--\")","v":"--"},{"$f":"IF(N22=\"RR\",ROUND(M22/60,2)*I22*$L$16*0.1*O22/100,\"--\")","v":"--"},"SI",{"$f":"IF(F22=\"\",\"\",SUM(P22:Y22)*IF(Z22=\"SI\",1,2))","v":11723.851199999999}]
[null,null,19,300348,4837,"RIO HONDO - SANTIAGO OESTE",132,69.800003051757812,358.91440769226074,"2016-03-18T13:29:00","2016-03-18T15:58:00",2.4833333333954215,149,"F","--","--","--",10767.432230767823,26703.231932304199,"--","--","--","--","--","--","SI",37470.664163072026]
[null,null,20,300349,281,"GÜEMES - SAN JUANCITO",132,36.200000000000003,186.14184800000001,"2016-03-18T18:27:00","2016-03-18T18:28:00",1.6666666546370834E-2,1,"F","--","--","--",5584.2554399999999,"--","--","--","--","--","--","--","SI",5584.2554399999999]
[null,null,21,300356,5521,"SENDA HACHADA - PICHANAL",132,46.5,239.10485999999997,"2016-03-20T01:34:00","2016-03-20T01:38:00",6.6666666709352285E-2,4,"F","--","--","--",7173.1457999999993,"--","--","--","--","--","--","--","SI",7173.1457999999993]
[null,null,22,300534,305,"TUCUMAN NORTE - EL BRACHO",132,31.5,161.97425999999999,"2016-03-23T08:17:00","2016-03-23T15:23:00",7.1000000000931323,426,"P","--",345.00517379999997,"--","--","--","--","--","--","--","--","--","SI",345.00517379999997]
[null,null,23,300731,283,"HUACRA - LA CALERA",132,21.399999618530273,128.55099999999999,"2016-03-29T07:44:00","2016-03-29T16:30:00",8.7666666666045785,526,"P","--",338.21768099999997,"--","--","--","--","--","--","--","--","--","SI",338.21768099999997]
[null,null,24,300738,5139,"CATAMARCA - V. VIEJO - HUACRA",132,67.3,346.05929199999997,"2016-03-30T03:00:00","2016-03-30T04:40:00",1.6666666666860692,100,"P","--",173.37570529199996,"--","--","--","--","--","--","--","--","--","SI",173.37570529199996]
[null,null,25,300742,5521,"SENDA HACHADA - PICHANAL",132,46.5,239.10485999999997,"2016-03-30T06:53:00","2016-03-30T07:02:00",0.1499999999650754,9,"F","--","--","--",7173.1457999999993,"--","--","--","--","--","--","--","SI",7173.1457999999993]
[null,null,26,300749,283,"HUACRA - LA CALERA",132,21.399999618530273,128.55099999999999,"2016-03-30T07:46:00","2016-03-30T15:33:00",7.78333333338378,467,"P","--",300.03803399999998,"--","--","--","--","--","--","--","--","--","SI",300.03803399999998]
[null,null,27,300753,5139,"CATAMARCA - V. VIEJO - HUACRA",132,67.3,346.05929199999997,"2016-03-31T03:01:00","2016-03-31T04:21:00",1.3333333333139308,80,"P","--",138.07765750799999,"--","--","--","--","--","--","--","--","--","SI",138.07765750799999]
[null,null,28,300754,283,"HUACRA - LA CALERA",132,21.399999618530273,128.55099999999999,"2016-03-31T07:49:00","2016-03-31T15:11:00",7.3666666667559184,442,"P","--",284.22626099999997,"--","--","--","--","--","--","--","--","--","SI",284.22626099999997]
[null,null,null,null,null,null,null,null,128.55099999999999,null,null,"","",null,"","--","--","--","--","--","--","--","--","--","--",null,""]
[null,null,null,null,null,null,null,null,128.55099999999999,null,null,"","",null,"","--","--","--","--","--","--","--","--","--","--",null,""]
[null,null,null,null,null,null,null,null,128.55099999999999,null,null,"","",null,"","--","--","--","--","--","--","--","--","--","--",null,""]
[null,null,null,null,null,null,null,null,128.55099999999999,null,null,"","",null,"","--","--","--","--","--","--","--","--","--","--",null,""]
[null,null,null,null,null,null,null,null,128.55099999999999,null,null,{"$f":"IF(F37=\"\",\"\",(K37-J37)*24)","v":""},{"$f":"IF(F37=\"\",\"\",ROUND((K37-J37)*24*60,0))","v":""},null,{"$f":"IF(F37=\"\",\"\",\"--\")","v":""},{"$f":"IF(N37=\"P\",ROUND(M37/60,2)*I37*$L$16*0.01,\"--\")","v":"--"},{"$f":"IF(N37=\"RP\",I37*O37*ROUND(L37/60,2)*0.01*M37/100,\"--\")","v":"--"},{"$f":"IF(N37=\"F\",I37*$L$16,\"--\")","v":"--"},{"$f":"IF(AND(M37>10,N37=\"F\"),I37*$L$16*IF(M37>180,3,ROUND((M37)/60,2)),\"--\")","v":"--"},{"$f":"IF(AND(M37>180,N37=\"F\"),(ROUND(M37/60,2)-3)*I37*$L$16*0.1,\"--\")","v":"--"},{"$f":"IF(N37=\"R\",I37*$L$16*O37/100,\"--\")","v":"--"},{"$f":"IF(AND(M37>10,N37=\"R\"),I37*$L$16*O37/100*IF(M37>180,3,ROUND(M37/60,2)),\"--\")","v":"--"},{"$f":"IF(AND(M37>180,N37=\"R\"),(ROUND(M37/60,2)-3)*I37*$L$16*0.1*O37/100,\"--\")","v":"--"},{"$f":"IF(N37=\"RF\",ROUND(M37/60,2)*I37*$L$16*0.1,\"--\")","v":"--"},{"$f":"IF(N37=\"RR\",ROUND(M37/60,2)*I37*$L$16*0.1*O37/100,\"--\")","v":"--"},null,{"$f":"IF(F37=\"\",\"\",SUM(P37:Y37)*IF(Z37=\"SI\",1,2))","v":""}]
[null,null,null,null,null,null,null,null,128.55099999999999,null,null,{"$f":"IF(F38=\"\",\"\",(K38-J38)*24)","v":""},{"$f":"IF(F38=\"\",\"\",ROUND((K38-J38)*24*60,0))","v":""},null,{"$f":"IF(F38=\"\",\"\",\"--\")","v":""},{"$f":"IF(N38=\"P\",ROUND(M38/60,2)*I38*$L$16*0.01,\"--\")","v":"--"},{"$f":"IF(N38=\"RP\",I38*O38*ROUND(L38/60,2)*0.01*M38/100,\"--\")","v":"--"},{"$f":"IF(N38=\"F\",I38*$L$16,\"--\")","v":"--"},{"$f":"IF(AND(M38>10,N38=\"F\"),I38*$L$16*IF(M38>180,3,ROUND((M38)/60,2)),\"--\")","v":"--"},{"$f":"IF(AND(M38>180,N38=\"F\"),(ROUND(M38/60,2)-3)*I38*$L$16*0.1,\"--\")","v":"--"},{"$f":"IF(N38=\"R\",I38*$L$16*O38/100,\"--\")","v":"--"},{"$f":"IF(AND(M38>10,N38=\"R\"),I38*$L$16*O38/100*IF(M38>180,3,ROUND(M38/60,2)),\"--\")","v":"--"},{"$f":"IF(AND(M38>180,N38=\"R\"),(ROUND(M38/60,2)-3)*I38*$L$16*0.1*O38/100,\"--\")","v":"--"},{"$f":"IF(N38=\"RF\",ROUND(M38/60,2)*I38*$L$16*0.1,\"--\")","v":"--"},{"$f":"IF(N38=\"RR\",ROUND(M38/60,2)*I38*$L$16*0.1*O38/100,\"--\")","v":"--"},null,{"$f":"IF(F38=\"\",\"\",SUM(P38:Y38)*IF(Z38=\"SI\",1,2))","v":""}]
[null,null,null,null,null,null,null,null,128.55099999999999,null,null,{"$f":"IF(F39=\"\",\"\",(K39-J39)*24)","v":""},{"$f":"IF(F39=\"\",\"\",ROUND((K39-J39)*24*60,0))","v":""},null,{"$f":"IF(F39=\"\",\"\",\"--\")","v":""},{"$f":"IF(N39=\"P\",ROUND(M39/60,2)*I39*$L$16*0.01,\"--\")","v":"--"},{"$f":"IF(N39=\"RP\",I39*O39*ROUND(L39/60,2)*0.01*M39/100,\"--\")","v":"--"},{"$f":"IF(N39=\"F\",I39*$L$16,\"--\")","v":"--"},{"$f":"IF(AND(M39>10,N39=\"F\"),I39*$L$16*IF(M39>180,3,ROUND((M39)/60,2)),\"--\")","v":"--"},{"$f":"IF(AND(M39>180,N39=\"F\"),(ROUND(M39/60,2)-3)*I39*$L$16*0.1,\"--\")","v":"--"},{"$f":"IF(N39=\"R\",I39*$L$16*O39/100,\"--\")","v":"--"},{"$f":"IF(AND(M39>10,N39=\"R\"),I39*$L$16*O39/100*IF(M39>180,3,ROUND(M39/60,2)),\"--\")","v":"--"},{"$f":"IF(AND(M39>180,N39=\"R\"),(ROUND(M39/60,2)-3)*I39*$L$16*0.1*O39/100,\"--\")","v":"--"},{"$f":"IF(N39=\"RF\",ROUND(M39/60,2)*I39*$L$16*0.1,\"--\")","v":"--"},{"$f":"IF(N39=\"RR\",ROUND(M39/60,2)*I39*$L$16*0.1*O39/100,\"--\")","v":"--"},null,{"$f":"IF(F39=\"\",\"\",SUM(P39:Y39)*IF(Z39=\"SI\",1,2))","v":""}]
[]
[null,null,"(²)","P - PROGRAMADA  ; F - FORZADA",null,null,null,null,null,null,null,null,null,null,null,{"$f":"SUM(P19:P40)","v":1578.9405125999997},0,58310.734070767816,34647.683732304198,0,0,0,0,0,0,null,{"$f":"ROUND(SUM(AA19:AA40),2)","v":145628.88}]

{"sheet":"LI-TRANSPORTEL-03 (1)","index":3,"n_rows":42,"n_cols":27,"rows_kept":42,"cut":false,"hidden":false,"merged":[]}
[]
[null,{"$f":"'TOT-0316'!B2","v":"ANEXO VI  al Memorsndum   D.T.E.E. N°     356    / 2017"}]
[]
[" ENTE NACIONAL REGULADOR "]
["       DE LA ELECTRICIDAD"]
[]
[]
[null,null,null,null,null,"SISTEMA DE TRANSPORTE DE ENERGÍA ELÉCTRICA POR DISTRIBUCIÓN TRONCAL - TRANSNOA S.A."]
[]
[null,null,null,null,null,"1.- LÍNEAS"]
[]
[null,null,null,null,null,"1.2.- Transp. Indep.TRANSPORTEL -La Rioja Sur."]
[]
[null,{"$f":"'TOT-0316'!B14","v":"Desde el 01 al 31 de Marzo de 2016"}]
[]
[null,null,null,null,null,"$/100 km-h : LINEAS 132 kV ",62.8386,null,null,null,"FACTOR DE PENALIZACION  K =",{"$f":"30*'TOT-0316'!B13","v":30},{"$f":"IF(L16=30,\" \",IF(L16=60,\"Coeficiente duplicado por tasa de falla >4 Sal. x año/100 km.\",\"REVISAR COEFICIENTE\"))","v":" "}]
[null,null,3,4,5,6,7,8,9,10,11,12,13,14,15,16,17,18,19,20,21,22,23,24,25,26,27]
[null,null,"N°","INDISP","ID EQUIPO","LÍNEAS","U\n[kV]","Long.\n[km]","$/h","Salida","Entrada","Hs. \nIndisp","Minutos\nIndisp.","Tipo \nSal.(²)","C.R.\n%","PENALIZ.\nPROGRAM.","REDUCC.\nPROGRAM.","PENALIZACION FORZADA\nPor Salida    1ras. 3 hs.   hs. Restantes",null,null,"REDUCC. FORZADA\nPor Salida     1ras. 3 hs.     hs. Restantes",null,null,"RESTANTE\nFORZADA","REDUCC.\nRESTANTE","Informó\nen Térm.","TOTAL\nPENALIZAC."]
[]
[]
[null,null,29,300109,4942,"LA RIOJA SUR - PI. PATQUIA",132,40,{"$f":"$G$16/100*IF(H21>25,H21,25)","v":25.135439999999999},"2016-03-07T21:30:00","2016-03-07T21:38:00",{"$f":"IF(F21=\"\",\"\",(K21-J21)*24)","v":0.13333333324408159},{"$f":"IF(F21=\"\",\"\",ROUND((K21-J21)*24*60,0))","v":8},"F",{"$f":"IF(F21=\"\",\"\",\"--\")","v":"--"},{"$f":"IF(N21=\"P\",ROUND(M21/60,2)*I21*$L$16*0.01,\"--\")","v":"--"},{"$f":"IF(N21=\"RP\",I21*O21*ROUND(L21/60,2)*0.01*M21/100,\"--\")","v":"--"},{"$f":"IF(N21=\"F\",I21*$L$16,\"--\")","v":754.06319999999994},{"$f":"IF(AND(M21>10,N21=\"F\"),I21*$L$16*IF(M21>180,3,ROUND((M21)/60,2)),\"--\")","v":"--"},{"$f":"IF(AND(M21>180,N21=\"F\"),(ROUND(M21/60,2)-3)*I21*$L$16*0.1,\"--\")","v":"--"},{"$f":"IF(N21=\"R\",I21*$L$16*O21/100,\"--\")","v":"--"},{"$f":"IF(AND(M21>10,N21=\"R\"),I21*$L$16*O21/100*IF(M21>180,3,ROUND(M21/60,2)),\"--\")","v":"--"},{"$f":"IF(AND(M21>180,N21=\"R\"),(ROUND(M21/60,2)-3)*I21*$L$16*0.1*O21/100,\"--\")","v":"--"},{"$f":"IF(N21=\"RF\",ROUND(M21/60,2)*I21*$L$16*0.1,\"--\")","v":"--"},{"$f":"IF(N21=\"RR\",ROUND(M21/60,2)*I21*$L$16*0.1*O21/100,\"--\")","v":"--"},"SI",{"$f":"IF(F21=\"\",\"\",SUM(P21:Y21)*IF(Z21=\"SI\",1,2))","v":754.06319999999994}]
[null,null,null,null,null,null,null,null,{"$f":"$G$16/100*IF(H22>25,H22,25)","v":15.70965},null,null,"","",null,"","--","--","--","--","--","--","--","--","--","--",{"$f":"IF(F22=\"\",\"\",\"SI\")","v":""},""]
[null,null,null,null,null,null,null,null,15.70965,null,null,"","",null,"","--","--","--","--","--","--","--","--","--","--","",""]
[null,null,null,null,null,null,null,null,15.70965,null,null,"","",null,"","--","--","--","--","--","--","--","--","--","--","",""]
[null,null,null,null,null,null,null,null,15.70965,null,null,"","",null,"","--","--","--","--","--","--","--","--","--","--","",""]
[null,null,null,null,null,null,null,null,15.70965,null,null,"","",null,"","--","--","--","--","--","--","--","--","--","--","",""]
[null,null,null,null,null,null,null,null,15.70965,null,null,"","",null,"","--","--","--","--","--","--","--","--","--","--","",""]
[null,null,null,null,null,null,null,null,15.70965,null,null,"","",null,"","--","--","--","--","--","--","--","--","--","--","",""]
[null,null,null,null,null,null,null,null,15.70965,null,null,"","",null,"","--","--","--","--","--","--","--","--","--","--","",""]
[null,null,null,null,null,null,null,null,15.70965,null,null,"","",null,"","--","--","--","--","--","--","--","--","--","--","",""]
[null,null,null,null,null,null,null,null,15.70965,null,null,"","",null,"","--","--","--","--","--","--","--","--","--","--","",""]
[null,null,null,null,null,null,null,null,15.70965,null,null,"","",null,"","--","--","--","--","--","--","--","--","--","--","",""]
[null,null,null,null,null,null,null,null,15.70965,null,null,"","",null,"","--","--","--","--","--","--","--","--","--","--","",""]
[null,null,null,null,null,null,null,null,15.70965,null,null,"","",null,"","--","--","--","--","--","--","--","--","--","--","",""]
[null,null,null,null,null,null,null,null,15.70965,null,null,"","",null,"","--","--","--","--","--","--","--","--","--","--","",""]
[null,null,null,null,null,null,null,null,15.70965,null,null,"","",null,"","--","--","--","--","--","--","--","--","--","--","",""]
[null,null,null,null,null,null,null,null,15.70965,null,null,"","",null,"","--","--","--","--","--","--","--","--","--","--","",""]
[null,null,null,null,null,null,null,null,15.70965,null,null,"","",null,"","--","--","--","--","--","--","--","--","--","--","",""]
[null,null,null,null,null,null,null,null,15.70965,null,null,"","",null,"","--","--","--","--","--","--","--","--","--","--","",""]
[null,null,null,null,null,null,null,null,15.70965,null,null,"","",null,"","--","--","--","--","--","--","--","--","--","--","",""]
[]
[null,null,"(²)","F - FORZADA",null,null,null,null,null,null,null,null,null,null,null,{"$f":"SUM(P19:P41)","v":0},0,754.06319999999994,0,0,0,0,0,0,0,null,{"$f":"ROUND(SUM(AA19:AA41),2)","v":754.06}]

{"sheet":"T-03 (1)","index":4,"n_rows":47,"n_cols":29,"rows_kept":47,"cut":false,"hidden":false,"merged":[]}
[]
[null,{"$f":"+'TOT-0316'!B2","v":"ANEXO VI  al Memorsndum   D.T.E.E. N°     356    / 2017"}]
[]
[" ENTE NACIONAL REGULADOR "]
["       DE LA ELECTRICIDAD"]
[]
[]
[null,null,null,null,null,"SISTEMA DE TRANSPORTE DE ENERGÍA ELÉCTRICA POR DISTRIBUCIÓN TRONCAL - TRANSNOA S.A."]
[]
[null,null,null,null,null,"2.- CONEXIÓN"]
[]
[null,null,null,null,null,"2.1.- Transformación"]
[]
[null,null,null,null,null,"2.1.1.- Equipamiento propio"]
[]
[null,{"$f":"'TOT-0316'!B14","v":"Desde el 01 al 31 de Marzo de 2016"}]
[]
[null,null,null,null,null,"Por Transformador por MVA    $ =",null,null,1.79]
[null,null,null,null,null,"Coeficiente de penalización por salida forzada   =",null,null,{"$f":"30*'TOT-0316'!B13","v":30},null,{"$f":"IF(I19=30,\" \",IF(I19=60,\"  Coeficiente duplicado por tasa de falla >4 Sal. x año/100 km.\",\"REVISAR COEFICIENTE\"))","v":" "}]
[null,null,3,4,5,6,7,8,9,10,11,12,13,14,15,16,17,18,19,20,21,22,23,24,25,26,27,28,29]
[null,null,"N°","INDISP","ID EQUIPO","ESTACIÓN\nTRANSFORMADORA","EQUIPO","POT.\n[MVA]","U\n[kV]","$/h","Salida","Entrada","Hs\nIndisp.","Mtos.\nIndisp.","Tipo \nSal.(²)","AUT.","C.R.\n%","E.N.S.","K (P;ENS)","PENALIZ.\nPROGRAM.","REDUCC.\nPROGRAM.","PENALIZAC. FORZADA\nPor Salida       hs. Restantes",null,"REDUCC. FORZADA\nPor Salida       hs. Restantes",null,"RESTANTE\nFORZADA","REDUCC.\nRESTANTE","Informó\nen Térm.","TOTAL\nPENALIZAC."]
[]
[]
[null,null,30,298245,3105,"SANTIAGO CENTRO","TRAFO 2",30,"132/33/13,2",{"$f":"H24*$I$18","v":53.7},"2016-03-01","2016-03-31T23:59:59",{"$f":"IF(F24=\"\",\"\",(L24-K24)*24)","v":743.99972222215729},{"$f":"IF(F24=\"\",\"\",ROUND((L24-K24)*24*60,0))","v":44640},"RP",{"$f":"IF(F24=\"\",\"\",IF(OR(O24=\"P\",O24=\"RP\"),\"--\",\"NO\"))","v":"--"},40,"NO",{"$f":"$I$19*IF(R24=\"SI\",1,0.1)*IF(OR(O24=\"P\",O24=\"RP\"),0.1,1)","v":0.30000000000000004},{"$f":"IF(O24=\"P\",J24*S24*ROUND(N24/60,2),\"--\")","v":"--"},{"$f":"IF(O24=\"RP\",J24*S24*Q24/100*ROUND(N24/60,2),\"--\")","v":4794.3360000000002},{"$f":"IF(AND(O24=\"F\",P24=\"NO\"),J24*S24,\"--\")","v":"--"},{"$f":"IF(O24=\"F\",J24*S24*ROUND(N24/60,2),\"--\")","v":"--"},{"$f":"IF(AND(O24=\"R\",P24=\"NO\"),J24*S24*Q24/100,\"--\")","v":"--"},{"$f":"IF(O24=\"R\",J24*S24*ROUND(N24/60,2)*Q24/100,\"--\")","v":"--"},{"$f":"IF(O24=\"RF\",J24*S24*ROUND(N24/60,2),\"--\")","v":"--"},{"$f":"IF(O24=\"RR\",J24*S24*ROUND(N24/60,2)*Q24/100,\"--\")","v":"--"},"SI",{"$f":"IF(F24=\"\",\"\",SUM(T24:AA24)*IF(AB24=\"SI\",1,2))","v":4794.3360000000002}]
[null,null,31,297468,5063,"QUIMILI","TRAFO 2",15,"132/33/13,2",26.85,"2016-03-01","2016-03-31T23:59:59",743.99972222215729,44640,"P","--","0,000","NO",0.30000000000000004,5992.920000000001,"--","--","--","--","--","--","--","SI",5992.920000000001]
[null,null,32,299993,580,"TARTAGAL","TRAFO 1",30,"132/33/13,2",53.7,"2016-03-02T11:27:00","2016-03-02T11:31:00",6.6666666709352285E-2,4,"RP","--",40,"NO",0.30000000000000004,"--",0.45108000000000009,"--","--","--","--","--","--","SI",0.45108000000000009]
[null,null,33,299996,580,"TARTAGAL","TRAFO 1",30,"132/33/13,2",53.7,"2016-03-02T15:57:00","2016-03-02T16:02:00",8.3333333430346102E-2,5,"F","NO","0,000","SI",30,"--","--",1611,128.88,"--","--","--","--","SI",1739.88]
[null,null,34,300052,3946,"CATAMARCA II","TRAFO 1",30,"132/33/13,2",53.7,"2016-03-05T05:25:00","2016-03-06T18:46:00",37.350000000034925,2241,"P","--","0,000","NO",0.30000000000000004,601.70850000000019,"--","--","--","--","--","--","--","SI",601.70850000000019]
[null,null,35,300053,4517,"CATAMARCA II","TRAFO 2",30,"132/33/13,2",53.7,"2016-03-05T05:25:00","2016-03-06T18:46:00",37.350000000034925,2241,"P","--","0,000","NO",0.30000000000000004,601.70850000000019,"--","--","--","--","--","--","--","SI",601.70850000000019]
[null,null,36,300054,4062,"JUJUY SUR","TRAFO 2",30,"132/33/13,2",53.7,"2016-03-06T08:08:00","2016-03-06T15:05:00",{"$f":"IF(F30=\"\",\"\",(L30-K30)*24)","v":6.9499999999534339},{"$f":"IF(F30=\"\",\"\",ROUND((L30-K30)*24*60,0))","v":417},"P",{"$f":"IF(F30=\"\",\"\",IF(OR(O30=\"P\",O30=\"RP\"),\"--\",\"NO\"))","v":"--"},"0,000","NO",{"$f":"$I$19*IF(R30=\"SI\",1,0.1)*IF(OR(O30=\"P\",O30=\"RP\"),0.1,1)","v":0.30000000000000004},{"$f":"IF(O30=\"P\",J30*S30*ROUND(N30/60,2),\"--\")","v":111.96450000000003},{"$f":"IF(O30=\"RP\",J30*S30*Q30/100*ROUND(N30/60,2),\"--\")","v":"--"},{"$f":"IF(AND(O30=\"F\",P30=\"NO\"),J30*S30,\"--\")","v":"--"},{"$f":"IF(O30=\"F\",J30*S30*ROUND(N30/60,2),\"--\")","v":"--"},{"$f":"IF(AND(O30=\"R\",P30=\"NO\"),J30*S30*Q30/100,\"--\")","v":"--"},{"$f":"IF(O30=\"R\",J30*S30*ROUND(N30/60,2)*Q30/100,\"--\")","v":"--"},{"$f":"IF(O30=\"RF\",J30*S30*ROUND(N30/60,2),\"--\")","v":"--"},{"$f":"IF(O30=\"RR\",J30*S30*ROUND(N30/60,2)*Q30/100,\"--\")","v":"--"},"SI",111.96450000000003]
[null,null,37,300082,5616,"PANTANILLO","TRAFO 1",30,"132/33/13,2",{"$f":"H31*$I$18","v":53.7},"2016-03-07T07:12:00","2016-03-07T07:43:00",0.5166666666045785,31,"F","NO","0,000","SI",30,"--","--",1611,837.72,"--","--","--","--","SI",{"$f":"IF(F31=\"\",\"\",SUM(T31:AA31)*IF(AB31=\"SI\",1,2))","v":2448.7200000000003}]
[null,null,38,300111,5062,"QUIMILI","TRAFO 1",15,"132/33/13,2",{"$f":"H32*$I$18","v":26.85},"2016-03-08T17:38:00","2016-03-08T18:28:00",0.83333333325572312,50,"R","NO",40,"SI",30,"--","--","--","--",322.2,267.42599999999999,"--","--","SI",589.62599999999998]
[null,null,39,300112,3694,"SANTIAGO CENTRO","TRAFO 1",30,"132/33/13,2",53.7,"2016-03-09T09:10:00","2016-03-09T10:13:00",1.0499999999301508,63,"P","--","0,000","NO",0.30000000000000004,16.915500000000005,"--","--","--","--","--","--","--","SI",16.915500000000005]
[null,null,40,300113,5746,"LULES","TRAFO 1",30,"132/33/13,2",53.7,"2016-03-10T08:10:00","2016-03-10T17:33:00",9.3833333331858739,563,"P","--","0,000","NO",0.30000000000000004,151.11180000000004,"--","--","--","--","--","--","--","SI",151.11180000000004]
[null,null,41,300117,556,"LA BANDA","TRAFO 1",30,"132/33/13,2",53.7,"2016-03-10T11:28:00","2016-03-10T12:16:00",0.79999999998835847,48,"RP","--",40,"NO",0.30000000000000004,"--",5.1552000000000007,"--","--","--","--","--","--","SI",5.1552000000000007]
[null,null,42,300118,557,"LA BANDA","TRAFO 2",30,"132/33/13,2",53.7,"2016-03-10T12:22:00","2016-03-10T12:59:00",0.61666666675591841,37,"RP","--",60,"NO",0.30000000000000004,"--",5.9929200000000016,"--","--","--","--","--","--","SI",5.9929200000000016]
[null,null,43,300313,4252,"CAFAYATE","TRAFO 1",15,"132/33/13,2",26.85,"2016-03-15T06:58:00","2016-03-15T07:19:00",0.34999999991850927,21,"F","NO","0,000","SI",30,"--","--",805.5,281.92499999999995,"--","--","--","--","SI",1087.425]
[null,null,44,300322,557,"LA BANDA","TRAFO 2",30,"132/33/13,2",53.7,"2016-03-16T10:44:00","2016-03-16T10:55:00",0.18333333323244005,11,"R","NO",60,"SI",30,"--","--","--","--",966.6,173.988,"--","--","SI",1140.588]
[null,null,45,300345,5746,"LULES","TRAFO 1",30,"132/33/13,2",53.7,"2016-03-18T13:21:00","2016-03-18T13:29:00",0.13333333324408159,8,"R","NO",40,"SI",30,"--","--","--","--",644.4,83.772000000000006,"--","--","SI",728.17200000000003]
[null,null,46,300350,3941,"SAN JUANCITO","TRAFO 2",15,"132/33/13,2",26.85,"2016-03-18T21:02:00","2016-03-18T21:15:00",0.21666666667442769,13,"F","NO","0,000","SI",30,"--","--",805.5,177.21,"--","--","--","--","SI",982.71]
[null,null,47,300353,4956,"LA PAZ","TRAFO 1",10,"132/33/13,2",17.899999999999999,"2016-03-19T18:42:00","2016-03-19T19:23:00",0.68333333329064772,41,"R","NO",60,"SI",30,"--","--","--","--",322.2,219.09600000000003,"--","--","SI",541.29600000000005]
[null,null,48,300366,3694,"SANTIAGO CENTRO","TRAFO 1",30,"132/33/13,2",53.7,"2016-03-20T08:01:00","2016-03-20T12:16:00",4.2500000000582077,255,"RP","--",40,"NO",0.30000000000000004,"--",27.387000000000004,"--","--","--","--","--","--","SI",27.387000000000004]
[null,null,49,300528,3947,"CATAMARCA","TRAFO 2",30,"132/33/13,2",{"$f":"H43*$I$18","v":53.7},"2016-03-21T22:56:00","2016-03-22T00:02:00",1.0999999999185093,66,"F","NO","0,000","SI",30,"--","--",1611,1772.1000000000001,"--","--","--","--","SI",3383.1000000000004]
[null,null,50,300533,3947,"CATAMARCA","TRAFO 2",30,"132/33/13,2",{"$f":"H44*$I$18","v":53.7},"2016-03-23","2016-03-31T23:59:00",215.98333333327901,12959,"RP","--",60,"NO",0.30000000000000004,"--",2087.6626800000004,"--","--","--","--","--","--","SI",2087.6626800000004]
[null,null,51,300537,5062,"QUIMILI","TRAFO 1",15,"132/33/13,2",26.85,"2016-03-24T03:04:00","2016-03-24T03:09:00",8.3333333255723119E-2,5,"R","NO",40,"SI",30,"--","--","--","--",322.2,25.776,"--","--","SI",347.976]
[]
[null,null,"(²)","P - PROGRAMADA  ; F - FORZADA  ; RP - REDUCCIÓN PROGRAMADA  ; R - REDUCCIÓN FORZADA",null,null,null,null,null,null,null,null,null,null,null,null,null,null,null,{"$f":"SUM(T22:T46)","v":7476.3288000000011},6920.98488,6444,3197.835,2577.5999999999995,770.05799999999999,0,0,null,{"$f":"ROUND(SUM(AC22:AC46),2)","v":27386.81}]

{"sheet":"T-03 (2)","index":5,"n_rows":52,"n_cols":29,"rows_kept":52,"cut":false,"hidden":false,"merged":[]}
[]
[null,{"$f":"+'TOT-0316'!B2","v":"ANEXO VI  al Memorsndum   D.T.E.E. N°     356    / 2017"}]
[]
[" ENTE NACIONAL REGULADOR "]
["       DE LA ELECTRICIDAD"]
[]
[]
[null,null,null,null,null,"SISTEMA DE TRANSPORTE DE ENERGÍA ELÉCTRICA POR DISTRIBUCIÓN TRONCAL - TRANSNOA S.A."]
[]
[null,null,null,null,null,"2.- CONEXIÓN"]
[]
[null,null,null,null,null,"2.1.- Transformación"]
[]
[null,null,null,null,null,"2.1.1.- Equipamiento propio"]
[]
[null,{"$f":"'TOT-0316'!B14","v":"Desde el 01 al 31 de Marzo de 2016"}]
[]
[null,null,null,null,null,"Por Transformador por MVA    $ =",null,null,1.79]
[null,null,null,null,null,"Coeficiente de penalización por salida forzada   =",null,null,{"$f":"30*'TOT-0316'!B13","v":30},null,{"$f":"IF(I19=30,\" \",IF(I19=60,\"  Coeficiente duplicado por tasa de falla >4 Sal. x año/100 km.\",\"REVISAR COEFICIENTE\"))","v":" "}]
[null,null,3,4,5,6,7,8,9,10,11,12,13,14,15,16,17,18,19,20,21,22,23,24,25,26,27,28,29]
[null,null,"N°","INDISP","ID EQUIPO","ESTACIÓN\nTRANSFORMADORA","EQUIPO","POT.\n[MVA]","U\n[kV]","$/h","Salida","Entrada","Hs\nIndisp.","Mtos.\nIndisp.","Tipo \nSal.(²)","AUT.","C.R.\n%","E.N.S.","K (P;ENS)","PENALIZ.\nPROGRAM.","REDUCC.\nPROGRAM.","PENALIZAC. FORZADA\nPor Salida       hs. Restantes",null,"REDUCC. FORZADA\nPor Salida       hs. Restantes",null,"RESTANTE\nFORZADA","REDUCC.\nRESTANTE","Informó\nen Térm.","TOTAL\nPENALIZAC."]
[null,null,null,null,null,null,null,null,null,null,null,null,null,null,null,null,null,null,null,null,null,null,null,null,null,null,null,null,{"$f":"'T-03 (1)'!AC47","v":27386.81}]
[]
[null,null,52,300542,5410,"TERMAS NORTE","TRAFO 1",15,"132/33/13,2",{"$f":"H24*$I$18","v":26.85},"2016-03-27T16:32:00","2016-03-27T16:59:00",{"$f":"IF(F24=\"\",\"\",(L24-K24)*24)","v":0.45000000006984919},{"$f":"IF(F24=\"\",\"\",ROUND((L24-K24)*24*60,0))","v":27},"F",{"$f":"IF(F24=\"\",\"\",IF(OR(O24=\"P\",O24=\"RP\"),\"--\",\"NO\"))","v":"NO"},"0,000","SI",{"$f":"$I$19*IF(R24=\"SI\",1,0.1)*IF(OR(O24=\"P\",O24=\"RP\"),0.1,1)","v":30},{"$f":"IF(O24=\"P\",J24*S24*ROUND(N24/60,2),\"--\")","v":"--"},{"$f":"IF(O24=\"RP\",J24*S24*Q24/100*ROUND(N24/60,2),\"--\")","v":"--"},{"$f":"IF(AND(O24=\"F\",P24=\"NO\"),J24*S24,\"--\")","v":805.5},{"$f":"IF(O24=\"F\",J24*S24*ROUND(N24/60,2),\"--\")","v":362.47500000000002},{"$f":"IF(AND(O24=\"R\",P24=\"NO\"),J24*S24*Q24/100,\"--\")","v":"--"},{"$f":"IF(O24=\"R\",J24*S24*ROUND(N24/60,2)*Q24/100,\"--\")","v":"--"},{"$f":"IF(O24=\"RF\",J24*S24*ROUND(N24/60,2),\"--\")","v":"--"},{"$f":"IF(O24=\"RR\",J24*S24*ROUND(N24/60,2)*Q24/100,\"--\")","v":"--"},"SI",{"$f":"IF(F24=\"\",\"\",SUM(T24:AA24)*IF(AB24=\"SI\",1,2))","v":1167.9749999999999}]
[null,null,53,300547,5410,"TERMAS NORTE","TRAFO 1",15,"132/33/13,2",{"$f":"H25*$I$18","v":26.85},"2016-03-27T18:13:00","2016-03-27T18:20:00",{"$f":"IF(F25=\"\",\"\",(L25-K25)*24)","v":0.11666666669771075},{"$f":"IF(F25=\"\",\"\",ROUND((L25-K25)*24*60,0))","v":7},"F",{"$f":"IF(F25=\"\",\"\",IF(OR(O25=\"P\",O25=\"RP\"),\"--\",\"NO\"))","v":"NO"},"0,000","SI",{"$f":"$I$19*IF(R25=\"SI\",1,0.1)*IF(OR(O25=\"P\",O25=\"RP\"),0.1,1)","v":30},{"$f":"IF(O25=\"P\",J25*S25*ROUND(N25/60,2),\"--\")","v":"--"},{"$f":"IF(O25=\"RP\",J25*S25*Q25/100*ROUND(N25/60,2),\"--\")","v":"--"},{"$f":"IF(AND(O25=\"F\",P25=\"NO\"),J25*S25,\"--\")","v":805.5},{"$f":"IF(O25=\"F\",J25*S25*ROUND(N25/60,2),\"--\")","v":96.66},{"$f":"IF(AND(O25=\"R\",P25=\"NO\"),J25*S25*Q25/100,\"--\")","v":"--"},{"$f":"IF(O25=\"R\",J25*S25*ROUND(N25/60,2)*Q25/100,\"--\")","v":"--"},{"$f":"IF(O25=\"RF\",J25*S25*ROUND(N25/60,2),\"--\")","v":"--"},{"$f":"IF(O25=\"RR\",J25*S25*ROUND(N25/60,2)*Q25/100,\"--\")","v":"--"},"SI",{"$f":"IF(F25=\"\",\"\",SUM(T25:AA25)*IF(AB25=\"SI\",1,2))","v":902.16}]
[null,null,54,300548,5410,"TERMAS NORTE","TRAFO 1",15,"132/33/13,2",26.85,"2016-03-27T20:02:00","2016-03-27T21:33:00",1.5166666667209938,91,"F","NO","0,000","NO",3,"--","--",80.550000000000011,122.43600000000002,"--","--","--","--","SI",202.98600000000005]
[null,null,55,300732,3226,"AVELLANEDA","TRAFO 1",30,"132/33/13,2",53.7,"2016-03-29T09:05:00","2016-03-29T12:38:00",3.5500000000465661,213,"P","--","0,000","NO",0.30000000000000004,57.190500000000007,"--","--","--","--","--","--","--","SI",57.190500000000007]
[null,null,56,300733,5569,"SANTIAGO ESTE","TRAFO 1",30,"132/13,2",53.7,"2016-03-29T11:23:00","2016-03-29T13:36:00",2.2166666665580124,133,"RP","--",60,"NO",0.30000000000000004,"--",21.458520000000007,"--","--","--","--","--","--","SI",21.458520000000007]
[null,null,57,300734,5570,"SANTIAGO ESTE","TRAFO 2",30,"132/13,2",53.7,"2016-03-29T13:38:00","2016-03-29T14:40:00",1.033333333209157,62,"RP","--",60,"NO",0.30000000000000004,"--",9.9559800000000021,"--","--","--","--","--","--","SI",9.9559800000000021]
[null,null,58,300737,5130,"VALLE VIEJO","TRAFO 1",30,"132/33/13,2",53.7,"2016-03-30T03:00:00","2016-03-30T04:40:00",1.6666666666860692,100,"P","--","0,000","NO",0.30000000000000004,26.903700000000004,{"$f":"IF(O30=\"RP\",J30*S30*Q30/100*ROUND(N30/60,2),\"--\")","v":"--"},{"$f":"IF(AND(O30=\"F\",P30=\"NO\"),J30*S30,\"--\")","v":"--"},{"$f":"IF(O30=\"F\",J30*S30*ROUND(N30/60,2),\"--\")","v":"--"},{"$f":"IF(AND(O30=\"R\",P30=\"NO\"),J30*S30*Q30/100,\"--\")","v":"--"},{"$f":"IF(O30=\"R\",J30*S30*ROUND(N30/60,2)*Q30/100,\"--\")","v":"--"},{"$f":"IF(O30=\"RF\",J30*S30*ROUND(N30/60,2),\"--\")","v":"--"},{"$f":"IF(O30=\"RR\",J30*S30*ROUND(N30/60,2)*Q30/100,\"--\")","v":"--"},"SI",{"$f":"IF(F30=\"\",\"\",SUM(T30:AA30)*IF(AB30=\"SI\",1,2))","v":26.903700000000004}]
[null,null,59,300750,5130,"VALLE VIEJO","TRAFO 1",30,"132/33/13,2",53.7,"2016-03-31T03:01:00","2016-03-31T04:21:00",1.3333333333139308,80,"P","--","0,000","NO",0.30000000000000004,21.426300000000005,{"$f":"IF(O31=\"RP\",J31*S31*Q31/100*ROUND(N31/60,2),\"--\")","v":"--"},{"$f":"IF(AND(O31=\"F\",P31=\"NO\"),J31*S31,\"--\")","v":"--"},{"$f":"IF(O31=\"F\",J31*S31*ROUND(N31/60,2),\"--\")","v":"--"},{"$f":"IF(AND(O31=\"R\",P31=\"NO\"),J31*S31*Q31/100,\"--\")","v":"--"},{"$f":"IF(O31=\"R\",J31*S31*ROUND(N31/60,2)*Q31/100,\"--\")","v":"--"},{"$f":"IF(O31=\"RF\",J31*S31*ROUND(N31/60,2),\"--\")","v":"--"},{"$f":"IF(O31=\"RR\",J31*S31*ROUND(N31/60,2)*Q31/100,\"--\")","v":"--"},"SI",{"$f":"IF(F31=\"\",\"\",SUM(T31:AA31)*IF(AB31=\"SI\",1,2))","v":21.426300000000005}]
[null,null,60,300755,5445,"AIMOGASTA","TRAFO 2",30,"132/33/13,2",53.7,"2016-03-31T08:12:00","2016-03-31T13:15:00",5.0500000000465661,303,"P","--","0,000","NO",0.30000000000000004,81.355500000000006,"--","--","--","--","--","--","--","SI",81.355500000000006]
[null,null,61,300756,5753,"TUCUMAN NORTE","TRAFO 4",15,"132/33/13,2",26.85,"2016-03-31T09:02:00","2016-03-31T12:59:00",3.9500000001280569,237,"P","--","0,000","NO",0.30000000000000004,31.817250000000008,"--","--","--","--","--","--","--","SI",31.817250000000008]
[null,null,62,300759,5584,"FERNANDEZ","TRAFO 1",15,"132/33/13,2",26.85,"2016-03-31T19:32:00","2016-03-31T19:45:00",0.21666666667442769,13,"F","NO","0,000","SI",30,"--","--",805.5,177.21,"--","--","--","--","SI",982.71]
[null,null,null,null,null,null,null,null,null,{"$f":"H35*$I$18","v":0},null,null,"","",null,"",null,null,3,"--","--","--","--","--","--","--","--",null,{"$f":"IF(F35=\"\",\"\",SUM(T35:AA35)*IF(AB35=\"SI\",1,2))","v":""}]
[null,null,null,null,null,null,null,null,null,0,null,null,"","",null,"",null,null,3,"--","--","--","--","--","--","--","--",null,""]
[null,null,null,null,null,null,null,null,null,0,null,null,"","",null,"",null,null,3,"--","--","--","--","--","--","--","--",null,""]
[null,null,null,null,null,null,null,null,null,0,null,null,"","",null,"",null,null,3,"--","--","--","--","--","--","--","--",null,""]
[null,null,null,null,null,null,null,null,null,0,null,null,"","",null,"",null,null,{"$f":"$I$19*IF(R39=\"SI\",1,0.1)*IF(OR(O39=\"P\",O39=\"RP\"),0.1,1)","v":3},{"$f":"IF(O39=\"P\",J39*S39*ROUND(N39/60,2),\"--\")","v":"--"},{"$f":"IF(O39=\"RP\",J39*S39*Q39/100*ROUND(N39/60,2),\"--\")","v":"--"},{"$f":"IF(AND(O39=\"F\",P39=\"NO\"),J39*S39,\"--\")","v":"--"},{"$f":"IF(O39=\"F\",J39*S39*ROUND(N39/60,2),\"--\")","v":"--"},{"$f":"IF(AND(O39=\"R\",P39=\"NO\"),J39*S39*Q39/100,\"--\")","v":"--"},{"$f":"IF(O39=\"R\",J39*S39*ROUND(N39/60,2)*Q39/100,\"--\")","v":"--"},{"$f":"IF(O39=\"RF\",J39*S39*ROUND(N39/60,2),\"--\")","v":"--"},{"$f":"IF(O39=\"RR\",J39*S39*ROUND(N39/60,2)*Q39/100,\"--\")","v":"--"},null,""]
[null,null,null,null,null,null,null,null,null,0,null,null,"","",null,"",null,null,3,"--","--","--","--","--","--","--","--",null,""]
[null,null,null,null,null,null,null,null,null,0,null,null,"","",null,"",null,null,3,"--","--","--","--","--","--","--","--",null,""]
[null,null,null,null,null,null,null,null,null,0,null,null,"","",null,"",null,null,{"$f":"$I$19*IF(R42=\"SI\",1,0.1)*IF(OR(O42=\"P\",O42=\"RP\"),0.1,1)","v":3},{"$f":"IF(O42=\"P\",J42*S42*ROUND(N42/60,2),\"--\")","v":"--"},{"$f":"IF(O42=\"RP\",J42*S42*Q42/100*ROUND(N42/60,2),\"--\")","v":"--"},{"$f":"IF(AND(O42=\"F\",P42=\"NO\"),J42*S42,\"--\")","v":"--"},{"$f":"IF(O42=\"F\",J42*S42*ROUND(N42/60,2),\"--\")","v":"--"},{"$f":"IF(AND(O42=\"R\",P42=\"NO\"),J42*S42*Q42/100,\"--\")","v":"--"},{"$f":"IF(O42=\"R\",J42*S42*ROUND(N42/60,2)*Q42/100,\"--\")","v":"--"},{"$f":"IF(O42=\"RF\",J42*S42*ROUND(N42/60,2),\"--\")","v":"--"},{"$f":"IF(O42=\"RR\",J42*S42*ROUND(N42/60,2)*Q42/100,\"--\")","v":"--"},null,""]
[null,null,null,null,null,null,null,null,null,0,null,null,"","",null,"",null,null,{"$f":"$I$19*IF(R43=\"SI\",1,0.1)*IF(OR(O43=\"P\",O43=\"RP\"),0.1,1)","v":3},{"$f":"IF(O43=\"P\",J43*S43*ROUND(N43/60,2),\"--\")","v":"--"},{"$f":"IF(O43=\"RP\",J43*S43*Q43/100*ROUND(N43/60,2),\"--\")","v":"--"},{"$f":"IF(AND(O43=\"F\",P43=\"NO\"),J43*S43,\"--\")","v":"--"},{"$f":"IF(O43=\"F\",J43*S43*ROUND(N43/60,2),\"--\")","v":"--"},{"$f":"IF(AND(O43=\"R\",P43=\"NO\"),J43*S43*Q43/100,\"--\")","v":"--"},{"$f":"IF(O43=\"R\",J43*S43*ROUND(N43/60,2)*Q43/100,\"--\")","v":"--"},{"$f":"IF(O43=\"RF\",J43*S43*ROUND(N43/60,2),\"--\")","v":"--"},{"$f":"IF(O43=\"RR\",J43*S43*ROUND(N43/60,2)*Q43/100,\"--\")","v":"--"},null,""]
[null,null,null,null,null,null,null,null,null,{"$f":"H44*$I$18","v":0},null,null,{"$f":"IF(F44=\"\",\"\",(L44-K44)*24)","v":""},{"$f":"IF(F44=\"\",\"\",ROUND((L44-K44)*24*60,0))","v":""},null,"",null,null,{"$f":"$I$19*IF(R44=\"SI\",1,0.1)*IF(OR(O44=\"P\",O44=\"RP\"),0.1,1)","v":3},{"$f":"IF(O44=\"P\",J44*S44*ROUND(N44/60,2),\"--\")","v":"--"},{"$f":"IF(O44=\"RP\",J44*S44*Q44/100*ROUND(N44/60,2),\"--\")","v":"--"},{"$f":"IF(AND(O44=\"F\",P44=\"NO\"),J44*S44,\"--\")","v":"--"},{"$f":"IF(O44=\"F\",J44*S44*ROUND(N44/60,2),\"--\")","v":"--"},{"$f":"IF(AND(O44=\"R\",P44=\"NO\"),J44*S44*Q44/100,\"--\")","v":"--"},{"$f":"IF(O44=\"R\",J44*S44*ROUND(N44/60,2)*Q44/100,\"--\")","v":"--"},{"$f":"IF(O44=\"RF\",J44*S44*ROUND(N44/60,2),\"--\")","v":"--"},{"$f":"IF(O44=\"RR\",J44*S44*ROUND(N44/60,2)*Q44/100,\"--\")","v":"--"},null,""]
[null,null,null,null,null,null,null,null,null,0,null,null,"","",null,"",null,null,3,"--","--","--","--","--","--","--","--",null,""]
[null,null,null,null,null,null,null,null,null,0,null,null,"","",null,"",null,null,3,"--","--","--","--","--","--","--","--",null,""]
[null,null,null,null,null,null,null,null,null,0,null,null,"","",null,"",null,null,3,"--","--","--","--","--","--","--","--",null,{"$f":"IF(F47=\"\",\"\",SUM(T47:AA47)*IF(AB47=\"SI\",1,2))","v":""}]
[null,null,null,null,null,null,null,null,null,0,null,null,"","",null,"",null,null,{"$f":"$I$19*IF(R48=\"SI\",1,0.1)*IF(OR(O48=\"P\",O48=\"RP\"),0.1,1)","v":3},{"$f":"IF(O48=\"P\",J48*S48*ROUND(N48/60,2),\"--\")","v":"--"},{"$f":"IF(O48=\"RP\",J48*S48*Q48/100*ROUND(N48/60,2),\"--\")","v":"--"},{"$f":"IF(AND(O48=\"F\",P48=\"NO\"),J48*S48,\"--\")","v":"--"},{"$f":"IF(O48=\"F\",J48*S48*ROUND(N48/60,2),\"--\")","v":"--"},{"$f":"IF(AND(O48=\"R\",P48=\"NO\"),J48*S48*Q48/100,\"--\")","v":"--"},{"$f":"IF(O48=\"R\",J48*S48*ROUND(N48/60,2)*Q48/100,\"--\")","v":"--"},{"$f":"IF(O48=\"RF\",J48*S48*ROUND(N48/60,2),\"--\")","v":"--"},{"$f":"IF(O48=\"RR\",J48*S48*ROUND(N48/60,2)*Q48/100,\"--\")","v":"--"},null,{"$f":"IF(F48=\"\",\"\",SUM(T48:AA48)*IF(AB48=\"SI\",1,2))","v":""}]
[null,null,null,null,null,null,null,null,null,0,null,null,"","",null,"",null,null,3,"--","--","--","--","--","--","--","--",null,""]
[null,null,null,null,null,null,null,null,null,0,null,null,{"$f":"IF(F50=\"\",\"\",(L50-K50)*24)","v":""},{"$f":"IF(F50=\"\",\"\",ROUND((L50-K50)*24*60,0))","v":""},null,"",null,null,3,"--","--","--","--","--","--","--","--",null,""]
[null,null,null,null,null,null,null,null,null,0,null,null,{"$f":"IF(F51=\"\",\"\",(L51-K51)*24)","v":""},{"$f":"IF(F51=\"\",\"\",ROUND((L51-K51)*24*60,0))","v":""},null,{"$f":"IF(F51=\"\",\"\",IF(OR(O51=\"P\",O51=\"RP\"),\"--\",\"NO\"))","v":""},null,null,3,"--","--","--","--","--","--","--","--",null,""]
[null,null,"(²)","P - PROGRAMADA  ; F - FORZADA   ; R - REDUCCIÓN FORZADA  ",null,null,null,null,null,null,null,null,null,null,null,null,null,null,null,{"$f":"SUM(T22:T51)","v":218.69325000000003},31.414500000000011,2497.0500000000002,758.78100000000006,0,0,0,0,null,{"$f":"ROUND(SUM(AC22:AC51),2)","v":30892.75}]

{"sheet":"SA-03 (1)","index":6,"n_rows":44,"n_cols":22,"rows_kept":44,"cut":false,"hidden":false,"merged":[]}
[]
[null,{"$f":"'TOT-0316'!B2","v":"ANEXO VI  al Memorsndum   D.T.E.E. N°     356    / 2017"}]
[]
[" ENTE NACIONAL REGULADOR"]
["       DE LA ELECTRICIDAD"]
[]
[]
[null,null,null,null,null,"SISTEMA DE TRANSPORTE DE ENERGÍA ELÉCTRICA POR DISTRIBUCIÓN TRONCAL -  TRANSNOA S.A."]
[]
[null,null,null,null,null,"2.2.- Salidas"]
[]
[null,null,null,null,null,"2.2.1.- Equipamiento propio"]
[]
[null,{"$f":"'TOT-0316'!B14","v":"Desde el 01 al 31 de Marzo de 2016"}]
[]
[null,null,null,null,null,"Salida en 132 kV o 66 kV = ",23.905000000000001,{"$f":"50*'TOT-0316'!B13","v":50},null,{"$f":"IF(H16=50,\" \",IF(H16=100,\"  Coeficiente duplicado por tasa de falla >4 Sal. x año/100 km.\",\"REVISAR COEFICIENTE\"))","v":" "}]
[null,null,null,null,null,"Salida en 33 kV ",17.934999999999999,{"$f":"25*'TOT-0316'!B13","v":25},null,{"$f":"IF(H17=25,\" \",IF(H17=50,\"  Coeficiente duplicado por tasa de falla >4 Sal. x año/100 km.\",\"REVISAR COEFICIENTE\"))","v":" "}]
[null,null,null,null,null,"Salida en 13,2 kV =",17.934999999999999,{"$f":"20*'TOT-0316'!B13","v":20},null,{"$f":"IF(H18=20,\" \",IF(H18=40,\"  Coeficiente duplicado por tasa de falla >4 Sal. x año/100 km.\",\"REVISAR COEFICIENTE\"))","v":" "}]
[null,null,3,4,5,6,7,8,9,10,11,12,13,14,15,16,17,18,19,20,21,22]
[null,null,"N°","INDISP","ID EQUIPO","ESTACIÓN\nTRANSFORMADORA","EQUIPO","U\n[kV]","$/h","Salida","Entrada","Hs.\nIndisp.","Mtos.\nIndisp.","Tipo \nSal.(²)","AUT.","K","PENALIZ.\nPROGRAM.","PENALIZAC. FORZADA\nPor Salida       hs. Restantes",null,"RESTANTE\nFORZADA","Informó\nen Térm.","TOTAL\nPENALIZAC."]
[]
[]
[null,null,63,300735,5131,"VALLE VIEJO","SALIDA ALIMENTADOR LOS POZOS",13.2,{"$f":"IF(OR(H23=132,H23=66),$G$16,IF(H23=33,$G$17,$G$18))","v":17.934999999999999},"2016-03-30T03:00:00","2016-03-30T04:40:00",{"$f":"IF(F23=\"\",\"\",(K23-J23)*24)","v":1.6666666666860692},{"$f":"IF(F23=\"\",\"\",ROUND((K23-J23)*24*60,0))","v":100},"P",{"$f":"IF(F23=\"\",\"\",IF(OR(N23=\"P\",N23=\"RP\"),\"--\",\"NO\"))","v":"--"},{"$f":"IF(H23>33,$H$16,IF(H23=33,$H$17,$H$18))","v":20},{"$f":"IF(N23=\"P\",I23*P23*ROUND(M23/60,2)*0.1,\"--\")","v":59.902900000000002},{"$f":"IF(AND(N23=\"F\",O23=\"NO\"),I23*P23,\"--\")","v":"--"},{"$f":"IF(N23=\"F\",I23*P23*ROUND(M23/60,2),\"--\")","v":"--"},{"$f":"IF(N23=\"RF\",I23*P23*ROUND(M23/60,2),\"--\")","v":"--"},{"$f":"IF(F23=\"\",\"\",\"SI\")","v":"SI"},{"$f":"IF(F23=\"\",\"\",SUM(Q23:T23)*IF(U23=\"SI\",1,2)*IF(H23=\"500/220\",0,1))","v":59.902900000000002}]
[null,null,64,300736,5132,"VALLE VIEJO","SALIDA ALIMEN. LA MERCED",33,17.934999999999999,"2016-03-30T03:00:00","2016-03-30T04:40:00",1.6666666666860692,100,"P","--",25,74.878624999999985,"--","--","--","SI",74.878624999999985]
[null,null,65,300751,5131,"VALLE VIEJO","SALIDA ALIMENTADOR LOS POZOS",13.2,17.934999999999999,"2016-03-31T03:01:00","2016-03-31T04:21:00",{"$f":"IF(F25=\"\",\"\",(K25-J25)*24)","v":1.3333333333139308},{"$f":"IF(F25=\"\",\"\",ROUND((K25-J25)*24*60,0))","v":80},"P",{"$f":"IF(F25=\"\",\"\",IF(OR(N25=\"P\",N25=\"RP\"),\"--\",\"NO\"))","v":"--"},{"$f":"IF(H25>33,$H$16,IF(H25=33,$H$17,$H$18))","v":20},{"$f":"IF(N25=\"P\",I25*P25*ROUND(M25/60,2)*0.1,\"--\")","v":47.707100000000004},{"$f":"IF(AND(N25=\"F\",O25=\"NO\"),I25*P25,\"--\")","v":"--"},{"$f":"IF(N25=\"F\",I25*P25*ROUND(M25/60,2),\"--\")","v":"--"},{"$f":"IF(N25=\"RF\",I25*P25*ROUND(M25/60,2),\"--\")","v":"--"},{"$f":"IF(F25=\"\",\"\",\"SI\")","v":"SI"},47.707100000000004]
[null,null,66,300752,5132,"VALLE VIEJO","SALIDA ALIMEN. LA MERCED",33,17.934999999999999,"2016-03-31T03:01:00","2016-03-31T04:21:00",1.3333333333139308,80,"P",{"$f":"IF(F26=\"\",\"\",IF(OR(N26=\"P\",N26=\"RP\"),\"--\",\"NO\"))","v":"--"},{"$f":"IF(H26>33,$H$16,IF(H26=33,$H$17,$H$18))","v":25},{"$f":"IF(N26=\"P\",I26*P26*ROUND(M26/60,2)*0.1,\"--\")","v":59.633875000000003},{"$f":"IF(AND(N26=\"F\",O26=\"NO\"),I26*P26,\"--\")","v":"--"},{"$f":"IF(N26=\"F\",I26*P26*ROUND(M26/60,2),\"--\")","v":"--"},{"$f":"IF(N26=\"RF\",I26*P26*ROUND(M26/60,2),\"--\")","v":"--"},{"$f":"IF(F26=\"\",\"\",\"SI\")","v":"SI"},59.633875000000003]
[null,null,null,null,null,null,null,null,17.934999999999999,null,null,null,null,null,"",20,"--","--","--","--",{"$f":"IF(F27=\"\",\"\",\"SI\")","v":""}]
[null,null,null,null,null,null,null,null,17.934999999999999,null,null,null,null,null,"",20,"--","--","--","--",""]
[null,null,null,null,null,null,null,null,17.934999999999999,null,null,null,null,null,"",20,"--","--","--","--",""]
[null,null,null,null,null,null,null,null,17.934999999999999,null,null,null,null,null,"",20,"--","--","--","--",""]
[null,null,null,null,null,null,null,null,17.934999999999999,null,null,null,null,null,"",20,"--","--","--","--",""]
[null,null,null,null,null,null,null,null,17.934999999999999,null,null,null,null,null,"",20,"--","--","--","--",""]
[null,null,null,null,null,null,null,null,17.934999999999999,null,null,"","",null,"",20,"--","--","--","--","",""]
[null,null,null,null,null,null,null,null,17.934999999999999,null,null,"","",null,"",20,"--","--","--","--","",""]
[null,null,null,null,null,null,null,null,17.934999999999999,null,null,"","",null,"",20,"--","--","--","--","",""]
[null,null,null,null,null,null,null,null,17.934999999999999,null,null,"","",null,"",20,"--","--","--","--","",""]
[null,null,null,null,null,null,null,null,17.934999999999999,null,null,"","",null,"",20,"--","--","--","--","",""]
[null,null,null,null,null,null,null,null,17.934999999999999,null,null,"","",null,"",20,"--","--","--","--","",""]
[null,null,null,null,null,null,null,null,17.934999999999999,null,null,"","",null,"",20,"--","--","--","--","",""]
[null,null,null,null,null,null,null,null,17.934999999999999,null,null,{"$f":"IF(F40=\"\",\"\",(K40-J40)*24)","v":""},{"$f":"IF(F40=\"\",\"\",ROUND((K40-J40)*24*60,0))","v":""},null,"",{"$f":"IF(H40>33,$H$16,IF(H40=33,$H$17,$H$18))","v":20},{"$f":"IF(N40=\"P\",I40*P40*ROUND(M40/60,2)*0.1,\"--\")","v":"--"},{"$f":"IF(AND(N40=\"F\",O40=\"NO\"),I40*P40,\"--\")","v":"--"},{"$f":"IF(N40=\"F\",I40*P40*ROUND(M40/60,2),\"--\")","v":"--"},{"$f":"IF(N40=\"RF\",I40*P40*ROUND(M40/60,2),\"--\")","v":"--"},{"$f":"IF(F40=\"\",\"\",\"SI\")","v":""},{"$f":"IF(F40=\"\",\"\",SUM(Q40:T40)*IF(U40=\"SI\",1,2)*IF(H40=\"500/220\",0,1))","v":""}]
[null,null,null,null,null,null,null,null,17.934999999999999,null,null,{"$f":"IF(F41=\"\",\"\",(K41-J41)*24)","v":""},{"$f":"IF(F41=\"\",\"\",ROUND((K41-J41)*24*60,0))","v":""},null,"",{"$f":"IF(H41>33,$H$16,IF(H41=33,$H$17,$H$18))","v":20},{"$f":"IF(N41=\"P\",I41*P41*ROUND(M41/60,2)*0.1,\"--\")","v":"--"},{"$f":"IF(AND(N41=\"F\",O41=\"NO\"),I41*P41,\"--\")","v":"--"},{"$f":"IF(N41=\"F\",I41*P41*ROUND(M41/60,2),\"--\")","v":"--"},{"$f":"IF(N41=\"RF\",I41*P41*ROUND(M41/60,2),\"--\")","v":"--"},{"$f":"IF(F41=\"\",\"\",\"SI\")","v":""},{"$f":"IF(F41=\"\",\"\",SUM(Q41:T41)*IF(U41=\"SI\",1,2)*IF(H41=\"500/220\",0,1))","v":""}]
[null,null,null,null,null,null,null,null,17.934999999999999,null,null,{"$f":"IF(F42=\"\",\"\",(K42-J42)*24)","v":""},{"$f":"IF(F42=\"\",\"\",ROUND((K42-J42)*24*60,0))","v":""},null,"",{"$f":"IF(H42>33,$H$16,IF(H42=33,$H$17,$H$18))","v":20},{"$f":"IF(N42=\"P\",I42*P42*ROUND(M42/60,2)*0.1,\"--\")","v":"--"},{"$f":"IF(AND(N42=\"F\",O42=\"NO\"),I42*P42,\"--\")","v":"--"},{"$f":"IF(N42=\"F\",I42*P42*ROUND(M42/60,2),\"--\")","v":"--"},{"$f":"IF(N42=\"RF\",I42*P42*ROUND(M42/60,2),\"--\")","v":"--"},{"$f":"IF(F42=\"\",\"\",\"SI\")","v":""},{"$f":"IF(F42=\"\",\"\",SUM(Q42:T42)*IF(U42=\"SI\",1,2)*IF(H42=\"500/220\",0,1))","v":""}]
[]
[null,null,"(²)","P - PROGRAMADA ",null,null,null,null,null,null,null,null,null,null,null,null,{"$f":"SUM(Q21:Q43)","v":242.1225},{"$f":"SUM(R21:R43)","v":0},{"$f":"SUM(S21:S43)","v":0},{"$f":"SUM(T21:T43)","v":0},null,{"$f":"ROUND(SUM(V21:V43),2)","v":242.12}]

{"sheet":"SUP-TRANSPORTEL","index":7,"n_rows":44,"n_cols":13,"rows_kept":44,"cut":false,"hidden":false,"merged":[]}
[]
[null,{"$f":"'TOT-0316'!B2","v":"ANEXO VI  al Memorsndum   D.T.E.E. N°     356    / 2017"}]
["ENTE NACIONAL REGULADOR "]
["DE LA ELECTRICIDAD"]
[]
[]
[null,null,null,"SISTEMA DE TRANSPORTE DE ENERGÍA ELÉCTRICA POR DISTRIBUCIÓN TRONCAL - TRANSNOA S.A."]
[]
[null,null,null,"3.1- SUPERVISIÓN - Transportista Independiente TRANSPORTEL La Rioja Sur"]
[]
[null,{"$f":"'TOT-0316'!B14","v":"Desde el 01 al 31 de Marzo de 2016"}]
[]
[]
[]
[null,null,"a) Datos"]
[null,null,null,null,null,null,null,null,null,null,null,"Salida en 132 kV o 66 kV = ",2.4140000000000001]
[null,null,null,"Tiempo de servicio =",{"$f":"MID(B11,16,2)*24","v":744},"hs",null,null,"$/100 km-h : LÍNEAS 132 kV ",514.20399999999995,null,"Salida en 33 kV ",1.8109999999999999]
[null,null,null,"Porcentaje por Supervisión  =",0.04,null,null,null,null,null,null,"Salida en 13,2 kV =",1.8109999999999999]
[]
[null,null,"b) SM:  es la suma de las sanciones a que en cada mes se hiciere pasible el Transportista Independiente, valorizadas con idénticos criterios que los que se aplican a la Concesionaria."]
[]
[]
[null,null,null,"SANCIÓN al T.I.",null,"LÍNEAS",null,"SM =",5576.21,null,null,"SEGÚN 1.2."]
[]
[null,null,"c) RM : es la remuneración que mensualmente recibiría el Transportista Independiente, si su servicio fuera valorizado conforme al régimen remuneratorio que se aplica a la Concesionaria."]
[]
[null,null,null,"Cargo por Capacidad de Transporte","U [kV]","Long [km]",null,"Cargo por C. T.",{"$f":"\"Cargo por E.E.T.\"","v":"Cargo por E.E.T."},null,null,"TOTAL"]
[null,null,null,"LA RIOJA SUR P.I.LA RIOJA",132,40,null,{"$f":"F28*$J$17*$E$17/100","v":153027.11039999998},0,{"$f":"\"(DTE 0316)\"","v":"(DTE 0316)"},null,{"$f":"SUM(H28:K28)","v":153027.11039999998}]
[null,null,null,"LA RIOJA SUR P.I.PATQUIA",132,40,null,{"$f":"F29*$J$17*$E$17/100","v":153027.11039999998},0,{"$f":"\"(DTE 0316)\"","v":"(DTE 0316)"},null,{"$f":"SUM(H29:K29)","v":153027.11039999998}]
[null,null,null,null,null,null,null,null,null,null,null,{"$f":"SUM(L28:L29)","v":306054.22079999995}]
[]
[]
[null,null,null,null,null,null,null,"RM =",{"$f":"+L30","v":306054.22079999995},null,"RM * =",37401.534719999996]
[]
[null,null,"d) CS: Es el cargo por Supervisión de la Operación que la Transportista percibe por supervisar la operación y mantenimiento del Transportista Independiente."]
[]
[null,null,null,"Cargo por Supervisión afectado a la sanción ",null,null,null,"CS =",{"$f":"E18*L33","v":1496.0613887999998}]
[]
[null,null,"e) SANCIÓN"]
[null,null,null,"Sanción Calculada",{"$f":"10*I23*I37/I33","v":272.5775993232258}]
[]
[null,null,null,"TOTAL A PENALIZAR A TRANSNOA S.A. POR SUPERVISIÓN A  SU TI"]
[]
[null,null,null,null,null,null,null,"SANCIÓN  =",{"$f":"IF($E$40>3*I37,3*I37,$E$40)","v":272.5775993232258},null,"RM * = VALOR EMPLEADO PARA CALCULAR CS"]

{"sheet":"Tasa de Falla","index":8,"n_rows":153,"n_cols":19,"rows_kept":153,"cut":false,"hidden":false,"merged":[[2,0,2,2],[3,0,3,2],[152,11,152,12]]}
[]
[null,{"$f":"'TOT-0316'!B2","v":"ANEXO VI  al Memorsndum   D.T.E.E. N°     356    / 2017"}]
["ENTE NACIONAL REGULADOR "]
["DE LA ELECTRICIDAD"]
[]
[null,"SISTEMA DE TRANSPORTE DE ENERGÍA ELÉCTRICA POR DISTRIBUCIÓN TRONCAL "]
[]
[null,"TRANSNOA S.A."]
[]
[null,"INDISPONIBILIDADES FORZADAS DE LÍNEAS - TASA DE FALLA"]
[]
[]
[null,"y",null,{"$f":"'TOT-0316'!B14","v":"Desde el 01 al 31 de Marzo de 2016"}]
[]
[null,null,"N°","LÍNEAS","U\n[kV]","Long.\n[km]","2015-03-01","2015-04-01","2015-05-01","2015-06-01","2015-07-01","2015-08-01","2015-09-01","2015-10-01","2015-11-01","2015-12-01","2016-01-01","2016-02-01","2016-03-01"]
[]
[null,null,{"$f":"'[3]Tasa de Falla'!C17","v":1},{"$f":"'[3]Tasa de Falla'!D17","v":"AGUA BLANCA - VILLA QUINTEROS"},{"$f":"'[3]Tasa de Falla'!E17","v":132},{"$f":"'[3]Tasa de Falla'!F17","v":23.8},{"$f":"IF('[3]Tasa de Falla'!IV17=0,\"\",'[3]Tasa de Falla'!IV17)","v":""},{"$f":"IF('[3]Tasa de Falla'!IW17=0,\"\",'[3]Tasa de Falla'!IW17)","v":""},{"$f":"IF('[3]Tasa de Falla'!IX17=0,\"\",'[3]Tasa de Falla'!IX17)","v":""},{"$f":"IF('[3]Tasa de Falla'!IY17=0,\"\",'[3]Tasa de Falla'!IY17)","v":""},{"$f":"IF('[3]Tasa de Falla'!IZ17=0,\"\",'[3]Tasa de Falla'!IZ17)","v":""},{"$f":"IF('[3]Tasa de Falla'!JA17=0,\"\",'[3]Tasa de Falla'!JA17)","v":""},{"$f":"IF('[3]Tasa de Falla'!JB17=0,\"\",'[3]Tasa de Falla'!JB17)","v":""},{"$f":"IF('[3]Tasa de Falla'!JC17=0,\"\",'[3]Tasa de Falla'!JC17)","v":""},{"$f":"IF('[3]Tasa de Falla'!JD17=0,\"\",'[3]Tasa de Falla'!JD17)","v":""},{"$f":"IF('[3]Tasa de Falla'!JE17=0,\"\",'[3]Tasa de Falla'!JE17)","v":""},{"$f":"IF('[3]Tasa de Falla'!JF17=0,\"\",'[3]Tasa de Falla'!JF17)","v":""},{"$f":"IF('[3]Tasa de Falla'!JG17=0,\"\",'[3]Tasa de Falla'!JG17)","v":""}]
[null,null,{"$f":"'[3]Tasa de Falla'!C18","v":2},{"$f":"'[3]Tasa de Falla'!D18","v":"AGUILARES - ESCABA"},{"$f":"'[3]Tasa de Falla'!E18","v":132},{"$f":"'[3]Tasa de Falla'!F18","v":27},{"$f":"IF('[3]Tasa de Falla'!IV18=0,\"\",'[3]Tasa de Falla'!IV18)","v":""},{"$f":"IF('[3]Tasa de Falla'!IW18=0,\"\",'[3]Tasa de Falla'!IW18)","v":""},{"$f":"IF('[3]Tasa de Falla'!IX18=0,\"\",'[3]Tasa de Falla'!IX18)","v":""},{"$f":"IF('[3]Tasa de Falla'!IY18=0,\"\",'[3]Tasa de Falla'!IY18)","v":""},{"$f":"IF('[3]Tasa de Falla'!IZ18=0,\"\",'[3]Tasa de Falla'!IZ18)","v":""},{"$f":"IF('[3]Tasa de Falla'!JA18=0,\"\",'[3]Tasa de Falla'!JA18)","v":2},{"$f":"IF('[3]Tasa de Falla'!JB18=0,\"\",'[3]Tasa de Falla'!JB18)","v":""},{"$f":"IF('[3]Tasa de Falla'!JC18=0,\"\",'[3]Tasa de Falla'!JC18)","v":""},{"$f":"IF('[3]Tasa de Falla'!JD18=0,\"\",'[3]Tasa de Falla'!JD18)","v":""},{"$f":"IF('[3]Tasa de Falla'!JE18=0,\"\",'[3]Tasa de Falla'!JE18)","v":""},{"$f":"IF('[3]Tasa de Falla'!JF18=0,\"\",'[3]Tasa de Falla'!JF18)","v":""},{"$f":"IF('[3]Tasa de Falla'!JG18=0,\"\",'[3]Tasa de Falla'!JG18)","v":""}]
[null,null,{"$f":"'[3]Tasa de Falla'!C19","v":3},{"$f":"'[3]Tasa de Falla'!D19","v":"CABRA CORRAL - SALTA SUR"},{"$f":"'[3]Tasa de Falla'!E19","v":132},{"$f":"'[3]Tasa de Falla'!F19","v":62},{"$f":"IF('[3]Tasa de Falla'!IV19=0,\"\",'[3]Tasa de Falla'!IV19)","v":"XXXX"},{"$f":"IF('[3]Tasa de Falla'!IW19=0,\"\",'[3]Tasa de Falla'!IW19)","v":"XXXX"},{"$f":"IF('[3]Tasa de Falla'!IX19=0,\"\",'[3]Tasa de Falla'!IX19)","v":"XXXX"},{"$f":"IF('[3]Tasa de Falla'!IY19=0,\"\",'[3]Tasa de Falla'!IY19)","v":"XXXX"},{"$f":"IF('[3]Tasa de Falla'!IZ19=0,\"\",'[3]Tasa de Falla'!IZ19)","v":"XXXX"},{"$f":"IF('[3]Tasa de Falla'!JA19=0,\"\",'[3]Tasa de Falla'!JA19)","v":"XXXX"},{"$f":"IF('[3]Tasa de Falla'!JB19=0,\"\",'[3]Tasa de Falla'!JB19)","v":"XXXX"},{"$f":"IF('[3]Tasa de Falla'!JC19=0,\"\",'[3]Tasa de Falla'!JC19)","v":"XXXX"},{"$f":"IF('[3]Tasa de Falla'!JD19=0,\"\",'[3]Tasa de Falla'!JD19)","v":"XXXX"},{"$f":"IF('[3]Tasa de Falla'!JE19=0,\"\",'[3]Tasa de Falla'!JE19)","v":"XXXX"},{"$f":"IF('[3]Tasa de Falla'!JF19=0,\"\",'[3]Tasa de Falla'!JF19)","v":"XXXX"},{"$f":"IF('[3]Tasa de Falla'!JG19=0,\"\",'[3]Tasa de Falla'!JG19)","v":"XXXX"}]
[null,null,{"$f":"'[3]Tasa de Falla'!C20","v":4},{"$f":"'[3]Tasa de Falla'!D20","v":"CEVIL POZO - TUCUMAN NORTE"},{"$f":"'[3]Tasa de Falla'!E20","v":132},{"$f":"'[3]Tasa de Falla'!F20","v":14.5},{"$f":"IF('[3]Tasa de Falla'!IV20=0,\"\",'[3]Tasa de Falla'!IV20)","v":""},{"$f":"IF('[3]Tasa de Falla'!IW20=0,\"\",'[3]Tasa de Falla'!IW20)","v":""},{"$f":"IF('[3]Tasa de Falla'!IX20=0,\"\",'[3]Tasa de Falla'!IX20)","v":""},{"$f":"IF('[3]Tasa de Falla'!IY20=0,\"\",'[3]Tasa de Falla'!IY20)","v":""},{"$f":"IF('[3]Tasa de Falla'!IZ20=0,\"\",'[3]Tasa de Falla'!IZ20)","v":""},{"$f":"IF('[3]Tasa de Falla'!JA20=0,\"\",'[3]Tasa de Falla'!JA20)","v":""},{"$f":"IF('[3]Tasa de Falla'!JB20=0,\"\",'[3]Tasa de Falla'!JB20)","v":""},{"$f":"IF('[3]Tasa de Falla'!JC20=0,\"\",'[3]Tasa de Falla'!JC20)","v":""},{"$f":"IF('[3]Tasa de Falla'!JD20=0,\"\",'[3]Tasa de Falla'!JD20)","v":""},{"$f":"IF('[3]Tasa de Falla'!JE20=0,\"\",'[3]Tasa de Falla'!JE20)","v":""},{"$f":"IF('[3]Tasa de Falla'!JF20=0,\"\",'[3]Tasa de Falla'!JF20)","v":""},{"$f":"IF('[3]Tasa de Falla'!JG20=0,\"\",'[3]Tasa de Falla'!JG20)","v":""}]
[null,null,{"$f":"'[3]Tasa de Falla'!C21","v":5},{"$f":"'[3]Tasa de Falla'!D21","v":"CAMPO SANTO - MINETTI"},{"$f":"'[3]Tasa de Falla'!E21","v":132},{"$f":"'[3]Tasa de Falla'!F21","v":29.9},{"$f":"IF('[3]Tasa de Falla'!IV21=0,\"\",'[3]Tasa de Falla'!IV21)","v":"XXXX"},{"$f":"IF('[3]Tasa de Falla'!IW21=0,\"\",'[3]Tasa de Falla'!IW21)","v":"XXXX"},{"$f":"IF('[3]Tasa de Falla'!IX21=0,\"\",'[3]Tasa de Falla'!IX21)","v":"XXXX"},{"$f":"IF('[3]Tasa de Falla'!IY21=0,\"\",'[3]Tasa de Falla'!IY21)","v":"XXXX"},{"$f":"IF('[3]Tasa de Falla'!IZ21=0,\"\",'[3]Tasa de Falla'!IZ21)","v":"XXXX"},{"$f":"IF('[3]Tasa de Falla'!JA21=0,\"\",'[3]Tasa de Falla'!JA21)","v":"XXXX"},{"$f":"IF('[3]Tasa de Falla'!JB21=0,\"\",'[3]Tasa de Falla'!JB21)","v":"XXXX"},{"$f":"IF('[3]Tasa de Falla'!JC21=0,\"\",'[3]Tasa de Falla'!JC21)","v":"XXXX"},{"$f":"IF('[3]Tasa de Falla'!JD21=0,\"\",'[3]Tasa de Falla'!JD21)","v":"XXXX"},{"$f":"IF('[3]Tasa de Falla'!JE21=0,\"\",'[3]Tasa de Falla'!JE21)","v":"XXXX"},{"$f":"IF('[3]Tasa de Falla'!JF21=0,\"\",'[3]Tasa de Falla'!JF21)","v":"XXXX"},{"$f":"IF('[3]Tasa de Falla'!JG21=0,\"\",'[3]Tasa de Falla'!JG21)","v":"XXXX"}]
[null,null,{"$f":"'[3]Tasa de Falla'!C22","v":6},{"$f":"'[3]Tasa de Falla'!D22","v":"ESCABA - HUACRA"},{"$f":"'[3]Tasa de Falla'!E22","v":132},{"$f":"'[3]Tasa de Falla'!F22","v":49.9},{"$f":"IF('[3]Tasa de Falla'!IV22=0,\"\",'[3]Tasa de Falla'!IV22)","v":"XXXX"},{"$f":"IF('[3]Tasa de Falla'!IW22=0,\"\",'[3]Tasa de Falla'!IW22)","v":"XXXX"},{"$f":"IF('[3]Tasa de Falla'!IX22=0,\"\",'[3]Tasa de Falla'!IX22)","v":"XXXX"},{"$f":"IF('[3]Tasa de Falla'!IY22=0,\"\",'[3]Tasa de Falla'!IY22)","v":"XXXX"},{"$f":"IF('[3]Tasa de Falla'!IZ22=0,\"\",'[3]Tasa de Falla'!IZ22)","v":"XXXX"},{"$f":"IF('[3]Tasa de Falla'!JA22=0,\"\",'[3]Tasa de Falla'!JA22)","v":"XXXX"},{"$f":"IF('[3]Tasa de Falla'!JB22=0,\"\",'[3]Tasa de Falla'!JB22)","v":"XXXX"},{"$f":"IF('[3]Tasa de Falla'!JC22=0,\"\",'[3]Tasa de Falla'!JC22)","v":"XXXX"},{"$f":"IF('[3]Tasa de Falla'!JD22=0,\"\",'[3]Tasa de Falla'!JD22)","v":"XXXX"},{"$f":"IF('[3]Tasa de Falla'!JE22=0,\"\",'[3]Tasa de Falla'!JE22)","v":"XXXX"},{"$f":"IF('[3]Tasa de Falla'!JF22=0,\"\",'[3]Tasa de Falla'!JF22)","v":"XXXX"},{"$f":"IF('[3]Tasa de Falla'!JG22=0,\"\",'[3]Tasa de Falla'!JG22)","v":"XXXX"}]
[null,null,{"$f":"'[3]Tasa de Falla'!C23","v":7},{"$f":"'[3]Tasa de Falla'!D23","v":"ESTATICA SUR - EL BRACHO"},{"$f":"'[3]Tasa de Falla'!E23","v":132},{"$f":"'[3]Tasa de Falla'!F23","v":19.600000000000001},{"$f":"IF('[3]Tasa de Falla'!IV23=0,\"\",'[3]Tasa de Falla'!IV23)","v":"XXXX"},{"$f":"IF('[3]Tasa de Falla'!IW23=0,\"\",'[3]Tasa de Falla'!IW23)","v":"XXXX"},{"$f":"IF('[3]Tasa de Falla'!IX23=0,\"\",'[3]Tasa de Falla'!IX23)","v":"XXXX"},{"$f":"IF('[3]Tasa de Falla'!IY23=0,\"\",'[3]Tasa de Falla'!IY23)","v":"XXXX"},{"$f":"IF('[3]Tasa de Falla'!IZ23=0,\"\",'[3]Tasa de Falla'!IZ23)","v":"XXXX"},{"$f":"IF('[3]Tasa de Falla'!JA23=0,\"\",'[3]Tasa de Falla'!JA23)","v":"XXXX"},{"$f":"IF('[3]Tasa de Falla'!JB23=0,\"\",'[3]Tasa de Falla'!JB23)","v":"XXXX"},{"$f":"IF('[3]Tasa de Falla'!JC23=0,\"\",'[3]Tasa de Falla'!JC23)","v":"XXXX"},{"$f":"IF('[3]Tasa de Falla'!JD23=0,\"\",'[3]Tasa de Falla'!JD23)","v":"XXXX"},{"$f":"IF('[3]Tasa de Falla'!JE23=0,\"\",'[3]Tasa de Falla'!JE23)","v":"XXXX"},{"$f":"IF('[3]Tasa de Falla'!JF23=0,\"\",'[3]Tasa de Falla'!JF23)","v":"XXXX"},{"$f":"IF('[3]Tasa de Falla'!JG23=0,\"\",'[3]Tasa de Falla'!JG23)","v":"XXXX"}]
[null,null,{"$f":"'[3]Tasa de Falla'!C24","v":8},{"$f":"'[3]Tasa de Falla'!D24","v":"ESTATICA SUR - INDEPENDENCIA 1 (O.F.)"},{"$f":"'[3]Tasa de Falla'!E24","v":132},{"$f":"'[3]Tasa de Falla'!F24","v":2.6},{"$f":"IF('[3]Tasa de Falla'!IV24=0,\"\",'[3]Tasa de Falla'!IV24)","v":""},{"$f":"IF('[3]Tasa de Falla'!IW24=0,\"\",'[3]Tasa de Falla'!IW24)","v":""},{"$f":"IF('[3]Tasa de Falla'!IX24=0,\"\",'[3]Tasa de Falla'!IX24)","v":""},{"$f":"IF('[3]Tasa de Falla'!IY24=0,\"\",'[3]Tasa de Falla'!IY24)","v":""},{"$f":"IF('[3]Tasa de Falla'!IZ24=0,\"\",'[3]Tasa de Falla'!IZ24)","v":1},{"$f":"IF('[3]Tasa de Falla'!JA24=0,\"\",'[3]Tasa de Falla'!JA24)","v":""},{"$f":"IF('[3]Tasa de Falla'!JB24=0,\"\",'[3]Tasa de Falla'!JB24)","v":""},{"$f":"IF('[3]Tasa de Falla'!JC24=0,\"\",'[3]Tasa de Falla'!JC24)","v":""},{"$f":"IF('[3]Tasa de Falla'!JD24=0,\"\",'[3]Tasa de Falla'!JD24)","v":""},{"$f":"IF('[3]Tasa de Falla'!JE24=0,\"\",'[3]Tasa de Falla'!JE24)","v":""},{"$f":"IF('[3]Tasa de Falla'!JF24=0,\"\",'[3]Tasa de Falla'!JF24)","v":""},{"$f":"IF('[3]Tasa de Falla'!JG24=0,\"\",'[3]Tasa de Falla'!JG24)","v":""}]
[null,null,{"$f":"'[3]Tasa de Falla'!C25","v":9},{"$f":"'[3]Tasa de Falla'!D25","v":"ESTATICA SUR - SARMIENTO \"TRANSNOA S.A.\""},{"$f":"'[3]Tasa de Falla'!E25","v":132},{"$f":"'[3]Tasa de Falla'!F25","v":4.4000000000000004},{"$f":"IF('[3]Tasa de Falla'!IV25=0,\"\",'[3]Tasa de Falla'!IV25)","v":""},{"$f":"IF('[3]Tasa de Falla'!IW25=0,\"\",'[3]Tasa de Falla'!IW25)","v":""},{"$f":"IF('[3]Tasa de Falla'!IX25=0,\"\",'[3]Tasa de Falla'!IX25)","v":""},{"$f":"IF('[3]Tasa de Falla'!IY25=0,\"\",'[3]Tasa de Falla'!IY25)","v":""},{"$f":"IF('[3]Tasa de Falla'!IZ25=0,\"\",'[3]Tasa de Falla'!IZ25)","v":""},{"$f":"IF('[3]Tasa de Falla'!JA25=0,\"\",'[3]Tasa de Falla'!JA25)","v":""},{"$f":"IF('[3]Tasa de Falla'!JB25=0,\"\",'[3]Tasa de Falla'!JB25)","v":""},{"$f":"IF('[3]Tasa de Falla'!JC25=0,\"\",'[3]Tasa de Falla'!JC25)","v":""},{"$f":"IF('[3]Tasa de Falla'!JD25=0,\"\",'[3]Tasa de Falla'!JD25)","v":""},{"$f":"IF('[3]Tasa de Falla'!JE25=0,\"\",'[3]Tasa de Falla'!JE25)","v":""},{"$f":"IF('[3]Tasa de Falla'!JF25=0,\"\",'[3]Tasa de Falla'!JF25)","v":""},{"$f":"IF('[3]Tasa de Falla'!JG25=0,\"\",'[3]Tasa de Falla'!JG25)","v":""}]
[null,null,{"$f":"'[3]Tasa de Falla'!C26","v":10},{"$f":"'[3]Tasa de Falla'!D26","v":"GÜEMES - EL BRACHO"},{"$f":"'[3]Tasa de Falla'!E26","v":132},{"$f":"'[3]Tasa de Falla'!F26","v":308},{"$f":"IF('[3]Tasa de Falla'!IV26=0,\"\",'[3]Tasa de Falla'!IV26)","v":"XXXX"},{"$f":"IF('[3]Tasa de Falla'!IW26=0,\"\",'[3]Tasa de Falla'!IW26)","v":"XXXX"},{"$f":"IF('[3]Tasa de Falla'!IX26=0,\"\",'[3]Tasa de Falla'!IX26)","v":"XXXX"},{"$f":"IF('[3]Tasa de Falla'!IY26=0,\"\",'[3]Tasa de Falla'!IY26)","v":"XXXX"},{"$f":"IF('[3]Tasa de Falla'!IZ26=0,\"\",'[3]Tasa de Falla'!IZ26)","v":"XXXX"},{"$f":"IF('[3]Tasa de Falla'!JA26=0,\"\",'[3]Tasa de Falla'!JA26)","v":"XXXX"},{"$f":"IF('[3]Tasa de Falla'!JB26=0,\"\",'[3]Tasa de Falla'!JB26)","v":"XXXX"},{"$f":"IF('[3]Tasa de Falla'!JC26=0,\"\",'[3]Tasa de Falla'!JC26)","v":"XXXX"},{"$f":"IF('[3]Tasa de Falla'!JD26=0,\"\",'[3]Tasa de Falla'!JD26)","v":"XXXX"},{"$f":"IF('[3]Tasa de Falla'!JE26=0,\"\",'[3]Tasa de Falla'!JE26)","v":"XXXX"},{"$f":"IF('[3]Tasa de Falla'!JF26=0,\"\",'[3]Tasa de Falla'!JF26)","v":"XXXX"},{"$f":"IF('[3]Tasa de Falla'!JG26=0,\"\",'[3]Tasa de Falla'!JG26)","v":"XXXX"}]
[null,null,{"$f":"'[3]Tasa de Falla'!C27","v":11},{"$f":"'[3]Tasa de Falla'!D27","v":"CAMPO SANTO - GÜEMES"},{"$f":"'[3]Tasa de Falla'!E27","v":132},{"$f":"'[3]Tasa de Falla'!F27","v":6.2},{"$f":"IF('[3]Tasa de Falla'!IV27=0,\"\",'[3]Tasa de Falla'!IV27)","v":"XXXX"},{"$f":"IF('[3]Tasa de Falla'!IW27=0,\"\",'[3]Tasa de Falla'!IW27)","v":"XXXX"},{"$f":"IF('[3]Tasa de Falla'!IX27=0,\"\",'[3]Tasa de Falla'!IX27)","v":"XXXX"},{"$f":"IF('[3]Tasa de Falla'!IY27=0,\"\",'[3]Tasa de Falla'!IY27)","v":"XXXX"},{"$f":"IF('[3]Tasa de Falla'!IZ27=0,\"\",'[3]Tasa de Falla'!IZ27)","v":"XXXX"},{"$f":"IF('[3]Tasa de Falla'!JA27=0,\"\",'[3]Tasa de Falla'!JA27)","v":"XXXX"},{"$f":"IF('[3]Tasa de Falla'!JB27=0,\"\",'[3]Tasa de Falla'!JB27)","v":"XXXX"},{"$f":"IF('[3]Tasa de Falla'!JC27=0,\"\",'[3]Tasa de Falla'!JC27)","v":"XXXX"},{"$f":"IF('[3]Tasa de Falla'!JD27=0,\"\",'[3]Tasa de Falla'!JD27)","v":"XXXX"},{"$f":"IF('[3]Tasa de Falla'!JE27=0,\"\",'[3]Tasa de Falla'!JE27)","v":"XXXX"},{"$f":"IF('[3]Tasa de Falla'!JF27=0,\"\",'[3]Tasa de Falla'!JF27)","v":"XXXX"},{"$f":"IF('[3]Tasa de Falla'!JG27=0,\"\",'[3]Tasa de Falla'!JG27)","v":"XXXX"}]
[null,null,{"$f":"'[3]Tasa de Falla'!C28","v":12},{"$f":"'[3]Tasa de Falla'!D28","v":"GÜEMES - SAN JUANCITO"},{"$f":"'[3]Tasa de Falla'!E28","v":132},{"$f":"'[3]Tasa de Falla'!F28","v":36.24},{"$f":"IF('[3]Tasa de Falla'!IV28=0,\"\",'[3]Tasa de Falla'!IV28)","v":""},{"$f":"IF('[3]Tasa de Falla'!IW28=0,\"\",'[3]Tasa de Falla'!IW28)","v":3},{"$f":"IF('[3]Tasa de Falla'!IX28=0,\"\",'[3]Tasa de Falla'!IX28)","v":1},{"$f":"IF('[3]Tasa de Falla'!IY28=0,\"\",'[3]Tasa de Falla'!IY28)","v":""},{"$f":"IF('[3]Tasa de Falla'!IZ28=0,\"\",'[3]Tasa de Falla'!IZ28)","v":""},{"$f":"IF('[3]Tasa de Falla'!JA28=0,\"\",'[3]Tasa de Falla'!JA28)","v":""},{"$f":"IF('[3]Tasa de Falla'!JB28=0,\"\",'[3]Tasa de Falla'!JB28)","v":""},{"$f":"IF('[3]Tasa de Falla'!JC28=0,\"\",'[3]Tasa de Falla'!JC28)","v":""},{"$f":"IF('[3]Tasa de Falla'!JD28=0,\"\",'[3]Tasa de Falla'!JD28)","v":""},{"$f":"IF('[3]Tasa de Falla'!JE28=0,\"\",'[3]Tasa de Falla'!JE28)","v":2},{"$f":"IF('[3]Tasa de Falla'!JF28=0,\"\",'[3]Tasa de Falla'!JF28)","v":2},{"$f":"IF('[3]Tasa de Falla'!JG28=0,\"\",'[3]Tasa de Falla'!JG28)","v":2}]
[null,null,{"$f":"'[3]Tasa de Falla'!C29","v":13},{"$f":"'[3]Tasa de Falla'!D29","v":"CATAMARCA - HUACRA"},{"$f":"'[3]Tasa de Falla'!E29","v":132},{"$f":"'[3]Tasa de Falla'!F29","v":67.3},{"$f":"IF('[3]Tasa de Falla'!IV29=0,\"\",'[3]Tasa de Falla'!IV29)","v":""},{"$f":"IF('[3]Tasa de Falla'!IW29=0,\"\",'[3]Tasa de Falla'!IW29)","v":1},{"$f":"IF('[3]Tasa de Falla'!IX29=0,\"\",'[3]Tasa de Falla'!IX29)","v":""},{"$f":"IF('[3]Tasa de Falla'!IY29=0,\"\",'[3]Tasa de Falla'!IY29)","v":""},{"$f":"IF('[3]Tasa de Falla'!IZ29=0,\"\",'[3]Tasa de Falla'!IZ29)","v":""},{"$f":"IF('[3]Tasa de Falla'!JA29=0,\"\",'[3]Tasa de Falla'!JA29)","v":""},{"$f":"IF('[3]Tasa de Falla'!JB29=0,\"\",'[3]Tasa de Falla'!JB29)","v":""},{"$f":"IF('[3]Tasa de Falla'!JC29=0,\"\",'[3]Tasa de Falla'!JC29)","v":""},{"$f":"IF('[3]Tasa de Falla'!JD29=0,\"\",'[3]Tasa de Falla'!JD29)","v":""},{"$f":"IF('[3]Tasa de Falla'!JE29=0,\"\",'[3]Tasa de Falla'!JE29)","v":2},{"$f":"IF('[3]Tasa de Falla'!JF29=0,\"\",'[3]Tasa de Falla'!JF29)","v":""},{"$f":"IF('[3]Tasa de Falla'!JG29=0,\"\",'[3]Tasa de Falla'!JG29)","v":""}]
[null,null,{"$f":"'[3]Tasa de Falla'!C30","v":14},{"$f":"'[3]Tasa de Falla'!D30","v":"HUACRA - LA CALERA"},{"$f":"'[3]Tasa de Falla'!E30","v":132},{"$f":"'[3]Tasa de Falla'!F30","v":91.2},{"$f":"IF('[3]Tasa de Falla'!IV30=0,\"\",'[3]Tasa de Falla'!IV30)","v":""},{"$f":"IF('[3]Tasa de Falla'!IW30=0,\"\",'[3]Tasa de Falla'!IW30)","v":""},{"$f":"IF('[3]Tasa de Falla'!IX30=0,\"\",'[3]Tasa de Falla'!IX30)","v":1},{"$f":"IF('[3]Tasa de Falla'!IY30=0,\"\",'[3]Tasa de Falla'!IY30)","v":""},{"$f":"IF('[3]Tasa de Falla'!IZ30=0,\"\",'[3]Tasa de Falla'!IZ30)","v":""},{"$f":"IF('[3]Tasa de Falla'!JA30=0,\"\",'[3]Tasa de Falla'!JA30)","v":""},{"$f":"IF('[3]Tasa de Falla'!JB30=0,\"\",'[3]Tasa de Falla'!JB30)","v":""},{"$f":"IF('[3]Tasa de Falla'!JC30=0,\"\",'[3]Tasa de Falla'!JC30)","v":""},{"$f":"IF('[3]Tasa de Falla'!JD30=0,\"\",'[3]Tasa de Falla'!JD30)","v":""},{"$f":"IF('[3]Tasa de Falla'!JE30=0,\"\",'[3]Tasa de Falla'!JE30)","v":""},{"$f":"IF('[3]Tasa de Falla'!JF30=0,\"\",'[3]Tasa de Falla'!JF30)","v":""},{"$f":"IF('[3]Tasa de Falla'!JG30=0,\"\",'[3]Tasa de Falla'!JG30)","v":""}]
[null,null,{"$f":"'[3]Tasa de Falla'!C31","v":15},{"$f":"'[3]Tasa de Falla'!D31","v":"AGUA BLANCA - INDEPENDENCIA"},{"$f":"'[3]Tasa de Falla'!E31","v":132},{"$f":"'[3]Tasa de Falla'!F31","v":34.14},{"$f":"IF('[3]Tasa de Falla'!IV31=0,\"\",'[3]Tasa de Falla'!IV31)","v":""},{"$f":"IF('[3]Tasa de Falla'!IW31=0,\"\",'[3]Tasa de Falla'!IW31)","v":""},{"$f":"IF('[3]Tasa de Falla'!IX31=0,\"\",'[3]Tasa de Falla'!IX31)","v":""},{"$f":"IF('[3]Tasa de Falla'!IY31=0,\"\",'[3]Tasa de Falla'!IY31)","v":""},{"$f":"IF('[3]Tasa de Falla'!IZ31=0,\"\",'[3]Tasa de Falla'!IZ31)","v":""},{"$f":"IF('[3]Tasa de Falla'!JA31=0,\"\",'[3]Tasa de Falla'!JA31)","v":""},{"$f":"IF('[3]Tasa de Falla'!JB31=0,\"\",'[3]Tasa de Falla'!JB31)","v":1},{"$f":"IF('[3]Tasa de Falla'!JC31=0,\"\",'[3]Tasa de Falla'!JC31)","v":""},{"$f":"IF('[3]Tasa de Falla'!JD31=0,\"\",'[3]Tasa de Falla'!JD31)","v":""},{"$f":"IF('[3]Tasa de Falla'!JE31=0,\"\",'[3]Tasa de Falla'!JE31)","v":""},{"$f":"IF('[3]Tasa de Falla'!JF31=0,\"\",'[3]Tasa de Falla'!JF31)","v":""},{"$f":"IF('[3]Tasa de Falla'!JG31=0,\"\",'[3]Tasa de Falla'!JG31)","v":1}]
[null,null,{"$f":"'[3]Tasa de Falla'!C32","v":16},{"$f":"'[3]Tasa de Falla'!D32","v":"INDEPENDENCIA - EL BRACHO 1"},{"$f":"'[3]Tasa de Falla'!E32","v":132},{"$f":"'[3]Tasa de Falla'!F32","v":17.100000000000001},{"$f":"IF('[3]Tasa de Falla'!IV32=0,\"\",'[3]Tasa de Falla'!IV32)","v":""},{"$f":"IF('[3]Tasa de Falla'!IW32=0,\"\",'[3]Tasa de Falla'!IW32)","v":""},{"$f":"IF('[3]Tasa de Falla'!IX32=0,\"\",'[3]Tasa de Falla'!IX32)","v":""},{"$f":"IF('[3]Tasa de Falla'!IY32=0,\"\",'[3]Tasa de Falla'!IY32)","v":""},{"$f":"IF('[3]Tasa de Falla'!IZ32=0,\"\",'[3]Tasa de Falla'!IZ32)","v":""},{"$f":"IF('[3]Tasa de Falla'!JA32=0,\"\",'[3]Tasa de Falla'!JA32)","v":1},{"$f":"IF('[3]Tasa de Falla'!JB32=0,\"\",'[3]Tasa de Falla'!JB32)","v":""},{"$f":"IF('[3]Tasa de Falla'!JC32=0,\"\",'[3]Tasa de Falla'!JC32)","v":""},{"$f":"IF('[3]Tasa de Falla'!JD32=0,\"\",'[3]Tasa de Falla'!JD32)","v":""},{"$f":"IF('[3]Tasa de Falla'!JE32=0,\"\",'[3]Tasa de Falla'!JE32)","v":""},{"$f":"IF('[3]Tasa de Falla'!JF32=0,\"\",'[3]Tasa de Falla'!JF32)","v":""},{"$f":"IF('[3]Tasa de Falla'!JG32=0,\"\",'[3]Tasa de Falla'!JG32)","v":""}]
[null,null,{"$f":"'[3]Tasa de Falla'!C33","v":17},{"$f":"'[3]Tasa de Falla'!D33","v":"INDEPENDENCIA - LULES - PAPEL TUCUMAN"},{"$f":"'[3]Tasa de Falla'!E33","v":132},{"$f":"'[3]Tasa de Falla'!F33","v":19.3},{"$f":"IF('[3]Tasa de Falla'!IV33=0,\"\",'[3]Tasa de Falla'!IV33)","v":""},{"$f":"IF('[3]Tasa de Falla'!IW33=0,\"\",'[3]Tasa de Falla'!IW33)","v":""},{"$f":"IF('[3]Tasa de Falla'!IX33=0,\"\",'[3]Tasa de Falla'!IX33)","v":""},{"$f":"IF('[3]Tasa de Falla'!IY33=0,\"\",'[3]Tasa de Falla'!IY33)","v":""},{"$f":"IF('[3]Tasa de Falla'!IZ33=0,\"\",'[3]Tasa de Falla'!IZ33)","v":""},{"$f":"IF('[3]Tasa de Falla'!JA33=0,\"\",'[3]Tasa de Falla'!JA33)","v":""},{"$f":"IF('[3]Tasa de Falla'!JB33=0,\"\",'[3]Tasa de Falla'!JB33)","v":""},{"$f":"IF('[3]Tasa de Falla'!JC33=0,\"\",'[3]Tasa de Falla'!JC33)","v":""},{"$f":"IF('[3]Tasa de Falla'!JD33=0,\"\",'[3]Tasa de Falla'!JD33)","v":""},{"$f":"IF('[3]Tasa de Falla'!JE33=0,\"\",'[3]Tasa de Falla'!JE33)","v":""},{"$f":"IF('[3]Tasa de Falla'!JF33=0,\"\",'[3]Tasa de Falla'!JF33)","v":""},{"$f":"IF('[3]Tasa de Falla'!JG33=0,\"\",'[3]Tasa de Falla'!JG33)","v":""}]
[null,null,{"$f":"'[3]Tasa de Falla'!C34","v":18},{"$f":"'[3]Tasa de Falla'!D34","v":"FRIAS - LA CALERA NOA."},{"$f":"'[3]Tasa de Falla'!E34","v":132},{"$f":"'[3]Tasa de Falla'!F34","v":27.3},{"$f":"IF('[3]Tasa de Falla'!IV34=0,\"\",'[3]Tasa de Falla'!IV34)","v":""},{"$f":"IF('[3]Tasa de Falla'!IW34=0,\"\",'[3]Tasa de Falla'!IW34)","v":""},{"$f":"IF('[3]Tasa de Falla'!IX34=0,\"\",'[3]Tasa de Falla'!IX34)","v":""},{"$f":"IF('[3]Tasa de Falla'!IY34=0,\"\",'[3]Tasa de Falla'!IY34)","v":""},{"$f":"IF('[3]Tasa de Falla'!IZ34=0,\"\",'[3]Tasa de Falla'!IZ34)","v":""},{"$f":"IF('[3]Tasa de Falla'!JA34=0,\"\",'[3]Tasa de Falla'!JA34)","v":""},{"$f":"IF('[3]Tasa de Falla'!JB34=0,\"\",'[3]Tasa de Falla'!JB34)","v":""},{"$f":"IF('[3]Tasa de Falla'!JC34=0,\"\",'[3]Tasa de Falla'!JC34)","v":""},{"$f":"IF('[3]Tasa de Falla'!JD34=0,\"\",'[3]Tasa de Falla'!JD34)","v":""},{"$f":"IF('[3]Tasa de Falla'!JE34=0,\"\",'[3]Tasa de Falla'!JE34)","v":""},{"$f":"IF('[3]Tasa de Falla'!JF34=0,\"\",'[3]Tasa de Falla'!JF34)","v":""},{"$f":"IF('[3]Tasa de Falla'!JG34=0,\"\",'[3]Tasa de Falla'!JG34)","v":""}]
[null,null,{"$f":"'[3]Tasa de Falla'!C35","v":19},{"$f":"'[3]Tasa de Falla'!D35","v":"LA BANDA - SANTIAGO CENTRO"},{"$f":"'[3]Tasa de Falla'!E35","v":132},{"$f":"'[3]Tasa de Falla'!F35","v":10.91},{"$f":"IF('[3]Tasa de Falla'!IV35=0,\"\",'[3]Tasa de Falla'!IV35)","v":1},{"$f":"IF('[3]Tasa de Falla'!IW35=0,\"\",'[3]Tasa de Falla'!IW35)","v":""},{"$f":"IF('[3]Tasa de Falla'!IX35=0,\"\",'[3]Tasa de Falla'!IX35)","v":""},{"$f":"IF('[3]Tasa de Falla'!IY35=0,\"\",'[3]Tasa de Falla'!IY35)","v":"XXXX"},{"$f":"IF('[3]Tasa de Falla'!IZ35=0,\"\",'[3]Tasa de Falla'!IZ35)","v":"XXXX"},{"$f":"IF('[3]Tasa de Falla'!JA35=0,\"\",'[3]Tasa de Falla'!JA35)","v":"XXXX"},{"$f":"IF('[3]Tasa de Falla'!JB35=0,\"\",'[3]Tasa de Falla'!JB35)","v":"XXXX"},{"$f":"IF('[3]Tasa de Falla'!JC35=0,\"\",'[3]Tasa de Falla'!JC35)","v":"XXXX"},{"$f":"IF('[3]Tasa de Falla'!JD35=0,\"\",'[3]Tasa de Falla'!JD35)","v":"XXXX"},{"$f":"IF('[3]Tasa de Falla'!JE35=0,\"\",'[3]Tasa de Falla'!JE35)","v":"XXXX"},{"$f":"IF('[3]Tasa de Falla'!JF35=0,\"\",'[3]Tasa de Falla'!JF35)","v":"XXXX"},{"$f":"IF('[3]Tasa de Falla'!JG35=0,\"\",'[3]Tasa de Falla'!JG35)","v":"XXXX"}]
[null,null,{"$f":"'[3]Tasa de Falla'!C36","v":20},{"$f":"'[3]Tasa de Falla'!D36","v":"LIBERTADOR NOA. - PICHANAL"},{"$f":"'[3]Tasa de Falla'!E36","v":132},{"$f":"'[3]Tasa de Falla'!F36","v":76},{"$f":"IF('[3]Tasa de Falla'!IV36=0,\"\",'[3]Tasa de Falla'!IV36)","v":4},{"$f":"IF('[3]Tasa de Falla'!IW36=0,\"\",'[3]Tasa de Falla'!IW36)","v":""},{"$f":"IF('[3]Tasa de Falla'!IX36=0,\"\",'[3]Tasa de Falla'!IX36)","v":""},{"$f":"IF('[3]Tasa de Falla'!IY36=0,\"\",'[3]Tasa de Falla'!IY36)","v":""},{"$f":"IF('[3]Tasa de Falla'!IZ36=0,\"\",'[3]Tasa de Falla'!IZ36)","v":""},{"$f":"IF('[3]Tasa de Falla'!JA36=0,\"\",'[3]Tasa de Falla'!JA36)","v":""},{"$f":"IF('[3]Tasa de Falla'!JB36=0,\"\",'[3]Tasa de Falla'!JB36)","v":""},{"$f":"IF('[3]Tasa de Falla'!JC36=0,\"\",'[3]Tasa de Falla'!JC36)","v":""},{"$f":"IF('[3]Tasa de Falla'!JD36=0,\"\",'[3]Tasa de Falla'!JD36)","v":1},{"$f":"IF('[3]Tasa de Falla'!JE36=0,\"\",'[3]Tasa de Falla'!JE36)","v":1},{"$f":"IF('[3]Tasa de Falla'!JF36=0,\"\",'[3]Tasa de Falla'!JF36)","v":1},{"$f":"IF('[3]Tasa de Falla'!JG36=0,\"\",'[3]Tasa de Falla'!JG36)","v":""}]
[null,null,{"$f":"'[3]Tasa de Falla'!C37","v":21},{"$f":"'[3]Tasa de Falla'!D37","v":"GÜEMES - METAN"},{"$f":"'[3]Tasa de Falla'!E37","v":132},{"$f":"'[3]Tasa de Falla'!F37","v":97.13},{"$f":"IF('[3]Tasa de Falla'!IV37=0,\"\",'[3]Tasa de Falla'!IV37)","v":"XXXX"},{"$f":"IF('[3]Tasa de Falla'!IW37=0,\"\",'[3]Tasa de Falla'!IW37)","v":"XXXX"},{"$f":"IF('[3]Tasa de Falla'!IX37=0,\"\",'[3]Tasa de Falla'!IX37)","v":"XXXX"},{"$f":"IF('[3]Tasa de Falla'!IY37=0,\"\",'[3]Tasa de Falla'!IY37)","v":"XXXX"},{"$f":"IF('[3]Tasa de Falla'!IZ37=0,\"\",'[3]Tasa de Falla'!IZ37)","v":"XXXX"},{"$f":"IF('[3]Tasa de Falla'!JA37=0,\"\",'[3]Tasa de Falla'!JA37)","v":"XXXX"},{"$f":"IF('[3]Tasa de Falla'!JB37=0,\"\",'[3]Tasa de Falla'!JB37)","v":"XXXX"},{"$f":"IF('[3]Tasa de Falla'!JC37=0,\"\",'[3]Tasa de Falla'!JC37)","v":"XXXX"},{"$f":"IF('[3]Tasa de Falla'!JD37=0,\"\",'[3]Tasa de Falla'!JD37)","v":"XXXX"},{"$f":"IF('[3]Tasa de Falla'!JE37=0,\"\",'[3]Tasa de Falla'!JE37)","v":"XXXX"},{"$f":"IF('[3]Tasa de Falla'!JF37=0,\"\",'[3]Tasa de Falla'!JF37)","v":"XXXX"},{"$f":"IF('[3]Tasa de Falla'!JG37=0,\"\",'[3]Tasa de Falla'!JG37)","v":"XXXX"}]
[null,null,{"$f":"'[3]Tasa de Falla'!C38","v":22},{"$f":"'[3]Tasa de Falla'!D38","v":"MINETTI - SAN JUANCITO"},{"$f":"'[3]Tasa de Falla'!E38","v":132},{"$f":"'[3]Tasa de Falla'!F38","v":26},{"$f":"IF('[3]Tasa de Falla'!IV38=0,\"\",'[3]Tasa de Falla'!IV38)","v":""},{"$f":"IF('[3]Tasa de Falla'!IW38=0,\"\",'[3]Tasa de Falla'!IW38)","v":""},{"$f":"IF('[3]Tasa de Falla'!IX38=0,\"\",'[3]Tasa de Falla'!IX38)","v":2},{"$f":"IF('[3]Tasa de Falla'!IY38=0,\"\",'[3]Tasa de Falla'!IY38)","v":""},{"$f":"IF('[3]Tasa de Falla'!IZ38=0,\"\",'[3]Tasa de Falla'!IZ38)","v":""},{"$f":"IF('[3]Tasa de Falla'!JA38=0,\"\",'[3]Tasa de Falla'!JA38)","v":1},{"$f":"IF('[3]Tasa de Falla'!JB38=0,\"\",'[3]Tasa de Falla'!JB38)","v":""},{"$f":"IF('[3]Tasa de Falla'!JC38=0,\"\",'[3]Tasa de Falla'!JC38)","v":""},{"$f":"IF('[3]Tasa de Falla'!JD38=0,\"\",'[3]Tasa de Falla'!JD38)","v":""},{"$f":"IF('[3]Tasa de Falla'!JE38=0,\"\",'[3]Tasa de Falla'!JE38)","v":""},{"$f":"IF('[3]Tasa de Falla'!JF38=0,\"\",'[3]Tasa de Falla'!JF38)","v":""},{"$f":"IF('[3]Tasa de Falla'!JG38=0,\"\",'[3]Tasa de Falla'!JG38)","v":""}]
[null,null,{"$f":"'[3]Tasa de Falla'!C39","v":23},{"$f":"'[3]Tasa de Falla'!D39","v":"PALPALA - JUJUY SUR"},{"$f":"'[3]Tasa de Falla'!E39","v":132},{"$f":"'[3]Tasa de Falla'!F39","v":14},{"$f":"IF('[3]Tasa de Falla'!IV39=0,\"\",'[3]Tasa de Falla'!IV39)","v":"XXXX"},{"$f":"IF('[3]Tasa de Falla'!IW39=0,\"\",'[3]Tasa de Falla'!IW39)","v":"XXXX"},{"$f":"IF('[3]Tasa de Falla'!IX39=0,\"\",'[3]Tasa de Falla'!IX39)","v":"XXXX"},{"$f":"IF('[3]Tasa de Falla'!IY39=0,\"\",'[3]Tasa de Falla'!IY39)","v":"XXXX"},{"$f":"IF('[3]Tasa de Falla'!IZ39=0,\"\",'[3]Tasa de Falla'!IZ39)","v":"XXXX"},{"$f":"IF('[3]Tasa de Falla'!JA39=0,\"\",'[3]Tasa de Falla'!JA39)","v":"XXXX"},{"$f":"IF('[3]Tasa de Falla'!JB39=0,\"\",'[3]Tasa de Falla'!JB39)","v":"XXXX"},{"$f":"IF('[3]Tasa de Falla'!JC39=0,\"\",'[3]Tasa de Falla'!JC39)","v":"XXXX"},{"$f":"IF('[3]Tasa de Falla'!JD39=0,\"\",'[3]Tasa de Falla'!JD39)","v":"XXXX"},{"$f":"IF('[3]Tasa de Falla'!JE39=0,\"\",'[3]Tasa de Falla'!JE39)","v":"XXXX"},{"$f":"IF('[3]Tasa de Falla'!JF39=0,\"\",'[3]Tasa de Falla'!JF39)","v":"XXXX"},{"$f":"IF('[3]Tasa de Falla'!JG39=0,\"\",'[3]Tasa de Falla'!JG39)","v":"XXXX"}]
[null,null,{"$f":"'[3]Tasa de Falla'!C40","v":24},{"$f":"'[3]Tasa de Falla'!D40","v":"ORAN - PICHANAL"},{"$f":"'[3]Tasa de Falla'!E40","v":132},{"$f":"'[3]Tasa de Falla'!F40","v":17},{"$f":"IF('[3]Tasa de Falla'!IV40=0,\"\",'[3]Tasa de Falla'!IV40)","v":"XXXX"},{"$f":"IF('[3]Tasa de Falla'!IW40=0,\"\",'[3]Tasa de Falla'!IW40)","v":"XXXX"},{"$f":"IF('[3]Tasa de Falla'!IX40=0,\"\",'[3]Tasa de Falla'!IX40)","v":"XXXX"},{"$f":"IF('[3]Tasa de Falla'!IY40=0,\"\",'[3]Tasa de Falla'!IY40)","v":"XXXX"},{"$f":"IF('[3]Tasa de Falla'!IZ40=0,\"\",'[3]Tasa de Falla'!IZ40)","v":"XXXX"},{"$f":"IF('[3]Tasa de Falla'!JA40=0,\"\",'[3]Tasa de Falla'!JA40)","v":"XXXX"},{"$f":"IF('[3]Tasa de Falla'!JB40=0,\"\",'[3]Tasa de Falla'!JB40)","v":"XXXX"},{"$f":"IF('[3]Tasa de Falla'!JC40=0,\"\",'[3]Tasa de Falla'!JC40)","v":"XXXX"},{"$f":"IF('[3]Tasa de Falla'!JD40=0,\"\",'[3]Tasa de Falla'!JD40)","v":"XXXX"},{"$f":"IF('[3]Tasa de Falla'!JE40=0,\"\",'[3]Tasa de Falla'!JE40)","v":"XXXX"},{"$f":"IF('[3]Tasa de Falla'!JF40=0,\"\",'[3]Tasa de Falla'!JF40)","v":"XXXX"},{"$f":"IF('[3]Tasa de Falla'!JG40=0,\"\",'[3]Tasa de Falla'!JG40)","v":"XXXX"}]
[null,null,{"$f":"'[3]Tasa de Falla'!C41","v":25},{"$f":"'[3]Tasa de Falla'!D41","v":"PICHANAL - TARTAGAL"},{"$f":"'[3]Tasa de Falla'!E41","v":132},{"$f":"'[3]Tasa de Falla'!F41","v":105},{"$f":"IF('[3]Tasa de Falla'!IV41=0,\"\",'[3]Tasa de Falla'!IV41)","v":"XXXX"},{"$f":"IF('[3]Tasa de Falla'!IW41=0,\"\",'[3]Tasa de Falla'!IW41)","v":"XXXX"},{"$f":"IF('[3]Tasa de Falla'!IX41=0,\"\",'[3]Tasa de Falla'!IX41)","v":"XXXX"},{"$f":"IF('[3]Tasa de Falla'!IY41=0,\"\",'[3]Tasa de Falla'!IY41)","v":"XXXX"},{"$f":"IF('[3]Tasa de Falla'!IZ41=0,\"\",'[3]Tasa de Falla'!IZ41)","v":"XXXX"},{"$f":"IF('[3]Tasa de Falla'!JA41=0,\"\",'[3]Tasa de Falla'!JA41)","v":"XXXX"},{"$f":"IF('[3]Tasa de Falla'!JB41=0,\"\",'[3]Tasa de Falla'!JB41)","v":"XXXX"},{"$f":"IF('[3]Tasa de Falla'!JC41=0,\"\",'[3]Tasa de Falla'!JC41)","v":"XXXX"},{"$f":"IF('[3]Tasa de Falla'!JD41=0,\"\",'[3]Tasa de Falla'!JD41)","v":"XXXX"},{"$f":"IF('[3]Tasa de Falla'!JE41=0,\"\",'[3]Tasa de Falla'!JE41)","v":"XXXX"},{"$f":"IF('[3]Tasa de Falla'!JF41=0,\"\",'[3]Tasa de Falla'!JF41)","v":"XXXX"},{"$f":"IF('[3]Tasa de Falla'!JG41=0,\"\",'[3]Tasa de Falla'!JG41)","v":"XXXX"}]
[null,null,{"$f":"'[3]Tasa de Falla'!C42","v":26},{"$f":"'[3]Tasa de Falla'!D42","v":"C.H. RIO HONDO - LA BANDA"},{"$f":"'[3]Tasa de Falla'!E42","v":132},{"$f":"'[3]Tasa de Falla'!F42","v":76.5},{"$f":"IF('[3]Tasa de Falla'!IV42=0,\"\",'[3]Tasa de Falla'!IV42)","v":1},{"$f":"IF('[3]Tasa de Falla'!IW42=0,\"\",'[3]Tasa de Falla'!IW42)","v":""},{"$f":"IF('[3]Tasa de Falla'!IX42=0,\"\",'[3]Tasa de Falla'!IX42)","v":""},{"$f":"IF('[3]Tasa de Falla'!IY42=0,\"\",'[3]Tasa de Falla'!IY42)","v":""},{"$f":"IF('[3]Tasa de Falla'!IZ42=0,\"\",'[3]Tasa de Falla'!IZ42)","v":""},{"$f":"IF('[3]Tasa de Falla'!JA42=0,\"\",'[3]Tasa de Falla'!JA42)","v":""},{"$f":"IF('[3]Tasa de Falla'!JB42=0,\"\",'[3]Tasa de Falla'!JB42)","v":""},{"$f":"IF('[3]Tasa de Falla'!JC42=0,\"\",'[3]Tasa de Falla'!JC42)","v":""},{"$f":"IF('[3]Tasa de Falla'!JD42=0,\"\",'[3]Tasa de Falla'!JD42)","v":1},{"$f":"IF('[3]Tasa de Falla'!JE42=0,\"\",'[3]Tasa de Falla'!JE42)","v":""},{"$f":"IF('[3]Tasa de Falla'!JF42=0,\"\",'[3]Tasa de Falla'!JF42)","v":""},{"$f":"IF('[3]Tasa de Falla'!JG42=0,\"\",'[3]Tasa de Falla'!JG42)","v":""}]
[null,null,{"$f":"'[3]Tasa de Falla'!C43","v":27},{"$f":"'[3]Tasa de Falla'!D43","v":"LA RIOJA - RECREO  2"},{"$f":"'[3]Tasa de Falla'!E43","v":132},{"$f":"'[3]Tasa de Falla'!F43","v":220},{"$f":"IF('[3]Tasa de Falla'!IV43=0,\"\",'[3]Tasa de Falla'!IV43)","v":"XXXX"},{"$f":"IF('[3]Tasa de Falla'!IW43=0,\"\",'[3]Tasa de Falla'!IW43)","v":"XXXX"},{"$f":"IF('[3]Tasa de Falla'!IX43=0,\"\",'[3]Tasa de Falla'!IX43)","v":"XXXX"},{"$f":"IF('[3]Tasa de Falla'!IY43=0,\"\",'[3]Tasa de Falla'!IY43)","v":"XXXX"},{"$f":"IF('[3]Tasa de Falla'!IZ43=0,\"\",'[3]Tasa de Falla'!IZ43)","v":"XXXX"},{"$f":"IF('[3]Tasa de Falla'!JA43=0,\"\",'[3]Tasa de Falla'!JA43)","v":"XXXX"},{"$f":"IF('[3]Tasa de Falla'!JB43=0,\"\",'[3]Tasa de Falla'!JB43)","v":"XXXX"},{"$f":"IF('[3]Tasa de Falla'!JC43=0,\"\",'[3]Tasa de Falla'!JC43)","v":"XXXX"},{"$f":"IF('[3]Tasa de Falla'!JD43=0,\"\",'[3]Tasa de Falla'!JD43)","v":"XXXX"},{"$f":"IF('[3]Tasa de Falla'!JE43=0,\"\",'[3]Tasa de Falla'!JE43)","v":"XXXX"},{"$f":"IF('[3]Tasa de Falla'!JF43=0,\"\",'[3]Tasa de Falla'!JF43)","v":"XXXX"},{"$f":"IF('[3]Tasa de Falla'!JG43=0,\"\",'[3]Tasa de Falla'!JG43)","v":"XXXX"}]
[null,null,{"$f":"'[3]Tasa de Falla'!C44","v":28},{"$f":"'[3]Tasa de Falla'!D44","v":"CAMPO SANTO - SALTA SUR"},{"$f":"'[3]Tasa de Falla'!E44","v":132},{"$f":"'[3]Tasa de Falla'!F44","v":40.92},{"$f":"IF('[3]Tasa de Falla'!IV44=0,\"\",'[3]Tasa de Falla'!IV44)","v":"XXXX"},{"$f":"IF('[3]Tasa de Falla'!IW44=0,\"\",'[3]Tasa de Falla'!IW44)","v":"XXXX"},{"$f":"IF('[3]Tasa de Falla'!IX44=0,\"\",'[3]Tasa de Falla'!IX44)","v":"XXXX"},{"$f":"IF('[3]Tasa de Falla'!IY44=0,\"\",'[3]Tasa de Falla'!IY44)","v":"XXXX"},{"$f":"IF('[3]Tasa de Falla'!IZ44=0,\"\",'[3]Tasa de Falla'!IZ44)","v":"XXXX"},{"$f":"IF('[3]Tasa de Falla'!JA44=0,\"\",'[3]Tasa de Falla'!JA44)","v":"XXXX"},{"$f":"IF('[3]Tasa de Falla'!JB44=0,\"\",'[3]Tasa de Falla'!JB44)","v":"XXXX"},{"$f":"IF('[3]Tasa de Falla'!JC44=0,\"\",'[3]Tasa de Falla'!JC44)","v":"XXXX"},{"$f":"IF('[3]Tasa de Falla'!JD44=0,\"\",'[3]Tasa de Falla'!JD44)","v":"XXXX"},{"$f":"IF('[3]Tasa de Falla'!JE44=0,\"\",'[3]Tasa de Falla'!JE44)","v":"XXXX"},{"$f":"IF('[3]Tasa de Falla'!JF44=0,\"\",'[3]Tasa de Falla'!JF44)","v":"XXXX"},{"$f":"IF('[3]Tasa de Falla'!JG44=0,\"\",'[3]Tasa de Falla'!JG44)","v":"XXXX"}]
[null,null,{"$f":"'[3]Tasa de Falla'!C45","v":29},{"$f":"'[3]Tasa de Falla'!D45","v":"PALPALA - SAN JUANCITO"},{"$f":"'[3]Tasa de Falla'!E45","v":132},{"$f":"'[3]Tasa de Falla'!F45","v":23.9},{"$f":"IF('[3]Tasa de Falla'!IV45=0,\"\",'[3]Tasa de Falla'!IV45)","v":""},{"$f":"IF('[3]Tasa de Falla'!IW45=0,\"\",'[3]Tasa de Falla'!IW45)","v":2},{"$f":"IF('[3]Tasa de Falla'!IX45=0,\"\",'[3]Tasa de Falla'!IX45)","v":2},{"$f":"IF('[3]Tasa de Falla'!IY45=0,\"\",'[3]Tasa de Falla'!IY45)","v":""},{"$f":"IF('[3]Tasa de Falla'!IZ45=0,\"\",'[3]Tasa de Falla'!IZ45)","v":""},{"$f":"IF('[3]Tasa de Falla'!JA45=0,\"\",'[3]Tasa de Falla'!JA45)","v":""},{"$f":"IF('[3]Tasa de Falla'!JB45=0,\"\",'[3]Tasa de Falla'!JB45)","v":""},{"$f":"IF('[3]Tasa de Falla'!JC45=0,\"\",'[3]Tasa de Falla'!JC45)","v":""},{"$f":"IF('[3]Tasa de Falla'!JD45=0,\"\",'[3]Tasa de Falla'!JD45)","v":2},{"$f":"IF('[3]Tasa de Falla'!JE45=0,\"\",'[3]Tasa de Falla'!JE45)","v":""},{"$f":"IF('[3]Tasa de Falla'!JF45=0,\"\",'[3]Tasa de Falla'!JF45)","v":""},{"$f":"IF('[3]Tasa de Falla'!JG45=0,\"\",'[3]Tasa de Falla'!JG45)","v":1}]
[null,null,{"$f":"'[3]Tasa de Falla'!C46","v":30},{"$f":"'[3]Tasa de Falla'!D46","v":"SAN JUANCITO - SAN PEDRO JUJUY"},{"$f":"'[3]Tasa de Falla'!E46","v":132},{"$f":"'[3]Tasa de Falla'!F46","v":27},{"$f":"IF('[3]Tasa de Falla'!IV46=0,\"\",'[3]Tasa de Falla'!IV46)","v":""},{"$f":"IF('[3]Tasa de Falla'!IW46=0,\"\",'[3]Tasa de Falla'!IW46)","v":""},{"$f":"IF('[3]Tasa de Falla'!IX46=0,\"\",'[3]Tasa de Falla'!IX46)","v":""},{"$f":"IF('[3]Tasa de Falla'!IY46=0,\"\",'[3]Tasa de Falla'!IY46)","v":""},{"$f":"IF('[3]Tasa de Falla'!IZ46=0,\"\",'[3]Tasa de Falla'!IZ46)","v":""},{"$f":"IF('[3]Tasa de Falla'!JA46=0,\"\",'[3]Tasa de Falla'!JA46)","v":""},{"$f":"IF('[3]Tasa de Falla'!JB46=0,\"\",'[3]Tasa de Falla'!JB46)","v":""},{"$f":"IF('[3]Tasa de Falla'!JC46=0,\"\",'[3]Tasa de Falla'!JC46)","v":""},{"$f":"IF('[3]Tasa de Falla'!JD46=0,\"\",'[3]Tasa de Falla'!JD46)","v":""},{"$f":"IF('[3]Tasa de Falla'!JE46=0,\"\",'[3]Tasa de Falla'!JE46)","v":""},{"$f":"IF('[3]Tasa de Falla'!JF46=0,\"\",'[3]Tasa de Falla'!JF46)","v":""},{"$f":"IF('[3]Tasa de Falla'!JG46=0,\"\",'[3]Tasa de Falla'!JG46)","v":""}]
[null,null,{"$f":"'[3]Tasa de Falla'!C47","v":31},{"$f":"'[3]Tasa de Falla'!D47","v":"SAN MARTIN - CATAMARCA"},{"$f":"'[3]Tasa de Falla'!E47","v":132},{"$f":"'[3]Tasa de Falla'!F47","v":88},{"$f":"IF('[3]Tasa de Falla'!IV47=0,\"\",'[3]Tasa de Falla'!IV47)","v":"XXXX"},{"$f":"IF('[3]Tasa de Falla'!IW47=0,\"\",'[3]Tasa de Falla'!IW47)","v":"XXXX"},{"$f":"IF('[3]Tasa de Falla'!IX47=0,\"\",'[3]Tasa de Falla'!IX47)","v":"XXXX"},{"$f":"IF('[3]Tasa de Falla'!IY47=0,\"\",'[3]Tasa de Falla'!IY47)","v":"XXXX"},{"$f":"IF('[3]Tasa de Falla'!IZ47=0,\"\",'[3]Tasa de Falla'!IZ47)","v":"XXXX"},{"$f":"IF('[3]Tasa de Falla'!JA47=0,\"\",'[3]Tasa de Falla'!JA47)","v":"XXXX"},{"$f":"IF('[3]Tasa de Falla'!JB47=0,\"\",'[3]Tasa de Falla'!JB47)","v":"XXXX"},{"$f":"IF('[3]Tasa de Falla'!JC47=0,\"\",'[3]Tasa de Falla'!JC47)","v":"XXXX"},{"$f":"IF('[3]Tasa de Falla'!JD47=0,\"\",'[3]Tasa de Falla'!JD47)","v":"XXXX"},{"$f":"IF('[3]Tasa de Falla'!JE47=0,\"\",'[3]Tasa de Falla'!JE47)","v":"XXXX"},{"$f":"IF('[3]Tasa de Falla'!JF47=0,\"\",'[3]Tasa de Falla'!JF47)","v":"XXXX"},{"$f":"IF('[3]Tasa de Falla'!JG47=0,\"\",'[3]Tasa de Falla'!JG47)","v":"XXXX"}]
[null,null,{"$f":"'[3]Tasa de Falla'!C48","v":32},{"$f":"'[3]Tasa de Falla'!D48","v":"SAN MARTIN - RECREO"},{"$f":"'[3]Tasa de Falla'!E48","v":132},{"$f":"'[3]Tasa de Falla'!F48","v":115},{"$f":"IF('[3]Tasa de Falla'!IV48=0,\"\",'[3]Tasa de Falla'!IV48)","v":"XXXX"},{"$f":"IF('[3]Tasa de Falla'!IW48=0,\"\",'[3]Tasa de Falla'!IW48)","v":"XXXX"},{"$f":"IF('[3]Tasa de Falla'!IX48=0,\"\",'[3]Tasa de Falla'!IX48)","v":"XXXX"},{"$f":"IF('[3]Tasa de Falla'!IY48=0,\"\",'[3]Tasa de Falla'!IY48)","v":"XXXX"},{"$f":"IF('[3]Tasa de Falla'!IZ48=0,\"\",'[3]Tasa de Falla'!IZ48)","v":"XXXX"},{"$f":"IF('[3]Tasa de Falla'!JA48=0,\"\",'[3]Tasa de Falla'!JA48)","v":"XXXX"},{"$f":"IF('[3]Tasa de Falla'!JB48=0,\"\",'[3]Tasa de Falla'!JB48)","v":"XXXX"},{"$f":"IF('[3]Tasa de Falla'!JC48=0,\"\",'[3]Tasa de Falla'!JC48)","v":"XXXX"},{"$f":"IF('[3]Tasa de Falla'!JD48=0,\"\",'[3]Tasa de Falla'!JD48)","v":"XXXX"},{"$f":"IF('[3]Tasa de Falla'!JE48=0,\"\",'[3]Tasa de Falla'!JE48)","v":"XXXX"},{"$f":"IF('[3]Tasa de Falla'!JF48=0,\"\",'[3]Tasa de Falla'!JF48)","v":"XXXX"},{"$f":"IF('[3]Tasa de Falla'!JG48=0,\"\",'[3]Tasa de Falla'!JG48)","v":"XXXX"}]
[null,null,{"$f":"'[3]Tasa de Falla'!C49","v":33},{"$f":"'[3]Tasa de Falla'!D49","v":"SAN MARTIN C. - LA RIOJA"},{"$f":"'[3]Tasa de Falla'!E49","v":132},{"$f":"'[3]Tasa de Falla'!F49","v":105},{"$f":"IF('[3]Tasa de Falla'!IV49=0,\"\",'[3]Tasa de Falla'!IV49)","v":"XXXX"},{"$f":"IF('[3]Tasa de Falla'!IW49=0,\"\",'[3]Tasa de Falla'!IW49)","v":"XXXX"},{"$f":"IF('[3]Tasa de Falla'!IX49=0,\"\",'[3]Tasa de Falla'!IX49)","v":"XXXX"},{"$f":"IF('[3]Tasa de Falla'!IY49=0,\"\",'[3]Tasa de Falla'!IY49)","v":"XXXX"},{"$f":"IF('[3]Tasa de Falla'!IZ49=0,\"\",'[3]Tasa de Falla'!IZ49)","v":"XXXX"},{"$f":"IF('[3]Tasa de Falla'!JA49=0,\"\",'[3]Tasa de Falla'!JA49)","v":"XXXX"},{"$f":"IF('[3]Tasa de Falla'!JB49=0,\"\",'[3]Tasa de Falla'!JB49)","v":"XXXX"},{"$f":"IF('[3]Tasa de Falla'!JC49=0,\"\",'[3]Tasa de Falla'!JC49)","v":"XXXX"},{"$f":"IF('[3]Tasa de Falla'!JD49=0,\"\",'[3]Tasa de Falla'!JD49)","v":"XXXX"},{"$f":"IF('[3]Tasa de Falla'!JE49=0,\"\",'[3]Tasa de Falla'!JE49)","v":"XXXX"},{"$f":"IF('[3]Tasa de Falla'!JF49=0,\"\",'[3]Tasa de Falla'!JF49)","v":"XXXX"},{"$f":"IF('[3]Tasa de Falla'!JG49=0,\"\",'[3]Tasa de Falla'!JG49)","v":"XXXX"}]
[null,null,{"$f":"'[3]Tasa de Falla'!C50","v":34},{"$f":"'[3]Tasa de Falla'!D50","v":"SAN PEDRO JUJUY - LIBERTADOR NOA."},{"$f":"'[3]Tasa de Falla'!E50","v":132},{"$f":"'[3]Tasa de Falla'!F50","v":49},{"$f":"IF('[3]Tasa de Falla'!IV50=0,\"\",'[3]Tasa de Falla'!IV50)","v":""},{"$f":"IF('[3]Tasa de Falla'!IW50=0,\"\",'[3]Tasa de Falla'!IW50)","v":""},{"$f":"IF('[3]Tasa de Falla'!IX50=0,\"\",'[3]Tasa de Falla'!IX50)","v":""},{"$f":"IF('[3]Tasa de Falla'!IY50=0,\"\",'[3]Tasa de Falla'!IY50)","v":""},{"$f":"IF('[3]Tasa de Falla'!IZ50=0,\"\",'[3]Tasa de Falla'!IZ50)","v":""},{"$f":"IF('[3]Tasa de Falla'!JA50=0,\"\",'[3]Tasa de Falla'!JA50)","v":""},{"$f":"IF('[3]Tasa de Falla'!JB50=0,\"\",'[3]Tasa de Falla'!JB50)","v":""},{"$f":"IF('[3]Tasa de Falla'!JC50=0,\"\",'[3]Tasa de Falla'!JC50)","v":""},{"$f":"IF('[3]Tasa de Falla'!JD50=0,\"\",'[3]Tasa de Falla'!JD50)","v":1},{"$f":"IF('[3]Tasa de Falla'!JE50=0,\"\",'[3]Tasa de Falla'!JE50)","v":""},{"$f":"IF('[3]Tasa de Falla'!JF50=0,\"\",'[3]Tasa de Falla'!JF50)","v":""},{"$f":"IF('[3]Tasa de Falla'!JG50=0,\"\",'[3]Tasa de Falla'!JG50)","v":""}]
[null,null,{"$f":"'[3]Tasa de Falla'!C51","v":35},{"$f":"'[3]Tasa de Falla'!D51","v":"TUCUMAN NORTE - EL BRACHO"},{"$f":"'[3]Tasa de Falla'!E51","v":132},{"$f":"'[3]Tasa de Falla'!F51","v":31.5},{"$f":"IF('[3]Tasa de Falla'!IV51=0,\"\",'[3]Tasa de Falla'!IV51)","v":""},{"$f":"IF('[3]Tasa de Falla'!IW51=0,\"\",'[3]Tasa de Falla'!IW51)","v":""},{"$f":"IF('[3]Tasa de Falla'!IX51=0,\"\",'[3]Tasa de Falla'!IX51)","v":""},{"$f":"IF('[3]Tasa de Falla'!IY51=0,\"\",'[3]Tasa de Falla'!IY51)","v":""},{"$f":"IF('[3]Tasa de Falla'!IZ51=0,\"\",'[3]Tasa de Falla'!IZ51)","v":""},{"$f":"IF('[3]Tasa de Falla'!JA51=0,\"\",'[3]Tasa de Falla'!JA51)","v":1},{"$f":"IF('[3]Tasa de Falla'!JB51=0,\"\",'[3]Tasa de Falla'!JB51)","v":""},{"$f":"IF('[3]Tasa de Falla'!JC51=0,\"\",'[3]Tasa de Falla'!JC51)","v":""},{"$f":"IF('[3]Tasa de Falla'!JD51=0,\"\",'[3]Tasa de Falla'!JD51)","v":""},{"$f":"IF('[3]Tasa de Falla'!JE51=0,\"\",'[3]Tasa de Falla'!JE51)","v":""},{"$f":"IF('[3]Tasa de Falla'!JF51=0,\"\",'[3]Tasa de Falla'!JF51)","v":""},{"$f":"IF('[3]Tasa de Falla'!JG51=0,\"\",'[3]Tasa de Falla'!JG51)","v":""}]
[null,null,{"$f":"'[3]Tasa de Falla'!C52","v":36},{"$f":"'[3]Tasa de Falla'!D52","v":"C.H. EL CADILLAL - TUCUMAN NORTE"},{"$f":"'[3]Tasa de Falla'!E52","v":132},{"$f":"'[3]Tasa de Falla'!F52","v":21.8},{"$f":"IF('[3]Tasa de Falla'!IV52=0,\"\",'[3]Tasa de Falla'!IV52)","v":""},{"$f":"IF('[3]Tasa de Falla'!IW52=0,\"\",'[3]Tasa de Falla'!IW52)","v":1},{"$f":"IF('[3]Tasa de Falla'!IX52=0,\"\",'[3]Tasa de Falla'!IX52)","v":""},{"$f":"IF('[3]Tasa de Falla'!IY52=0,\"\",'[3]Tasa de Falla'!IY52)","v":""},{"$f":"IF('[3]Tasa de Falla'!IZ52=0,\"\",'[3]Tasa de Falla'!IZ52)","v":""},{"$f":"IF('[3]Tasa de Falla'!JA52=0,\"\",'[3]Tasa de Falla'!JA52)","v":""},{"$f":"IF('[3]Tasa de Falla'!JB52=0,\"\",'[3]Tasa de Falla'!JB52)","v":""},{"$f":"IF('[3]Tasa de Falla'!JC52=0,\"\",'[3]Tasa de Falla'!JC52)","v":""},{"$f":"IF('[3]Tasa de Falla'!JD52=0,\"\",'[3]Tasa de Falla'!JD52)","v":""},{"$f":"IF('[3]Tasa de Falla'!JE52=0,\"\",'[3]Tasa de Falla'!JE52)","v":""},{"$f":"IF('[3]Tasa de Falla'!JF52=0,\"\",'[3]Tasa de Falla'!JF52)","v":""},{"$f":"IF('[3]Tasa de Falla'!JG52=0,\"\",'[3]Tasa de Falla'!JG52)","v":""}]
[null,null,{"$f":"'[3]Tasa de Falla'!C53","v":37},{"$f":"'[3]Tasa de Falla'!D53","v":"TUCUMAN NORTE - CABRA CORRAL"},{"$f":"'[3]Tasa de Falla'!E53","v":132},{"$f":"'[3]Tasa de Falla'!F53","v":190},{"$f":"IF('[3]Tasa de Falla'!IV53=0,\"\",'[3]Tasa de Falla'!IV53)","v":"XXXX"},{"$f":"IF('[3]Tasa de Falla'!IW53=0,\"\",'[3]Tasa de Falla'!IW53)","v":"XXXX"},{"$f":"IF('[3]Tasa de Falla'!IX53=0,\"\",'[3]Tasa de Falla'!IX53)","v":"XXXX"},{"$f":"IF('[3]Tasa de Falla'!IY53=0,\"\",'[3]Tasa de Falla'!IY53)","v":"XXXX"},{"$f":"IF('[3]Tasa de Falla'!IZ53=0,\"\",'[3]Tasa de Falla'!IZ53)","v":"XXXX"},{"$f":"IF('[3]Tasa de Falla'!JA53=0,\"\",'[3]Tasa de Falla'!JA53)","v":"XXXX"},{"$f":"IF('[3]Tasa de Falla'!JB53=0,\"\",'[3]Tasa de Falla'!JB53)","v":"XXXX"},{"$f":"IF('[3]Tasa de Falla'!JC53=0,\"\",'[3]Tasa de Falla'!JC53)","v":"XXXX"},{"$f":"IF('[3]Tasa de Falla'!JD53=0,\"\",'[3]Tasa de Falla'!JD53)","v":"XXXX"},{"$f":"IF('[3]Tasa de Falla'!JE53=0,\"\",'[3]Tasa de Falla'!JE53)","v":"XXXX"},{"$f":"IF('[3]Tasa de Falla'!JF53=0,\"\",'[3]Tasa de Falla'!JF53)","v":"XXXX"},{"$f":"IF('[3]Tasa de Falla'!JG53=0,\"\",'[3]Tasa de Falla'!JG53)","v":"XXXX"}]
[null,null,{"$f":"'[3]Tasa de Falla'!C54","v":38},{"$f":"'[3]Tasa de Falla'!D54","v":"METAN - TUCUMAN NORTE"},{"$f":"'[3]Tasa de Falla'!E54","v":132},{"$f":"'[3]Tasa de Falla'!F54","v":155.6},{"$f":"IF('[3]Tasa de Falla'!IV54=0,\"\",'[3]Tasa de Falla'!IV54)","v":""},{"$f":"IF('[3]Tasa de Falla'!IW54=0,\"\",'[3]Tasa de Falla'!IW54)","v":""},{"$f":"IF('[3]Tasa de Falla'!IX54=0,\"\",'[3]Tasa de Falla'!IX54)","v":""},{"$f":"IF('[3]Tasa de Falla'!IY54=0,\"\",'[3]Tasa de Falla'!IY54)","v":""},{"$f":"IF('[3]Tasa de Falla'!IZ54=0,\"\",'[3]Tasa de Falla'!IZ54)","v":""},{"$f":"IF('[3]Tasa de Falla'!JA54=0,\"\",'[3]Tasa de Falla'!JA54)","v":""},{"$f":"IF('[3]Tasa de Falla'!JB54=0,\"\",'[3]Tasa de Falla'!JB54)","v":""},{"$f":"IF('[3]Tasa de Falla'!JC54=0,\"\",'[3]Tasa de Falla'!JC54)","v":""},{"$f":"IF('[3]Tasa de Falla'!JD54=0,\"\",'[3]Tasa de Falla'!JD54)","v":""},{"$f":"IF('[3]Tasa de Falla'!JE54=0,\"\",'[3]Tasa de Falla'!JE54)","v":""},{"$f":"IF('[3]Tasa de Falla'!JF54=0,\"\",'[3]Tasa de Falla'!JF54)","v":1},{"$f":"IF('[3]Tasa de Falla'!JG54=0,\"\",'[3]Tasa de Falla'!JG54)","v":""}]
[null,null,{"$f":"'[3]Tasa de Falla'!C55","v":39},{"$f":"'[3]Tasa de Falla'!D55","v":"SARMIENTO - TUCUMAN NORTE (O.F.)"},{"$f":"'[3]Tasa de Falla'!E55","v":132},{"$f":"'[3]Tasa de Falla'!F55","v":3.3},{"$f":"IF('[3]Tasa de Falla'!IV55=0,\"\",'[3]Tasa de Falla'!IV55)","v":""},{"$f":"IF('[3]Tasa de Falla'!IW55=0,\"\",'[3]Tasa de Falla'!IW55)","v":""},{"$f":"IF('[3]Tasa de Falla'!IX55=0,\"\",'[3]Tasa de Falla'!IX55)","v":""},{"$f":"IF('[3]Tasa de Falla'!IY55=0,\"\",'[3]Tasa de Falla'!IY55)","v":""},{"$f":"IF('[3]Tasa de Falla'!IZ55=0,\"\",'[3]Tasa de Falla'!IZ55)","v":""},{"$f":"IF('[3]Tasa de Falla'!JA55=0,\"\",'[3]Tasa de Falla'!JA55)","v":""},{"$f":"IF('[3]Tasa de Falla'!JB55=0,\"\",'[3]Tasa de Falla'!JB55)","v":""},{"$f":"IF('[3]Tasa de Falla'!JC55=0,\"\",'[3]Tasa de Falla'!JC55)","v":""},{"$f":"IF('[3]Tasa de Falla'!JD55=0,\"\",'[3]Tasa de Falla'!JD55)","v":""},{"$f":"IF('[3]Tasa de Falla'!JE55=0,\"\",'[3]Tasa de Falla'!JE55)","v":""},{"$f":"IF('[3]Tasa de Falla'!JF55=0,\"\",'[3]Tasa de Falla'!JF55)","v":""},{"$f":"IF('[3]Tasa de Falla'!JG55=0,\"\",'[3]Tasa de Falla'!JG55)","v":""}]
[null,null,{"$f":"'[3]Tasa de Falla'!C56","v":40},{"$f":"'[3]Tasa de Falla'!D56","v":"TUCUMAN OESTE - TUCUMAN NORTE"},{"$f":"'[3]Tasa de Falla'!E56","v":132},{"$f":"'[3]Tasa de Falla'!F56","v":7},{"$f":"IF('[3]Tasa de Falla'!IV56=0,\"\",'[3]Tasa de Falla'!IV56)","v":""},{"$f":"IF('[3]Tasa de Falla'!IW56=0,\"\",'[3]Tasa de Falla'!IW56)","v":""},{"$f":"IF('[3]Tasa de Falla'!IX56=0,\"\",'[3]Tasa de Falla'!IX56)","v":""},{"$f":"IF('[3]Tasa de Falla'!IY56=0,\"\",'[3]Tasa de Falla'!IY56)","v":""},{"$f":"IF('[3]Tasa de Falla'!IZ56=0,\"\",'[3]Tasa de Falla'!IZ56)","v":1},{"$f":"IF('[3]Tasa de Falla'!JA56=0,\"\",'[3]Tasa de Falla'!JA56)","v":1},{"$f":"IF('[3]Tasa de Falla'!JB56=0,\"\",'[3]Tasa de Falla'!JB56)","v":""},{"$f":"IF('[3]Tasa de Falla'!JC56=0,\"\",'[3]Tasa de Falla'!JC56)","v":""},{"$f":"IF('[3]Tasa de Falla'!JD56=0,\"\",'[3]Tasa de Falla'!JD56)","v":""},{"$f":"IF('[3]Tasa de Falla'!JE56=0,\"\",'[3]Tasa de Falla'!JE56)","v":1},{"$f":"IF('[3]Tasa de Falla'!JF56=0,\"\",'[3]Tasa de Falla'!JF56)","v":""},{"$f":"IF('[3]Tasa de Falla'!JG56=0,\"\",'[3]Tasa de Falla'!JG56)","v":""}]
[null,null,{"$f":"'[3]Tasa de Falla'!C57","v":41},{"$f":"'[3]Tasa de Falla'!D57","v":"AGUILARES - VILLA QUINTEROS"},{"$f":"'[3]Tasa de Falla'!E57","v":132},{"$f":"'[3]Tasa de Falla'!F57","v":21},{"$f":"IF('[3]Tasa de Falla'!IV57=0,\"\",'[3]Tasa de Falla'!IV57)","v":""},{"$f":"IF('[3]Tasa de Falla'!IW57=0,\"\",'[3]Tasa de Falla'!IW57)","v":1},{"$f":"IF('[3]Tasa de Falla'!IX57=0,\"\",'[3]Tasa de Falla'!IX57)","v":""},{"$f":"IF('[3]Tasa de Falla'!IY57=0,\"\",'[3]Tasa de Falla'!IY57)","v":""},{"$f":"IF('[3]Tasa de Falla'!IZ57=0,\"\",'[3]Tasa de Falla'!IZ57)","v":""},{"$f":"IF('[3]Tasa de Falla'!JA57=0,\"\",'[3]Tasa de Falla'!JA57)","v":""},{"$f":"IF('[3]Tasa de Falla'!JB57=0,\"\",'[3]Tasa de Falla'!JB57)","v":""},{"$f":"IF('[3]Tasa de Falla'!JC57=0,\"\",'[3]Tasa de Falla'!JC57)","v":""},{"$f":"IF('[3]Tasa de Falla'!JD57=0,\"\",'[3]Tasa de Falla'!JD57)","v":""},{"$f":"IF('[3]Tasa de Falla'!JE57=0,\"\",'[3]Tasa de Falla'!JE57)","v":""},{"$f":"IF('[3]Tasa de Falla'!JF57=0,\"\",'[3]Tasa de Falla'!JF57)","v":1},{"$f":"IF('[3]Tasa de Falla'!JG57=0,\"\",'[3]Tasa de Falla'!JG57)","v":2}]
[null,null,{"$f":"'[3]Tasa de Falla'!C58","v":42},{"$f":"'[3]Tasa de Falla'!D58","v":"C.H. PUEBLO VIEJO - VILLA QUINTEROS "},{"$f":"'[3]Tasa de Falla'!E58","v":132},{"$f":"'[3]Tasa de Falla'!F58","v":24.5},{"$f":"IF('[3]Tasa de Falla'!IV58=0,\"\",'[3]Tasa de Falla'!IV58)","v":1},{"$f":"IF('[3]Tasa de Falla'!IW58=0,\"\",'[3]Tasa de Falla'!IW58)","v":""},{"$f":"IF('[3]Tasa de Falla'!IX58=0,\"\",'[3]Tasa de Falla'!IX58)","v":""},{"$f":"IF('[3]Tasa de Falla'!IY58=0,\"\",'[3]Tasa de Falla'!IY58)","v":""},{"$f":"IF('[3]Tasa de Falla'!IZ58=0,\"\",'[3]Tasa de Falla'!IZ58)","v":""},{"$f":"IF('[3]Tasa de Falla'!JA58=0,\"\",'[3]Tasa de Falla'!JA58)","v":""},{"$f":"IF('[3]Tasa de Falla'!JB58=0,\"\",'[3]Tasa de Falla'!JB58)","v":""},{"$f":"IF('[3]Tasa de Falla'!JC58=0,\"\",'[3]Tasa de Falla'!JC58)","v":""},{"$f":"IF('[3]Tasa de Falla'!JD58=0,\"\",'[3]Tasa de Falla'!JD58)","v":""},{"$f":"IF('[3]Tasa de Falla'!JE58=0,\"\",'[3]Tasa de Falla'!JE58)","v":1},{"$f":"IF('[3]Tasa de Falla'!JF58=0,\"\",'[3]Tasa de Falla'!JF58)","v":""},{"$f":"IF('[3]Tasa de Falla'!JG58=0,\"\",'[3]Tasa de Falla'!JG58)","v":1}]
[null,null,{"$f":"'[3]Tasa de Falla'!C59","v":43},{"$f":"'[3]Tasa de Falla'!D59","v":"C.H. RIO HONDO - VILLA QUINTEROS"},{"$f":"'[3]Tasa de Falla'!E59","v":132},{"$f":"'[3]Tasa de Falla'!F59","v":75.400000000000006},{"$f":"IF('[3]Tasa de Falla'!IV59=0,\"\",'[3]Tasa de Falla'!IV59)","v":""},{"$f":"IF('[3]Tasa de Falla'!IW59=0,\"\",'[3]Tasa de Falla'!IW59)","v":""},{"$f":"IF('[3]Tasa de Falla'!IX59=0,\"\",'[3]Tasa de Falla'!IX59)","v":""},{"$f":"IF('[3]Tasa de Falla'!IY59=0,\"\",'[3]Tasa de Falla'!IY59)","v":""},{"$f":"IF('[3]Tasa de Falla'!IZ59=0,\"\",'[3]Tasa de Falla'!IZ59)","v":""},{"$f":"IF('[3]Tasa de Falla'!JA59=0,\"\",'[3]Tasa de Falla'!JA59)","v":""},{"$f":"IF('[3]Tasa de Falla'!JB59=0,\"\",'[3]Tasa de Falla'!JB59)","v":1},{"$f":"IF('[3]Tasa de Falla'!JC59=0,\"\",'[3]Tasa de Falla'!JC59)","v":""},{"$f":"IF('[3]Tasa de Falla'!JD59=0,\"\",'[3]Tasa de Falla'!JD59)","v":""},{"$f":"IF('[3]Tasa de Falla'!JE59=0,\"\",'[3]Tasa de Falla'!JE59)","v":1},{"$f":"IF('[3]Tasa de Falla'!JF59=0,\"\",'[3]Tasa de Falla'!JF59)","v":""},{"$f":"IF('[3]Tasa de Falla'!JG59=0,\"\",'[3]Tasa de Falla'!JG59)","v":""}]
[null,null,{"$f":"'[3]Tasa de Falla'!C60","v":44},{"$f":"'[3]Tasa de Falla'!D60","v":"C.H. RIO HONDO - SANTIAGO CENTRO"},{"$f":"'[3]Tasa de Falla'!E60","v":132},{"$f":"'[3]Tasa de Falla'!F60","v":79},{"$f":"IF('[3]Tasa de Falla'!IV60=0,\"\",'[3]Tasa de Falla'!IV60)","v":"XXXX"},{"$f":"IF('[3]Tasa de Falla'!IW60=0,\"\",'[3]Tasa de Falla'!IW60)","v":"XXXX"},{"$f":"IF('[3]Tasa de Falla'!IX60=0,\"\",'[3]Tasa de Falla'!IX60)","v":"XXXX"},{"$f":"IF('[3]Tasa de Falla'!IY60=0,\"\",'[3]Tasa de Falla'!IY60)","v":"XXXX"},{"$f":"IF('[3]Tasa de Falla'!IZ60=0,\"\",'[3]Tasa de Falla'!IZ60)","v":"XXXX"},{"$f":"IF('[3]Tasa de Falla'!JA60=0,\"\",'[3]Tasa de Falla'!JA60)","v":"XXXX"},{"$f":"IF('[3]Tasa de Falla'!JB60=0,\"\",'[3]Tasa de Falla'!JB60)","v":"XXXX"},{"$f":"IF('[3]Tasa de Falla'!JC60=0,\"\",'[3]Tasa de Falla'!JC60)","v":"XXXX"},{"$f":"IF('[3]Tasa de Falla'!JD60=0,\"\",'[3]Tasa de Falla'!JD60)","v":"XXXX"},{"$f":"IF('[3]Tasa de Falla'!JE60=0,\"\",'[3]Tasa de Falla'!JE60)","v":"XXXX"},{"$f":"IF('[3]Tasa de Falla'!JF60=0,\"\",'[3]Tasa de Falla'!JF60)","v":"XXXX"},{"$f":"IF('[3]Tasa de Falla'!JG60=0,\"\",'[3]Tasa de Falla'!JG60)","v":"XXXX"}]
[null,null,{"$f":"'[3]Tasa de Falla'!C61","v":45},{"$f":"'[3]Tasa de Falla'!D61","v":"C.H. RIO HONDO - EL BRACHO"},{"$f":"'[3]Tasa de Falla'!E61","v":132},{"$f":"'[3]Tasa de Falla'!F61","v":80.66},{"$f":"IF('[3]Tasa de Falla'!IV61=0,\"\",'[3]Tasa de Falla'!IV61)","v":"XXXX"},{"$f":"IF('[3]Tasa de Falla'!IW61=0,\"\",'[3]Tasa de Falla'!IW61)","v":"XXXX"},{"$f":"IF('[3]Tasa de Falla'!IX61=0,\"\",'[3]Tasa de Falla'!IX61)","v":"XXXX"},{"$f":"IF('[3]Tasa de Falla'!IY61=0,\"\",'[3]Tasa de Falla'!IY61)","v":"XXXX"},{"$f":"IF('[3]Tasa de Falla'!IZ61=0,\"\",'[3]Tasa de Falla'!IZ61)","v":"XXXX"},{"$f":"IF('[3]Tasa de Falla'!JA61=0,\"\",'[3]Tasa de Falla'!JA61)","v":"XXXX"},{"$f":"IF('[3]Tasa de Falla'!JB61=0,\"\",'[3]Tasa de Falla'!JB61)","v":"XXXX"},{"$f":"IF('[3]Tasa de Falla'!JC61=0,\"\",'[3]Tasa de Falla'!JC61)","v":"XXXX"},{"$f":"IF('[3]Tasa de Falla'!JD61=0,\"\",'[3]Tasa de Falla'!JD61)","v":"XXXX"},{"$f":"IF('[3]Tasa de Falla'!JE61=0,\"\",'[3]Tasa de Falla'!JE61)","v":"XXXX"},{"$f":"IF('[3]Tasa de Falla'!JF61=0,\"\",'[3]Tasa de Falla'!JF61)","v":"XXXX"},{"$f":"IF('[3]Tasa de Falla'!JG61=0,\"\",'[3]Tasa de Falla'!JG61)","v":"XXXX"}]
[null,null,{"$f":"'[3]Tasa de Falla'!C62","v":46},{"$f":"'[3]Tasa de Falla'!D62","v":"SALTA SUR - SALTA NORTE"},{"$f":"'[3]Tasa de Falla'!E62","v":132},{"$f":"'[3]Tasa de Falla'!F62","v":10},{"$f":"IF('[3]Tasa de Falla'!IV62=0,\"\",'[3]Tasa de Falla'!IV62)","v":""},{"$f":"IF('[3]Tasa de Falla'!IW62=0,\"\",'[3]Tasa de Falla'!IW62)","v":""},{"$f":"IF('[3]Tasa de Falla'!IX62=0,\"\",'[3]Tasa de Falla'!IX62)","v":""},{"$f":"IF('[3]Tasa de Falla'!IY62=0,\"\",'[3]Tasa de Falla'!IY62)","v":""},{"$f":"IF('[3]Tasa de Falla'!IZ62=0,\"\",'[3]Tasa de Falla'!IZ62)","v":""},{"$f":"IF('[3]Tasa de Falla'!JA62=0,\"\",'[3]Tasa de Falla'!JA62)","v":""},{"$f":"IF('[3]Tasa de Falla'!JB62=0,\"\",'[3]Tasa de Falla'!JB62)","v":""},{"$f":"IF('[3]Tasa de Falla'!JC62=0,\"\",'[3]Tasa de Falla'!JC62)","v":""},{"$f":"IF('[3]Tasa de Falla'!JD62=0,\"\",'[3]Tasa de Falla'!JD62)","v":""},{"$f":"IF('[3]Tasa de Falla'!JE62=0,\"\",'[3]Tasa de Falla'!JE62)","v":""},{"$f":"IF('[3]Tasa de Falla'!JF62=0,\"\",'[3]Tasa de Falla'!JF62)","v":""},{"$f":"IF('[3]Tasa de Falla'!JG62=0,\"\",'[3]Tasa de Falla'!JG62)","v":""}]
[null,null,{"$f":"'[3]Tasa de Falla'!C63","v":47},{"$f":"'[3]Tasa de Falla'!D63","v":"PALPALA - JUJUY ESTE"},{"$f":"'[3]Tasa de Falla'!E63","v":132},{"$f":"'[3]Tasa de Falla'!F63","v":12.3},{"$f":"IF('[3]Tasa de Falla'!IV63=0,\"\",'[3]Tasa de Falla'!IV63)","v":""},{"$f":"IF('[3]Tasa de Falla'!IW63=0,\"\",'[3]Tasa de Falla'!IW63)","v":1},{"$f":"IF('[3]Tasa de Falla'!IX63=0,\"\",'[3]Tasa de Falla'!IX63)","v":""},{"$f":"IF('[3]Tasa de Falla'!IY63=0,\"\",'[3]Tasa de Falla'!IY63)","v":""},{"$f":"IF('[3]Tasa de Falla'!IZ63=0,\"\",'[3]Tasa de Falla'!IZ63)","v":""},{"$f":"IF('[3]Tasa de Falla'!JA63=0,\"\",'[3]Tasa de Falla'!JA63)","v":""},{"$f":"IF('[3]Tasa de Falla'!JB63=0,\"\",'[3]Tasa de Falla'!JB63)","v":""},{"$f":"IF('[3]Tasa de Falla'!JC63=0,\"\",'[3]Tasa de Falla'!JC63)","v":""},{"$f":"IF('[3]Tasa de Falla'!JD63=0,\"\",'[3]Tasa de Falla'!JD63)","v":""},{"$f":"IF('[3]Tasa de Falla'!JE63=0,\"\",'[3]Tasa de Falla'!JE63)","v":""},{"$f":"IF('[3]Tasa de Falla'!JF63=0,\"\",'[3]Tasa de Falla'!JF63)","v":""},{"$f":"IF('[3]Tasa de Falla'!JG63=0,\"\",'[3]Tasa de Falla'!JG63)","v":""}]
[null,null,{"$f":"'[3]Tasa de Falla'!C64","v":48},{"$f":"'[3]Tasa de Falla'!D64","v":"JUJUY ESTE - JUJUY SUR"},{"$f":"'[3]Tasa de Falla'!E64","v":132},{"$f":"'[3]Tasa de Falla'!F64","v":4.3},{"$f":"IF('[3]Tasa de Falla'!IV64=0,\"\",'[3]Tasa de Falla'!IV64)","v":""},{"$f":"IF('[3]Tasa de Falla'!IW64=0,\"\",'[3]Tasa de Falla'!IW64)","v":""},{"$f":"IF('[3]Tasa de Falla'!IX64=0,\"\",'[3]Tasa de Falla'!IX64)","v":""},{"$f":"IF('[3]Tasa de Falla'!IY64=0,\"\",'[3]Tasa de Falla'!IY64)","v":""},{"$f":"IF('[3]Tasa de Falla'!IZ64=0,\"\",'[3]Tasa de Falla'!IZ64)","v":""},{"$f":"IF('[3]Tasa de Falla'!JA64=0,\"\",'[3]Tasa de Falla'!JA64)","v":""},{"$f":"IF('[3]Tasa de Falla'!JB64=0,\"\",'[3]Tasa de Falla'!JB64)","v":""},{"$f":"IF('[3]Tasa de Falla'!JC64=0,\"\",'[3]Tasa de Falla'!JC64)","v":""},{"$f":"IF('[3]Tasa de Falla'!JD64=0,\"\",'[3]Tasa de Falla'!JD64)","v":""},{"$f":"IF('[3]Tasa de Falla'!JE64=0,\"\",'[3]Tasa de Falla'!JE64)","v":""},{"$f":"IF('[3]Tasa de Falla'!JF64=0,\"\",'[3]Tasa de Falla'!JF64)","v":""},{"$f":"IF('[3]Tasa de Falla'!JG64=0,\"\",'[3]Tasa de Falla'!JG64)","v":""}]
[null,null,{"$f":"'[3]Tasa de Falla'!C65","v":49},{"$f":"'[3]Tasa de Falla'!D65","v":"CEVIL POZO - GUEMES"},{"$f":"'[3]Tasa de Falla'!E65","v":132},{"$f":"'[3]Tasa de Falla'!F65","v":291},{"$f":"IF('[3]Tasa de Falla'!IV65=0,\"\",'[3]Tasa de Falla'!IV65)","v":"XXXX"},{"$f":"IF('[3]Tasa de Falla'!IW65=0,\"\",'[3]Tasa de Falla'!IW65)","v":"XXXX"},{"$f":"IF('[3]Tasa de Falla'!IX65=0,\"\",'[3]Tasa de Falla'!IX65)","v":"XXXX"},{"$f":"IF('[3]Tasa de Falla'!IY65=0,\"\",'[3]Tasa de Falla'!IY65)","v":"XXXX"},{"$f":"IF('[3]Tasa de Falla'!IZ65=0,\"\",'[3]Tasa de Falla'!IZ65)","v":"XXXX"},{"$f":"IF('[3]Tasa de Falla'!JA65=0,\"\",'[3]Tasa de Falla'!JA65)","v":"XXXX"},{"$f":"IF('[3]Tasa de Falla'!JB65=0,\"\",'[3]Tasa de Falla'!JB65)","v":"XXXX"},{"$f":"IF('[3]Tasa de Falla'!JC65=0,\"\",'[3]Tasa de Falla'!JC65)","v":"XXXX"},{"$f":"IF('[3]Tasa de Falla'!JD65=0,\"\",'[3]Tasa de Falla'!JD65)","v":"XXXX"},{"$f":"IF('[3]Tasa de Falla'!JE65=0,\"\",'[3]Tasa de Falla'!JE65)","v":"XXXX"},{"$f":"IF('[3]Tasa de Falla'!JF65=0,\"\",'[3]Tasa de Falla'!JF65)","v":"XXXX"},{"$f":"IF('[3]Tasa de Falla'!JG65=0,\"\",'[3]Tasa de Falla'!JG65)","v":"XXXX"}]
[null,null,{"$f":"'[3]Tasa de Falla'!C66","v":50},{"$f":"'[3]Tasa de Falla'!D66","v":"CEVIL POZO - EL BRACHO"},{"$f":"'[3]Tasa de Falla'!E66","v":132},{"$f":"'[3]Tasa de Falla'!F66","v":17},{"$f":"IF('[3]Tasa de Falla'!IV66=0,\"\",'[3]Tasa de Falla'!IV66)","v":""},{"$f":"IF('[3]Tasa de Falla'!IW66=0,\"\",'[3]Tasa de Falla'!IW66)","v":""},{"$f":"IF('[3]Tasa de Falla'!IX66=0,\"\",'[3]Tasa de Falla'!IX66)","v":""},{"$f":"IF('[3]Tasa de Falla'!IY66=0,\"\",'[3]Tasa de Falla'!IY66)","v":""},{"$f":"IF('[3]Tasa de Falla'!IZ66=0,\"\",'[3]Tasa de Falla'!IZ66)","v":""},{"$f":"IF('[3]Tasa de Falla'!JA66=0,\"\",'[3]Tasa de Falla'!JA66)","v":""},{"$f":"IF('[3]Tasa de Falla'!JB66=0,\"\",'[3]Tasa de Falla'!JB66)","v":""},{"$f":"IF('[3]Tasa de Falla'!JC66=0,\"\",'[3]Tasa de Falla'!JC66)","v":""},{"$f":"IF('[3]Tasa de Falla'!JD66=0,\"\",'[3]Tasa de Falla'!JD66)","v":""},{"$f":"IF('[3]Tasa de Falla'!JE66=0,\"\",'[3]Tasa de Falla'!JE66)","v":""},{"$f":"IF('[3]Tasa de Falla'!JF66=0,\"\",'[3]Tasa de Falla'!JF66)","v":""},{"$f":"IF('[3]Tasa de Falla'!JG66=0,\"\",'[3]Tasa de Falla'!JG66)","v":""}]
[null,null,{"$f":"'[3]Tasa de Falla'!C67","v":0},{"$f":"'[3]Tasa de Falla'!D67","v":0},{"$f":"'[3]Tasa de Falla'!E67","v":0},{"$f":"'[3]Tasa de Falla'!F67","v":0},{"$f":"IF('[3]Tasa de Falla'!IV67=0,\"\",'[3]Tasa de Falla'!IV67)","v":""},{"$f":"IF('[3]Tasa de Falla'!IW67=0,\"\",'[3]Tasa de Falla'!IW67)","v":""},{"$f":"IF('[3]Tasa de Falla'!IX67=0,\"\",'[3]Tasa de Falla'!IX67)","v":""},{"$f":"IF('[3]Tasa de Falla'!IY67=0,\"\",'[3]Tasa de Falla'!IY67)","v":""},{"$f":"IF('[3]Tasa de Falla'!IZ67=0,\"\",'[3]Tasa de Falla'!IZ67)","v":""},{"$f":"IF('[3]Tasa de Falla'!JA67=0,\"\",'[3]Tasa de Falla'!JA67)","v":""},{"$f":"IF('[3]Tasa de Falla'!JB67=0,\"\",'[3]Tasa de Falla'!JB67)","v":""},{"$f":"IF('[3]Tasa de Falla'!JC67=0,\"\",'[3]Tasa de Falla'!JC67)","v":""},{"$f":"IF('[3]Tasa de Falla'!JD67=0,\"\",'[3]Tasa de Falla'!JD67)","v":""},{"$f":"IF('[3]Tasa de Falla'!JE67=0,\"\",'[3]Tasa de Falla'!JE67)","v":""},{"$f":"IF('[3]Tasa de Falla'!JF67=0,\"\",'[3]Tasa de Falla'!JF67)","v":""},{"$f":"IF('[3]Tasa de Falla'!JG67=0,\"\",'[3]Tasa de Falla'!JG67)","v":""}]
[null,null,{"$f":"'[3]Tasa de Falla'!C68","v":51},{"$f":"'[3]Tasa de Falla'!D68","v":"METAN - EL TUNAL"},{"$f":"'[3]Tasa de Falla'!E68","v":132},{"$f":"'[3]Tasa de Falla'!F68","v":75.599999999999994},{"$f":"IF('[3]Tasa de Falla'!IV68=0,\"\",'[3]Tasa de Falla'!IV68)","v":""},{"$f":"IF('[3]Tasa de Falla'!IW68=0,\"\",'[3]Tasa de Falla'!IW68)","v":""},{"$f":"IF('[3]Tasa de Falla'!IX68=0,\"\",'[3]Tasa de Falla'!IX68)","v":""},{"$f":"IF('[3]Tasa de Falla'!IY68=0,\"\",'[3]Tasa de Falla'!IY68)","v":""},{"$f":"IF('[3]Tasa de Falla'!IZ68=0,\"\",'[3]Tasa de Falla'!IZ68)","v":""},{"$f":"IF('[3]Tasa de Falla'!JA68=0,\"\",'[3]Tasa de Falla'!JA68)","v":""},{"$f":"IF('[3]Tasa de Falla'!JB68=0,\"\",'[3]Tasa de Falla'!JB68)","v":""},{"$f":"IF('[3]Tasa de Falla'!JC68=0,\"\",'[3]Tasa de Falla'!JC68)","v":""},{"$f":"IF('[3]Tasa de Falla'!JD68=0,\"\",'[3]Tasa de Falla'!JD68)","v":""},{"$f":"IF('[3]Tasa de Falla'!JE68=0,\"\",'[3]Tasa de Falla'!JE68)","v":""},{"$f":"IF('[3]Tasa de Falla'!JF68=0,\"\",'[3]Tasa de Falla'!JF68)","v":""},{"$f":"IF('[3]Tasa de Falla'!JG68=0,\"\",'[3]Tasa de Falla'!JG68)","v":1}]
[null,null,{"$f":"'[3]Tasa de Falla'!C69","v":52},{"$f":"'[3]Tasa de Falla'!D69","v":"EL TUNAL - J.V. GONZALEZ"},{"$f":"'[3]Tasa de Falla'!E69","v":132},{"$f":"'[3]Tasa de Falla'!F69","v":41.4},{"$f":"IF('[3]Tasa de Falla'!IV69=0,\"\",'[3]Tasa de Falla'!IV69)","v":""},{"$f":"IF('[3]Tasa de Falla'!IW69=0,\"\",'[3]Tasa de Falla'!IW69)","v":""},{"$f":"IF('[3]Tasa de Falla'!IX69=0,\"\",'[3]Tasa de Falla'!IX69)","v":""},{"$f":"IF('[3]Tasa de Falla'!IY69=0,\"\",'[3]Tasa de Falla'!IY69)","v":""},{"$f":"IF('[3]Tasa de Falla'!IZ69=0,\"\",'[3]Tasa de Falla'!IZ69)","v":""},{"$f":"IF('[3]Tasa de Falla'!JA69=0,\"\",'[3]Tasa de Falla'!JA69)","v":""},{"$f":"IF('[3]Tasa de Falla'!JB69=0,\"\",'[3]Tasa de Falla'!JB69)","v":""},{"$f":"IF('[3]Tasa de Falla'!JC69=0,\"\",'[3]Tasa de Falla'!JC69)","v":""},{"$f":"IF('[3]Tasa de Falla'!JD69=0,\"\",'[3]Tasa de Falla'!JD69)","v":""},{"$f":"IF('[3]Tasa de Falla'!JE69=0,\"\",'[3]Tasa de Falla'!JE69)","v":""},{"$f":"IF('[3]Tasa de Falla'!JF69=0,\"\",'[3]Tasa de Falla'!JF69)","v":""},{"$f":"IF('[3]Tasa de Falla'!JG69=0,\"\",'[3]Tasa de Falla'!JG69)","v":""}]
[null,null,{"$f":"'[3]Tasa de Falla'!C70","v":0},{"$f":"'[3]Tasa de Falla'!D70","v":0},{"$f":"'[3]Tasa de Falla'!E70","v":0},{"$f":"'[3]Tasa de Falla'!F70","v":0},{"$f":"IF('[3]Tasa de Falla'!IV70=0,\"\",'[3]Tasa de Falla'!IV70)","v":""},{"$f":"IF('[3]Tasa de Falla'!IW70=0,\"\",'[3]Tasa de Falla'!IW70)","v":""},{"$f":"IF('[3]Tasa de Falla'!IX70=0,\"\",'[3]Tasa de Falla'!IX70)","v":""},{"$f":"IF('[3]Tasa de Falla'!IY70=0,\"\",'[3]Tasa de Falla'!IY70)","v":""},{"$f":"IF('[3]Tasa de Falla'!IZ70=0,\"\",'[3]Tasa de Falla'!IZ70)","v":""},{"$f":"IF('[3]Tasa de Falla'!JA70=0,\"\",'[3]Tasa de Falla'!JA70)","v":""},{"$f":"IF('[3]Tasa de Falla'!JB70=0,\"\",'[3]Tasa de Falla'!JB70)","v":""},{"$f":"IF('[3]Tasa de Falla'!JC70=0,\"\",'[3]Tasa de Falla'!JC70)","v":""},{"$f":"IF('[3]Tasa de Falla'!JD70=0,\"\",'[3]Tasa de Falla'!JD70)","v":""},{"$f":"IF('[3]Tasa de Falla'!JE70=0,\"\",'[3]Tasa de Falla'!JE70)","v":""},{"$f":"IF('[3]Tasa de Falla'!JF70=0,\"\",'[3]Tasa de Falla'!JF70)","v":""},{"$f":"IF('[3]Tasa de Falla'!JG70=0,\"\",'[3]Tasa de Falla'!JG70)","v":""}]
[null,null,{"$f":"'[3]Tasa de Falla'!C71","v":53},{"$f":"'[3]Tasa de Falla'!D71","v":"LOS PIZARROS - ESCABA"},{"$f":"'[3]Tasa de Falla'!E71","v":132},{"$f":"'[3]Tasa de Falla'!F71","v":21.4},{"$f":"IF('[3]Tasa de Falla'!IV71=0,\"\",'[3]Tasa de Falla'!IV71)","v":1},{"$f":"IF('[3]Tasa de Falla'!IW71=0,\"\",'[3]Tasa de Falla'!IW71)","v":""},{"$f":"IF('[3]Tasa de Falla'!IX71=0,\"\",'[3]Tasa de Falla'!IX71)","v":""},{"$f":"IF('[3]Tasa de Falla'!IY71=0,\"\",'[3]Tasa de Falla'!IY71)","v":""},{"$f":"IF('[3]Tasa de Falla'!IZ71=0,\"\",'[3]Tasa de Falla'!IZ71)","v":""},{"$f":"IF('[3]Tasa de Falla'!JA71=0,\"\",'[3]Tasa de Falla'!JA71)","v":""},{"$f":"IF('[3]Tasa de Falla'!JB71=0,\"\",'[3]Tasa de Falla'!JB71)","v":1},{"$f":"IF('[3]Tasa de Falla'!JC71=0,\"\",'[3]Tasa de Falla'!JC71)","v":""},{"$f":"IF('[3]Tasa de Falla'!JD71=0,\"\",'[3]Tasa de Falla'!JD71)","v":""},{"$f":"IF('[3]Tasa de Falla'!JE71=0,\"\",'[3]Tasa de Falla'!JE71)","v":""},{"$f":"IF('[3]Tasa de Falla'!JF71=0,\"\",'[3]Tasa de Falla'!JF71)","v":""},{"$f":"IF('[3]Tasa de Falla'!JG71=0,\"\",'[3]Tasa de Falla'!JG71)","v":1}]
[null,null,{"$f":"'[3]Tasa de Falla'!C72","v":54},{"$f":"'[3]Tasa de Falla'!D72","v":"LOS PIZARROS - LA COCHA"},{"$f":"'[3]Tasa de Falla'!E72","v":132},{"$f":"'[3]Tasa de Falla'!F72","v":6.5},{"$f":"IF('[3]Tasa de Falla'!IV72=0,\"\",'[3]Tasa de Falla'!IV72)","v":""},{"$f":"IF('[3]Tasa de Falla'!IW72=0,\"\",'[3]Tasa de Falla'!IW72)","v":""},{"$f":"IF('[3]Tasa de Falla'!IX72=0,\"\",'[3]Tasa de Falla'!IX72)","v":""},{"$f":"IF('[3]Tasa de Falla'!IY72=0,\"\",'[3]Tasa de Falla'!IY72)","v":""},{"$f":"IF('[3]Tasa de Falla'!IZ72=0,\"\",'[3]Tasa de Falla'!IZ72)","v":""},{"$f":"IF('[3]Tasa de Falla'!JA72=0,\"\",'[3]Tasa de Falla'!JA72)","v":""},{"$f":"IF('[3]Tasa de Falla'!JB72=0,\"\",'[3]Tasa de Falla'!JB72)","v":""},{"$f":"IF('[3]Tasa de Falla'!JC72=0,\"\",'[3]Tasa de Falla'!JC72)","v":""},{"$f":"IF('[3]Tasa de Falla'!JD72=0,\"\",'[3]Tasa de Falla'!JD72)","v":""},{"$f":"IF('[3]Tasa de Falla'!JE72=0,\"\",'[3]Tasa de Falla'!JE72)","v":""},{"$f":"IF('[3]Tasa de Falla'!JF72=0,\"\",'[3]Tasa de Falla'!JF72)","v":""},{"$f":"IF('[3]Tasa de Falla'!JG72=0,\"\",'[3]Tasa de Falla'!JG72)","v":""}]
[null,null,{"$f":"'[3]Tasa de Falla'!C73","v":55},{"$f":"'[3]Tasa de Falla'!D73","v":"HUACRA - LOS PIZARROS"},{"$f":"'[3]Tasa de Falla'!E73","v":132},{"$f":"'[3]Tasa de Falla'!F73","v":28.5},{"$f":"IF('[3]Tasa de Falla'!IV73=0,\"\",'[3]Tasa de Falla'!IV73)","v":""},{"$f":"IF('[3]Tasa de Falla'!IW73=0,\"\",'[3]Tasa de Falla'!IW73)","v":""},{"$f":"IF('[3]Tasa de Falla'!IX73=0,\"\",'[3]Tasa de Falla'!IX73)","v":""},{"$f":"IF('[3]Tasa de Falla'!IY73=0,\"\",'[3]Tasa de Falla'!IY73)","v":""},{"$f":"IF('[3]Tasa de Falla'!IZ73=0,\"\",'[3]Tasa de Falla'!IZ73)","v":""},{"$f":"IF('[3]Tasa de Falla'!JA73=0,\"\",'[3]Tasa de Falla'!JA73)","v":""},{"$f":"IF('[3]Tasa de Falla'!JB73=0,\"\",'[3]Tasa de Falla'!JB73)","v":""},{"$f":"IF('[3]Tasa de Falla'!JC73=0,\"\",'[3]Tasa de Falla'!JC73)","v":""},{"$f":"IF('[3]Tasa de Falla'!JD73=0,\"\",'[3]Tasa de Falla'!JD73)","v":""},{"$f":"IF('[3]Tasa de Falla'!JE73=0,\"\",'[3]Tasa de Falla'!JE73)","v":""},{"$f":"IF('[3]Tasa de Falla'!JF73=0,\"\",'[3]Tasa de Falla'!JF73)","v":""},{"$f":"IF('[3]Tasa de Falla'!JG73=0,\"\",'[3]Tasa de Falla'!JG73)","v":""}]
[null,null,{"$f":"'[3]Tasa de Falla'!C74","v":56},{"$f":"'[3]Tasa de Falla'!D74","v":"CEVIL POZO - AVELLANEDA"},{"$f":"'[3]Tasa de Falla'!E74","v":132},{"$f":"'[3]Tasa de Falla'!F74","v":8},{"$f":"IF('[3]Tasa de Falla'!IV74=0,\"\",'[3]Tasa de Falla'!IV74)","v":""},{"$f":"IF('[3]Tasa de Falla'!IW74=0,\"\",'[3]Tasa de Falla'!IW74)","v":""},{"$f":"IF('[3]Tasa de Falla'!IX74=0,\"\",'[3]Tasa de Falla'!IX74)","v":""},{"$f":"IF('[3]Tasa de Falla'!IY74=0,\"\",'[3]Tasa de Falla'!IY74)","v":""},{"$f":"IF('[3]Tasa de Falla'!IZ74=0,\"\",'[3]Tasa de Falla'!IZ74)","v":""},{"$f":"IF('[3]Tasa de Falla'!JA74=0,\"\",'[3]Tasa de Falla'!JA74)","v":""},{"$f":"IF('[3]Tasa de Falla'!JB74=0,\"\",'[3]Tasa de Falla'!JB74)","v":""},{"$f":"IF('[3]Tasa de Falla'!JC74=0,\"\",'[3]Tasa de Falla'!JC74)","v":""},{"$f":"IF('[3]Tasa de Falla'!JD74=0,\"\",'[3]Tasa de Falla'!JD74)","v":""},{"$f":"IF('[3]Tasa de Falla'!JE74=0,\"\",'[3]Tasa de Falla'!JE74)","v":""},{"$f":"IF('[3]Tasa de Falla'!JF74=0,\"\",'[3]Tasa de Falla'!JF74)","v":""},{"$f":"IF('[3]Tasa de Falla'!JG74=0,\"\",'[3]Tasa de Falla'!JG74)","v":""}]
[null,null,{"$f":"'[3]Tasa de Falla'!C75","v":57},{"$f":"'[3]Tasa de Falla'!D75","v":"CABRA CORRAL - SALTA ESTE"},{"$f":"'[3]Tasa de Falla'!E75","v":132},{"$f":"'[3]Tasa de Falla'!F75","v":55},{"$f":"IF('[3]Tasa de Falla'!IV75=0,\"\",'[3]Tasa de Falla'!IV75)","v":""},{"$f":"IF('[3]Tasa de Falla'!IW75=0,\"\",'[3]Tasa de Falla'!IW75)","v":1},{"$f":"IF('[3]Tasa de Falla'!IX75=0,\"\",'[3]Tasa de Falla'!IX75)","v":""},{"$f":"IF('[3]Tasa de Falla'!IY75=0,\"\",'[3]Tasa de Falla'!IY75)","v":""},{"$f":"IF('[3]Tasa de Falla'!IZ75=0,\"\",'[3]Tasa de Falla'!IZ75)","v":1},{"$f":"IF('[3]Tasa de Falla'!JA75=0,\"\",'[3]Tasa de Falla'!JA75)","v":""},{"$f":"IF('[3]Tasa de Falla'!JB75=0,\"\",'[3]Tasa de Falla'!JB75)","v":""},{"$f":"IF('[3]Tasa de Falla'!JC75=0,\"\",'[3]Tasa de Falla'!JC75)","v":""},{"$f":"IF('[3]Tasa de Falla'!JD75=0,\"\",'[3]Tasa de Falla'!JD75)","v":""},{"$f":"IF('[3]Tasa de Falla'!JE75=0,\"\",'[3]Tasa de Falla'!JE75)","v":1},{"$f":"IF('[3]Tasa de Falla'!JF75=0,\"\",'[3]Tasa de Falla'!JF75)","v":""},{"$f":"IF('[3]Tasa de Falla'!JG75=0,\"\",'[3]Tasa de Falla'!JG75)","v":2}]
[null,null,{"$f":"'[3]Tasa de Falla'!C76","v":58},{"$f":"'[3]Tasa de Falla'!D76","v":"SALTA ESTE - SALTA SUR"},{"$f":"'[3]Tasa de Falla'!E76","v":132},{"$f":"'[3]Tasa de Falla'!F76","v":7},{"$f":"IF('[3]Tasa de Falla'!IV76=0,\"\",'[3]Tasa de Falla'!IV76)","v":""},{"$f":"IF('[3]Tasa de Falla'!IW76=0,\"\",'[3]Tasa de Falla'!IW76)","v":""},{"$f":"IF('[3]Tasa de Falla'!IX76=0,\"\",'[3]Tasa de Falla'!IX76)","v":""},{"$f":"IF('[3]Tasa de Falla'!IY76=0,\"\",'[3]Tasa de Falla'!IY76)","v":""},{"$f":"IF('[3]Tasa de Falla'!IZ76=0,\"\",'[3]Tasa de Falla'!IZ76)","v":""},{"$f":"IF('[3]Tasa de Falla'!JA76=0,\"\",'[3]Tasa de Falla'!JA76)","v":""},{"$f":"IF('[3]Tasa de Falla'!JB76=0,\"\",'[3]Tasa de Falla'!JB76)","v":""},{"$f":"IF('[3]Tasa de Falla'!JC76=0,\"\",'[3]Tasa de Falla'!JC76)","v":""},{"$f":"IF('[3]Tasa de Falla'!JD76=0,\"\",'[3]Tasa de Falla'!JD76)","v":""},{"$f":"IF('[3]Tasa de Falla'!JE76=0,\"\",'[3]Tasa de Falla'!JE76)","v":""},{"$f":"IF('[3]Tasa de Falla'!JF76=0,\"\",'[3]Tasa de Falla'!JF76)","v":""},{"$f":"IF('[3]Tasa de Falla'!JG76=0,\"\",'[3]Tasa de Falla'!JG76)","v":""}]
[null,null,{"$f":"'[3]Tasa de Falla'!C77","v":59},{"$f":"'[3]Tasa de Falla'!D77","v":"V. QUINTEROS - ACONQUIJA - ANDALGALA"},{"$f":"'[3]Tasa de Falla'!E77","v":132},{"$f":"'[3]Tasa de Falla'!F77","v":102},{"$f":"IF('[3]Tasa de Falla'!IV77=0,\"\",'[3]Tasa de Falla'!IV77)","v":1},{"$f":"IF('[3]Tasa de Falla'!IW77=0,\"\",'[3]Tasa de Falla'!IW77)","v":""},{"$f":"IF('[3]Tasa de Falla'!IX77=0,\"\",'[3]Tasa de Falla'!IX77)","v":""},{"$f":"IF('[3]Tasa de Falla'!IY77=0,\"\",'[3]Tasa de Falla'!IY77)","v":""},{"$f":"IF('[3]Tasa de Falla'!IZ77=0,\"\",'[3]Tasa de Falla'!IZ77)","v":""},{"$f":"IF('[3]Tasa de Falla'!JA77=0,\"\",'[3]Tasa de Falla'!JA77)","v":1},{"$f":"IF('[3]Tasa de Falla'!JB77=0,\"\",'[3]Tasa de Falla'!JB77)","v":""},{"$f":"IF('[3]Tasa de Falla'!JC77=0,\"\",'[3]Tasa de Falla'!JC77)","v":2},{"$f":"IF('[3]Tasa de Falla'!JD77=0,\"\",'[3]Tasa de Falla'!JD77)","v":""},{"$f":"IF('[3]Tasa de Falla'!JE77=0,\"\",'[3]Tasa de Falla'!JE77)","v":""},{"$f":"IF('[3]Tasa de Falla'!JF77=0,\"\",'[3]Tasa de Falla'!JF77)","v":1},{"$f":"IF('[3]Tasa de Falla'!JG77=0,\"\",'[3]Tasa de Falla'!JG77)","v":""}]
[null,null,{"$f":"'[3]Tasa de Falla'!C78","v":60},{"$f":"'[3]Tasa de Falla'!D78","v":"ANDALGALA - BELEN"},{"$f":"'[3]Tasa de Falla'!E78","v":132},{"$f":"'[3]Tasa de Falla'!F78","v":80.3},{"$f":"IF('[3]Tasa de Falla'!IV78=0,\"\",'[3]Tasa de Falla'!IV78)","v":""},{"$f":"IF('[3]Tasa de Falla'!IW78=0,\"\",'[3]Tasa de Falla'!IW78)","v":""},{"$f":"IF('[3]Tasa de Falla'!IX78=0,\"\",'[3]Tasa de Falla'!IX78)","v":""},{"$f":"IF('[3]Tasa de Falla'!IY78=0,\"\",'[3]Tasa de Falla'!IY78)","v":""},{"$f":"IF('[3]Tasa de Falla'!IZ78=0,\"\",'[3]Tasa de Falla'!IZ78)","v":""},{"$f":"IF('[3]Tasa de Falla'!JA78=0,\"\",'[3]Tasa de Falla'!JA78)","v":""},{"$f":"IF('[3]Tasa de Falla'!JB78=0,\"\",'[3]Tasa de Falla'!JB78)","v":""},{"$f":"IF('[3]Tasa de Falla'!JC78=0,\"\",'[3]Tasa de Falla'!JC78)","v":""},{"$f":"IF('[3]Tasa de Falla'!JD78=0,\"\",'[3]Tasa de Falla'!JD78)","v":""},{"$f":"IF('[3]Tasa de Falla'!JE78=0,\"\",'[3]Tasa de Falla'!JE78)","v":""},{"$f":"IF('[3]Tasa de Falla'!JF78=0,\"\",'[3]Tasa de Falla'!JF78)","v":""},{"$f":"IF('[3]Tasa de Falla'!JG78=0,\"\",'[3]Tasa de Falla'!JG78)","v":""}]
[null,null,{"$f":"'[3]Tasa de Falla'!C79","v":61},{"$f":"'[3]Tasa de Falla'!D79","v":"TUCUMAN NORTE - TRANCAS"},{"$f":"'[3]Tasa de Falla'!E79","v":132},{"$f":"'[3]Tasa de Falla'!F79","v":75},{"$f":"IF('[3]Tasa de Falla'!IV79=0,\"\",'[3]Tasa de Falla'!IV79)","v":""},{"$f":"IF('[3]Tasa de Falla'!IW79=0,\"\",'[3]Tasa de Falla'!IW79)","v":""},{"$f":"IF('[3]Tasa de Falla'!IX79=0,\"\",'[3]Tasa de Falla'!IX79)","v":""},{"$f":"IF('[3]Tasa de Falla'!IY79=0,\"\",'[3]Tasa de Falla'!IY79)","v":""},{"$f":"IF('[3]Tasa de Falla'!IZ79=0,\"\",'[3]Tasa de Falla'!IZ79)","v":1},{"$f":"IF('[3]Tasa de Falla'!JA79=0,\"\",'[3]Tasa de Falla'!JA79)","v":""},{"$f":"IF('[3]Tasa de Falla'!JB79=0,\"\",'[3]Tasa de Falla'!JB79)","v":""},{"$f":"IF('[3]Tasa de Falla'!JC79=0,\"\",'[3]Tasa de Falla'!JC79)","v":""},{"$f":"IF('[3]Tasa de Falla'!JD79=0,\"\",'[3]Tasa de Falla'!JD79)","v":""},{"$f":"IF('[3]Tasa de Falla'!JE79=0,\"\",'[3]Tasa de Falla'!JE79)","v":""},{"$f":"IF('[3]Tasa de Falla'!JF79=0,\"\",'[3]Tasa de Falla'!JF79)","v":""},{"$f":"IF('[3]Tasa de Falla'!JG79=0,\"\",'[3]Tasa de Falla'!JG79)","v":""}]
[null,null,{"$f":"'[3]Tasa de Falla'!C80","v":62},{"$f":"'[3]Tasa de Falla'!D80","v":"CABRA CORRAL - TRANCAS"},{"$f":"'[3]Tasa de Falla'!E80","v":132},{"$f":"'[3]Tasa de Falla'!F80","v":115},{"$f":"IF('[3]Tasa de Falla'!IV80=0,\"\",'[3]Tasa de Falla'!IV80)","v":"XXXX"},{"$f":"IF('[3]Tasa de Falla'!IW80=0,\"\",'[3]Tasa de Falla'!IW80)","v":"XXXX"},{"$f":"IF('[3]Tasa de Falla'!IX80=0,\"\",'[3]Tasa de Falla'!IX80)","v":"XXXX"},{"$f":"IF('[3]Tasa de Falla'!IY80=0,\"\",'[3]Tasa de Falla'!IY80)","v":"XXXX"},{"$f":"IF('[3]Tasa de Falla'!IZ80=0,\"\",'[3]Tasa de Falla'!IZ80)","v":"XXXX"},{"$f":"IF('[3]Tasa de Falla'!JA80=0,\"\",'[3]Tasa de Falla'!JA80)","v":"XXXX"},{"$f":"IF('[3]Tasa de Falla'!JB80=0,\"\",'[3]Tasa de Falla'!JB80)","v":"XXXX"},{"$f":"IF('[3]Tasa de Falla'!JC80=0,\"\",'[3]Tasa de Falla'!JC80)","v":"XXXX"},{"$f":"IF('[3]Tasa de Falla'!JD80=0,\"\",'[3]Tasa de Falla'!JD80)","v":"XXXX"},{"$f":"IF('[3]Tasa de Falla'!JE80=0,\"\",'[3]Tasa de Falla'!JE80)","v":"XXXX"},{"$f":"IF('[3]Tasa de Falla'!JF80=0,\"\",'[3]Tasa de Falla'!JF80)","v":"XXXX"},{"$f":"IF('[3]Tasa de Falla'!JG80=0,\"\",'[3]Tasa de Falla'!JG80)","v":"XXXX"}]
[null,null,{"$f":"'[3]Tasa de Falla'!C81","v":63},{"$f":"'[3]Tasa de Falla'!D81","v":"LAS MADERAS - JUJUY SUR"},{"$f":"'[3]Tasa de Falla'!E81","v":132},{"$f":"'[3]Tasa de Falla'!F81","v":27.6},{"$f":"IF('[3]Tasa de Falla'!IV81=0,\"\",'[3]Tasa de Falla'!IV81)","v":""},{"$f":"IF('[3]Tasa de Falla'!IW81=0,\"\",'[3]Tasa de Falla'!IW81)","v":""},{"$f":"IF('[3]Tasa de Falla'!IX81=0,\"\",'[3]Tasa de Falla'!IX81)","v":""},{"$f":"IF('[3]Tasa de Falla'!IY81=0,\"\",'[3]Tasa de Falla'!IY81)","v":""},{"$f":"IF('[3]Tasa de Falla'!IZ81=0,\"\",'[3]Tasa de Falla'!IZ81)","v":""},{"$f":"IF('[3]Tasa de Falla'!JA81=0,\"\",'[3]Tasa de Falla'!JA81)","v":""},{"$f":"IF('[3]Tasa de Falla'!JB81=0,\"\",'[3]Tasa de Falla'!JB81)","v":""},{"$f":"IF('[3]Tasa de Falla'!JC81=0,\"\",'[3]Tasa de Falla'!JC81)","v":""},{"$f":"IF('[3]Tasa de Falla'!JD81=0,\"\",'[3]Tasa de Falla'!JD81)","v":""},{"$f":"IF('[3]Tasa de Falla'!JE81=0,\"\",'[3]Tasa de Falla'!JE81)","v":""},{"$f":"IF('[3]Tasa de Falla'!JF81=0,\"\",'[3]Tasa de Falla'!JF81)","v":""},{"$f":"IF('[3]Tasa de Falla'!JG81=0,\"\",'[3]Tasa de Falla'!JG81)","v":""}]
[null,null,{"$f":"'[3]Tasa de Falla'!C82","v":64},{"$f":"'[3]Tasa de Falla'!D82","v":"BELEN - TINOGASTA"},{"$f":"'[3]Tasa de Falla'!E82","v":132},{"$f":"'[3]Tasa de Falla'!F82","v":72},{"$f":"IF('[3]Tasa de Falla'!IV82=0,\"\",'[3]Tasa de Falla'!IV82)","v":""},{"$f":"IF('[3]Tasa de Falla'!IW82=0,\"\",'[3]Tasa de Falla'!IW82)","v":""},{"$f":"IF('[3]Tasa de Falla'!IX82=0,\"\",'[3]Tasa de Falla'!IX82)","v":""},{"$f":"IF('[3]Tasa de Falla'!IY82=0,\"\",'[3]Tasa de Falla'!IY82)","v":""},{"$f":"IF('[3]Tasa de Falla'!IZ82=0,\"\",'[3]Tasa de Falla'!IZ82)","v":""},{"$f":"IF('[3]Tasa de Falla'!JA82=0,\"\",'[3]Tasa de Falla'!JA82)","v":""},{"$f":"IF('[3]Tasa de Falla'!JB82=0,\"\",'[3]Tasa de Falla'!JB82)","v":""},{"$f":"IF('[3]Tasa de Falla'!JC82=0,\"\",'[3]Tasa de Falla'!JC82)","v":""},{"$f":"IF('[3]Tasa de Falla'!JD82=0,\"\",'[3]Tasa de Falla'!JD82)","v":""},{"$f":"IF('[3]Tasa de Falla'!JE82=0,\"\",'[3]Tasa de Falla'!JE82)","v":""},{"$f":"IF('[3]Tasa de Falla'!JF82=0,\"\",'[3]Tasa de Falla'!JF82)","v":""},{"$f":"IF('[3]Tasa de Falla'!JG82=0,\"\",'[3]Tasa de Falla'!JG82)","v":""}]
[null,null,{"$f":"'[3]Tasa de Falla'!C83","v":65},{"$f":"'[3]Tasa de Falla'!D83","v":"BURRUYACU - CEVIL POZO"},{"$f":"'[3]Tasa de Falla'!E83","v":132},{"$f":"'[3]Tasa de Falla'!F83","v":56},{"$f":"IF('[3]Tasa de Falla'!IV83=0,\"\",'[3]Tasa de Falla'!IV83)","v":1},{"$f":"IF('[3]Tasa de Falla'!IW83=0,\"\",'[3]Tasa de Falla'!IW83)","v":""},{"$f":"IF('[3]Tasa de Falla'!IX83=0,\"\",'[3]Tasa de Falla'!IX83)","v":""},{"$f":"IF('[3]Tasa de Falla'!IY83=0,\"\",'[3]Tasa de Falla'!IY83)","v":""},{"$f":"IF('[3]Tasa de Falla'!IZ83=0,\"\",'[3]Tasa de Falla'!IZ83)","v":""},{"$f":"IF('[3]Tasa de Falla'!JA83=0,\"\",'[3]Tasa de Falla'!JA83)","v":""},{"$f":"IF('[3]Tasa de Falla'!JB83=0,\"\",'[3]Tasa de Falla'!JB83)","v":""},{"$f":"IF('[3]Tasa de Falla'!JC83=0,\"\",'[3]Tasa de Falla'!JC83)","v":""},{"$f":"IF('[3]Tasa de Falla'!JD83=0,\"\",'[3]Tasa de Falla'!JD83)","v":""},{"$f":"IF('[3]Tasa de Falla'!JE83=0,\"\",'[3]Tasa de Falla'!JE83)","v":""},{"$f":"IF('[3]Tasa de Falla'!JF83=0,\"\",'[3]Tasa de Falla'!JF83)","v":""},{"$f":"IF('[3]Tasa de Falla'!JG83=0,\"\",'[3]Tasa de Falla'!JG83)","v":""}]
[null,null,{"$f":"'[3]Tasa de Falla'!C84","v":66},{"$f":"'[3]Tasa de Falla'!D84","v":"GÜEMES - BURRUYACU"},{"$f":"'[3]Tasa de Falla'!E84","v":132},{"$f":"'[3]Tasa de Falla'!F84","v":235.1},{"$f":"IF('[3]Tasa de Falla'!IV84=0,\"\",'[3]Tasa de Falla'!IV84)","v":"XXXX"},{"$f":"IF('[3]Tasa de Falla'!IW84=0,\"\",'[3]Tasa de Falla'!IW84)","v":"XXXX"},{"$f":"IF('[3]Tasa de Falla'!IX84=0,\"\",'[3]Tasa de Falla'!IX84)","v":"XXXX"},{"$f":"IF('[3]Tasa de Falla'!IY84=0,\"\",'[3]Tasa de Falla'!IY84)","v":"XXXX"},{"$f":"IF('[3]Tasa de Falla'!IZ84=0,\"\",'[3]Tasa de Falla'!IZ84)","v":"XXXX"},{"$f":"IF('[3]Tasa de Falla'!JA84=0,\"\",'[3]Tasa de Falla'!JA84)","v":"XXXX"},{"$f":"IF('[3]Tasa de Falla'!JB84=0,\"\",'[3]Tasa de Falla'!JB84)","v":"XXXX"},{"$f":"IF('[3]Tasa de Falla'!JC84=0,\"\",'[3]Tasa de Falla'!JC84)","v":"XXXX"},{"$f":"IF('[3]Tasa de Falla'!JD84=0,\"\",'[3]Tasa de Falla'!JD84)","v":"XXXX"},{"$f":"IF('[3]Tasa de Falla'!JE84=0,\"\",'[3]Tasa de Falla'!JE84)","v":"XXXX"},{"$f":"IF('[3]Tasa de Falla'!JF84=0,\"\",'[3]Tasa de Falla'!JF84)","v":"XXXX"},{"$f":"IF('[3]Tasa de Falla'!JG84=0,\"\",'[3]Tasa de Falla'!JG84)","v":"XXXX"}]
[null,null,{"$f":"'[3]Tasa de Falla'!C85","v":67},{"$f":"'[3]Tasa de Falla'!D85","v":"FRIAS - RECREO"},{"$f":"'[3]Tasa de Falla'!E85","v":132},{"$f":"'[3]Tasa de Falla'!F85","v":74.540000000000006},{"$f":"IF('[3]Tasa de Falla'!IV85=0,\"\",'[3]Tasa de Falla'!IV85)","v":""},{"$f":"IF('[3]Tasa de Falla'!IW85=0,\"\",'[3]Tasa de Falla'!IW85)","v":""},{"$f":"IF('[3]Tasa de Falla'!IX85=0,\"\",'[3]Tasa de Falla'!IX85)","v":""},{"$f":"IF('[3]Tasa de Falla'!IY85=0,\"\",'[3]Tasa de Falla'!IY85)","v":""},{"$f":"IF('[3]Tasa de Falla'!IZ85=0,\"\",'[3]Tasa de Falla'!IZ85)","v":""},{"$f":"IF('[3]Tasa de Falla'!JA85=0,\"\",'[3]Tasa de Falla'!JA85)","v":""},{"$f":"IF('[3]Tasa de Falla'!JB85=0,\"\",'[3]Tasa de Falla'!JB85)","v":""},{"$f":"IF('[3]Tasa de Falla'!JC85=0,\"\",'[3]Tasa de Falla'!JC85)","v":""},{"$f":"IF('[3]Tasa de Falla'!JD85=0,\"\",'[3]Tasa de Falla'!JD85)","v":""},{"$f":"IF('[3]Tasa de Falla'!JE85=0,\"\",'[3]Tasa de Falla'!JE85)","v":""},{"$f":"IF('[3]Tasa de Falla'!JF85=0,\"\",'[3]Tasa de Falla'!JF85)","v":2},{"$f":"IF('[3]Tasa de Falla'!JG85=0,\"\",'[3]Tasa de Falla'!JG85)","v":""}]
[null,null,{"$f":"'[3]Tasa de Falla'!C86","v":68},{"$f":"'[3]Tasa de Falla'!D86","v":"RECREO - LA RIOJA 1"},{"$f":"'[3]Tasa de Falla'!E86","v":132},{"$f":"'[3]Tasa de Falla'!F86","v":221},{"$f":"IF('[3]Tasa de Falla'!IV86=0,\"\",'[3]Tasa de Falla'!IV86)","v":""},{"$f":"IF('[3]Tasa de Falla'!IW86=0,\"\",'[3]Tasa de Falla'!IW86)","v":""},{"$f":"IF('[3]Tasa de Falla'!IX86=0,\"\",'[3]Tasa de Falla'!IX86)","v":""},{"$f":"IF('[3]Tasa de Falla'!IY86=0,\"\",'[3]Tasa de Falla'!IY86)","v":1},{"$f":"IF('[3]Tasa de Falla'!IZ86=0,\"\",'[3]Tasa de Falla'!IZ86)","v":1},{"$f":"IF('[3]Tasa de Falla'!JA86=0,\"\",'[3]Tasa de Falla'!JA86)","v":""},{"$f":"IF('[3]Tasa de Falla'!JB86=0,\"\",'[3]Tasa de Falla'!JB86)","v":""},{"$f":"IF('[3]Tasa de Falla'!JC86=0,\"\",'[3]Tasa de Falla'!JC86)","v":""},{"$f":"IF('[3]Tasa de Falla'!JD86=0,\"\",'[3]Tasa de Falla'!JD86)","v":2},{"$f":"IF('[3]Tasa de Falla'!JE86=0,\"\",'[3]Tasa de Falla'!JE86)","v":""},{"$f":"IF('[3]Tasa de Falla'!JF86=0,\"\",'[3]Tasa de Falla'!JF86)","v":""},{"$f":"IF('[3]Tasa de Falla'!JG86=0,\"\",'[3]Tasa de Falla'!JG86)","v":2}]
[null,null,{"$f":"'[3]Tasa de Falla'!C87","v":69},{"$f":"'[3]Tasa de Falla'!D87","v":"RECREO - LA RIOJA 2"},{"$f":"'[3]Tasa de Falla'!E87","v":132},{"$f":"'[3]Tasa de Falla'!F87","v":220},{"$f":"IF('[3]Tasa de Falla'!IV87=0,\"\",'[3]Tasa de Falla'!IV87)","v":""},{"$f":"IF('[3]Tasa de Falla'!IW87=0,\"\",'[3]Tasa de Falla'!IW87)","v":""},{"$f":"IF('[3]Tasa de Falla'!IX87=0,\"\",'[3]Tasa de Falla'!IX87)","v":1},{"$f":"IF('[3]Tasa de Falla'!IY87=0,\"\",'[3]Tasa de Falla'!IY87)","v":1},{"$f":"IF('[3]Tasa de Falla'!IZ87=0,\"\",'[3]Tasa de Falla'!IZ87)","v":""},{"$f":"IF('[3]Tasa de Falla'!JA87=0,\"\",'[3]Tasa de Falla'!JA87)","v":""},{"$f":"IF('[3]Tasa de Falla'!JB87=0,\"\",'[3]Tasa de Falla'!JB87)","v":""},{"$f":"IF('[3]Tasa de Falla'!JC87=0,\"\",'[3]Tasa de Falla'!JC87)","v":""},{"$f":"IF('[3]Tasa de Falla'!JD87=0,\"\",'[3]Tasa de Falla'!JD87)","v":3},{"$f":"IF('[3]Tasa de Falla'!JE87=0,\"\",'[3]Tasa de Falla'!JE87)","v":1},{"$f":"IF('[3]Tasa de Falla'!JF87=0,\"\",'[3]Tasa de Falla'!JF87)","v":2},{"$f":"IF('[3]Tasa de Falla'!JG87=0,\"\",'[3]Tasa de Falla'!JG87)","v":""}]
[null,null,{"$f":"'[3]Tasa de Falla'!C88","v":70},{"$f":"'[3]Tasa de Falla'!D88","v":"RECREO - CATAMARCA"},{"$f":"'[3]Tasa de Falla'!E88","v":132},{"$f":"'[3]Tasa de Falla'!F88","v":203},{"$f":"IF('[3]Tasa de Falla'!IV88=0,\"\",'[3]Tasa de Falla'!IV88)","v":""},{"$f":"IF('[3]Tasa de Falla'!IW88=0,\"\",'[3]Tasa de Falla'!IW88)","v":1},{"$f":"IF('[3]Tasa de Falla'!IX88=0,\"\",'[3]Tasa de Falla'!IX88)","v":""},{"$f":"IF('[3]Tasa de Falla'!IY88=0,\"\",'[3]Tasa de Falla'!IY88)","v":""},{"$f":"IF('[3]Tasa de Falla'!IZ88=0,\"\",'[3]Tasa de Falla'!IZ88)","v":""},{"$f":"IF('[3]Tasa de Falla'!JA88=0,\"\",'[3]Tasa de Falla'!JA88)","v":""},{"$f":"IF('[3]Tasa de Falla'!JB88=0,\"\",'[3]Tasa de Falla'!JB88)","v":""},{"$f":"IF('[3]Tasa de Falla'!JC88=0,\"\",'[3]Tasa de Falla'!JC88)","v":""},{"$f":"IF('[3]Tasa de Falla'!JD88=0,\"\",'[3]Tasa de Falla'!JD88)","v":""},{"$f":"IF('[3]Tasa de Falla'!JE88=0,\"\",'[3]Tasa de Falla'!JE88)","v":""},{"$f":"IF('[3]Tasa de Falla'!JF88=0,\"\",'[3]Tasa de Falla'!JF88)","v":""},{"$f":"IF('[3]Tasa de Falla'!JG88=0,\"\",'[3]Tasa de Falla'!JG88)","v":""}]
[null,null,{"$f":"'[3]Tasa de Falla'!C89","v":71},{"$f":"'[3]Tasa de Falla'!D89","v":"CABRA CORRAL - EL CARRIL"},{"$f":"'[3]Tasa de Falla'!E89","v":132},{"$f":"'[3]Tasa de Falla'!F89","v":33.75},{"$f":"IF('[3]Tasa de Falla'!IV89=0,\"\",'[3]Tasa de Falla'!IV89)","v":""},{"$f":"IF('[3]Tasa de Falla'!IW89=0,\"\",'[3]Tasa de Falla'!IW89)","v":""},{"$f":"IF('[3]Tasa de Falla'!IX89=0,\"\",'[3]Tasa de Falla'!IX89)","v":""},{"$f":"IF('[3]Tasa de Falla'!IY89=0,\"\",'[3]Tasa de Falla'!IY89)","v":""},{"$f":"IF('[3]Tasa de Falla'!IZ89=0,\"\",'[3]Tasa de Falla'!IZ89)","v":1},{"$f":"IF('[3]Tasa de Falla'!JA89=0,\"\",'[3]Tasa de Falla'!JA89)","v":""},{"$f":"IF('[3]Tasa de Falla'!JB89=0,\"\",'[3]Tasa de Falla'!JB89)","v":""},{"$f":"IF('[3]Tasa de Falla'!JC89=0,\"\",'[3]Tasa de Falla'!JC89)","v":""},{"$f":"IF('[3]Tasa de Falla'!JD89=0,\"\",'[3]Tasa de Falla'!JD89)","v":""},{"$f":"IF('[3]Tasa de Falla'!JE89=0,\"\",'[3]Tasa de Falla'!JE89)","v":""},{"$f":"IF('[3]Tasa de Falla'!JF89=0,\"\",'[3]Tasa de Falla'!JF89)","v":""},{"$f":"IF('[3]Tasa de Falla'!JG89=0,\"\",'[3]Tasa de Falla'!JG89)","v":""}]
[null,null,{"$f":"'[3]Tasa de Falla'!C90","v":72},{"$f":"'[3]Tasa de Falla'!D90","v":"PAMPA GRANDE - CABRA CORRAL"},{"$f":"'[3]Tasa de Falla'!E90","v":132},{"$f":"'[3]Tasa de Falla'!F90","v":60},{"$f":"IF('[3]Tasa de Falla'!IV90=0,\"\",'[3]Tasa de Falla'!IV90)","v":1},{"$f":"IF('[3]Tasa de Falla'!IW90=0,\"\",'[3]Tasa de Falla'!IW90)","v":1},{"$f":"IF('[3]Tasa de Falla'!IX90=0,\"\",'[3]Tasa de Falla'!IX90)","v":""},{"$f":"IF('[3]Tasa de Falla'!IY90=0,\"\",'[3]Tasa de Falla'!IY90)","v":""},{"$f":"IF('[3]Tasa de Falla'!IZ90=0,\"\",'[3]Tasa de Falla'!IZ90)","v":1},{"$f":"IF('[3]Tasa de Falla'!JA90=0,\"\",'[3]Tasa de Falla'!JA90)","v":""},{"$f":"IF('[3]Tasa de Falla'!JB90=0,\"\",'[3]Tasa de Falla'!JB90)","v":""},{"$f":"IF('[3]Tasa de Falla'!JC90=0,\"\",'[3]Tasa de Falla'!JC90)","v":""},{"$f":"IF('[3]Tasa de Falla'!JD90=0,\"\",'[3]Tasa de Falla'!JD90)","v":"XXXX"},{"$f":"IF('[3]Tasa de Falla'!JE90=0,\"\",'[3]Tasa de Falla'!JE90)","v":"XXXX"},{"$f":"IF('[3]Tasa de Falla'!JF90=0,\"\",'[3]Tasa de Falla'!JF90)","v":"XXXX"},{"$f":"IF('[3]Tasa de Falla'!JG90=0,\"\",'[3]Tasa de Falla'!JG90)","v":"XXXX"}]
[null,null,{"$f":"'[3]Tasa de Falla'!C91","v":73},{"$f":"'[3]Tasa de Falla'!D91","v":"PAMPA GRANDE - CAFAYATE"},{"$f":"'[3]Tasa de Falla'!E91","v":132},{"$f":"'[3]Tasa de Falla'!F91","v":63},{"$f":"IF('[3]Tasa de Falla'!IV91=0,\"\",'[3]Tasa de Falla'!IV91)","v":""},{"$f":"IF('[3]Tasa de Falla'!IW91=0,\"\",'[3]Tasa de Falla'!IW91)","v":""},{"$f":"IF('[3]Tasa de Falla'!IX91=0,\"\",'[3]Tasa de Falla'!IX91)","v":""},{"$f":"IF('[3]Tasa de Falla'!IY91=0,\"\",'[3]Tasa de Falla'!IY91)","v":""},{"$f":"IF('[3]Tasa de Falla'!IZ91=0,\"\",'[3]Tasa de Falla'!IZ91)","v":""},{"$f":"IF('[3]Tasa de Falla'!JA91=0,\"\",'[3]Tasa de Falla'!JA91)","v":""},{"$f":"IF('[3]Tasa de Falla'!JB91=0,\"\",'[3]Tasa de Falla'!JB91)","v":""},{"$f":"IF('[3]Tasa de Falla'!JC91=0,\"\",'[3]Tasa de Falla'!JC91)","v":3},{"$f":"IF('[3]Tasa de Falla'!JD91=0,\"\",'[3]Tasa de Falla'!JD91)","v":""},{"$f":"IF('[3]Tasa de Falla'!JE91=0,\"\",'[3]Tasa de Falla'!JE91)","v":""},{"$f":"IF('[3]Tasa de Falla'!JF91=0,\"\",'[3]Tasa de Falla'!JF91)","v":""},{"$f":"IF('[3]Tasa de Falla'!JG91=0,\"\",'[3]Tasa de Falla'!JG91)","v":""}]
[null,null,{"$f":"'[3]Tasa de Falla'!C92","v":74},{"$f":"'[3]Tasa de Falla'!D92","v":"PAMPA GRANDE - TRANCAS"},{"$f":"'[3]Tasa de Falla'!E92","v":132},{"$f":"'[3]Tasa de Falla'!F92","v":55},{"$f":"IF('[3]Tasa de Falla'!IV92=0,\"\",'[3]Tasa de Falla'!IV92)","v":""},{"$f":"IF('[3]Tasa de Falla'!IW92=0,\"\",'[3]Tasa de Falla'!IW92)","v":""},{"$f":"IF('[3]Tasa de Falla'!IX92=0,\"\",'[3]Tasa de Falla'!IX92)","v":""},{"$f":"IF('[3]Tasa de Falla'!IY92=0,\"\",'[3]Tasa de Falla'!IY92)","v":""},{"$f":"IF('[3]Tasa de Falla'!IZ92=0,\"\",'[3]Tasa de Falla'!IZ92)","v":""},{"$f":"IF('[3]Tasa de Falla'!JA92=0,\"\",'[3]Tasa de Falla'!JA92)","v":2},{"$f":"IF('[3]Tasa de Falla'!JB92=0,\"\",'[3]Tasa de Falla'!JB92)","v":""},{"$f":"IF('[3]Tasa de Falla'!JC92=0,\"\",'[3]Tasa de Falla'!JC92)","v":""},{"$f":"IF('[3]Tasa de Falla'!JD92=0,\"\",'[3]Tasa de Falla'!JD92)","v":1},{"$f":"IF('[3]Tasa de Falla'!JE92=0,\"\",'[3]Tasa de Falla'!JE92)","v":1},{"$f":"IF('[3]Tasa de Falla'!JF92=0,\"\",'[3]Tasa de Falla'!JF92)","v":1},{"$f":"IF('[3]Tasa de Falla'!JG92=0,\"\",'[3]Tasa de Falla'!JG92)","v":1}]
[null,null,{"$f":"'[3]Tasa de Falla'!C93","v":75},{"$f":"'[3]Tasa de Falla'!D93","v":"SANTIAGO CENTRO - FERNANDEZ - SUNCHO CORRAL "},{"$f":"'[3]Tasa de Falla'!E93","v":132},{"$f":"'[3]Tasa de Falla'!F93","v":103},{"$f":"IF('[3]Tasa de Falla'!IV93=0,\"\",'[3]Tasa de Falla'!IV93)","v":""},{"$f":"IF('[3]Tasa de Falla'!IW93=0,\"\",'[3]Tasa de Falla'!IW93)","v":""},{"$f":"IF('[3]Tasa de Falla'!IX93=0,\"\",'[3]Tasa de Falla'!IX93)","v":""},{"$f":"IF('[3]Tasa de Falla'!IY93=0,\"\",'[3]Tasa de Falla'!IY93)","v":""},{"$f":"IF('[3]Tasa de Falla'!IZ93=0,\"\",'[3]Tasa de Falla'!IZ93)","v":""},{"$f":"IF('[3]Tasa de Falla'!JA93=0,\"\",'[3]Tasa de Falla'!JA93)","v":""},{"$f":"IF('[3]Tasa de Falla'!JB93=0,\"\",'[3]Tasa de Falla'!JB93)","v":1},{"$f":"IF('[3]Tasa de Falla'!JC93=0,\"\",'[3]Tasa de Falla'!JC93)","v":""},{"$f":"IF('[3]Tasa de Falla'!JD93=0,\"\",'[3]Tasa de Falla'!JD93)","v":""},{"$f":"IF('[3]Tasa de Falla'!JE93=0,\"\",'[3]Tasa de Falla'!JE93)","v":""},{"$f":"IF('[3]Tasa de Falla'!JF93=0,\"\",'[3]Tasa de Falla'!JF93)","v":""},{"$f":"IF('[3]Tasa de Falla'!JG93=0,\"\",'[3]Tasa de Falla'!JG93)","v":""}]
[null,null,{"$f":"'[3]Tasa de Falla'!C94","v":76},{"$f":"'[3]Tasa de Falla'!D94","v":"SUNCHO CORRAL - ANATUYA"},{"$f":"'[3]Tasa de Falla'!E94","v":132},{"$f":"'[3]Tasa de Falla'!F94","v":81},{"$f":"IF('[3]Tasa de Falla'!IV94=0,\"\",'[3]Tasa de Falla'!IV94)","v":""},{"$f":"IF('[3]Tasa de Falla'!IW94=0,\"\",'[3]Tasa de Falla'!IW94)","v":""},{"$f":"IF('[3]Tasa de Falla'!IX94=0,\"\",'[3]Tasa de Falla'!IX94)","v":""},{"$f":"IF('[3]Tasa de Falla'!IY94=0,\"\",'[3]Tasa de Falla'!IY94)","v":""},{"$f":"IF('[3]Tasa de Falla'!IZ94=0,\"\",'[3]Tasa de Falla'!IZ94)","v":""},{"$f":"IF('[3]Tasa de Falla'!JA94=0,\"\",'[3]Tasa de Falla'!JA94)","v":""},{"$f":"IF('[3]Tasa de Falla'!JB94=0,\"\",'[3]Tasa de Falla'!JB94)","v":""},{"$f":"IF('[3]Tasa de Falla'!JC94=0,\"\",'[3]Tasa de Falla'!JC94)","v":""},{"$f":"IF('[3]Tasa de Falla'!JD94=0,\"\",'[3]Tasa de Falla'!JD94)","v":""},{"$f":"IF('[3]Tasa de Falla'!JE94=0,\"\",'[3]Tasa de Falla'!JE94)","v":1},{"$f":"IF('[3]Tasa de Falla'!JF94=0,\"\",'[3]Tasa de Falla'!JF94)","v":""},{"$f":"IF('[3]Tasa de Falla'!JG94=0,\"\",'[3]Tasa de Falla'!JG94)","v":""}]
[null,null,{"$f":"'[3]Tasa de Falla'!C95","v":77},{"$f":"'[3]Tasa de Falla'!D95","v":"LAS MADERAS - GÜEMES SALTA"},{"$f":"'[3]Tasa de Falla'!E95","v":132},{"$f":"'[3]Tasa de Falla'!F95","v":42},{"$f":"IF('[3]Tasa de Falla'!IV95=0,\"\",'[3]Tasa de Falla'!IV95)","v":""},{"$f":"IF('[3]Tasa de Falla'!IW95=0,\"\",'[3]Tasa de Falla'!IW95)","v":""},{"$f":"IF('[3]Tasa de Falla'!IX95=0,\"\",'[3]Tasa de Falla'!IX95)","v":""},{"$f":"IF('[3]Tasa de Falla'!IY95=0,\"\",'[3]Tasa de Falla'!IY95)","v":""},{"$f":"IF('[3]Tasa de Falla'!IZ95=0,\"\",'[3]Tasa de Falla'!IZ95)","v":""},{"$f":"IF('[3]Tasa de Falla'!JA95=0,\"\",'[3]Tasa de Falla'!JA95)","v":""},{"$f":"IF('[3]Tasa de Falla'!JB95=0,\"\",'[3]Tasa de Falla'!JB95)","v":""},{"$f":"IF('[3]Tasa de Falla'!JC95=0,\"\",'[3]Tasa de Falla'!JC95)","v":""},{"$f":"IF('[3]Tasa de Falla'!JD95=0,\"\",'[3]Tasa de Falla'!JD95)","v":""},{"$f":"IF('[3]Tasa de Falla'!JE95=0,\"\",'[3]Tasa de Falla'!JE95)","v":""},{"$f":"IF('[3]Tasa de Falla'!JF95=0,\"\",'[3]Tasa de Falla'!JF95)","v":""},{"$f":"IF('[3]Tasa de Falla'!JG95=0,\"\",'[3]Tasa de Falla'!JG95)","v":""}]
[null,null,{"$f":"'[3]Tasa de Falla'!C96","v":78},{"$f":"'[3]Tasa de Falla'!D96","v":"INDEPENDENCIA - EL BRACHO 2"},{"$f":"'[3]Tasa de Falla'!E96","v":132},{"$f":"'[3]Tasa de Falla'!F96","v":17.100000000000001},{"$f":"IF('[3]Tasa de Falla'!IV96=0,\"\",'[3]Tasa de Falla'!IV96)","v":1},{"$f":"IF('[3]Tasa de Falla'!IW96=0,\"\",'[3]Tasa de Falla'!IW96)","v":""},{"$f":"IF('[3]Tasa de Falla'!IX96=0,\"\",'[3]Tasa de Falla'!IX96)","v":""},{"$f":"IF('[3]Tasa de Falla'!IY96=0,\"\",'[3]Tasa de Falla'!IY96)","v":""},{"$f":"IF('[3]Tasa de Falla'!IZ96=0,\"\",'[3]Tasa de Falla'!IZ96)","v":1},{"$f":"IF('[3]Tasa de Falla'!JA96=0,\"\",'[3]Tasa de Falla'!JA96)","v":2},{"$f":"IF('[3]Tasa de Falla'!JB96=0,\"\",'[3]Tasa de Falla'!JB96)","v":""},{"$f":"IF('[3]Tasa de Falla'!JC96=0,\"\",'[3]Tasa de Falla'!JC96)","v":""},{"$f":"IF('[3]Tasa de Falla'!JD96=0,\"\",'[3]Tasa de Falla'!JD96)","v":""},{"$f":"IF('[3]Tasa de Falla'!JE96=0,\"\",'[3]Tasa de Falla'!JE96)","v":""},{"$f":"IF('[3]Tasa de Falla'!JF96=0,\"\",'[3]Tasa de Falla'!JF96)","v":1},{"$f":"IF('[3]Tasa de Falla'!JG96=0,\"\",'[3]Tasa de Falla'!JG96)","v":""}]
[null,null,{"$f":"'[3]Tasa de Falla'!C97","v":79},{"$f":"'[3]Tasa de Falla'!D97","v":"GÜEMES - SALTA NORTE"},{"$f":"'[3]Tasa de Falla'!E97","v":132},{"$f":"'[3]Tasa de Falla'!F97","v":39},{"$f":"IF('[3]Tasa de Falla'!IV97=0,\"\",'[3]Tasa de Falla'!IV97)","v":"XXXX"},{"$f":"IF('[3]Tasa de Falla'!IW97=0,\"\",'[3]Tasa de Falla'!IW97)","v":"XXXX"},{"$f":"IF('[3]Tasa de Falla'!IX97=0,\"\",'[3]Tasa de Falla'!IX97)","v":"XXXX"},{"$f":"IF('[3]Tasa de Falla'!IY97=0,\"\",'[3]Tasa de Falla'!IY97)","v":"XXXX"},{"$f":"IF('[3]Tasa de Falla'!IZ97=0,\"\",'[3]Tasa de Falla'!IZ97)","v":"XXXX"},{"$f":"IF('[3]Tasa de Falla'!JA97=0,\"\",'[3]Tasa de Falla'!JA97)","v":"XXXX"},{"$f":"IF('[3]Tasa de Falla'!JB97=0,\"\",'[3]Tasa de Falla'!JB97)","v":"XXXX"},{"$f":"IF('[3]Tasa de Falla'!JC97=0,\"\",'[3]Tasa de Falla'!JC97)","v":"XXXX"},{"$f":"IF('[3]Tasa de Falla'!JD97=0,\"\",'[3]Tasa de Falla'!JD97)","v":"XXXX"},{"$f":"IF('[3]Tasa de Falla'!JE97=0,\"\",'[3]Tasa de Falla'!JE97)","v":"XXXX"},{"$f":"IF('[3]Tasa de Falla'!JF97=0,\"\",'[3]Tasa de Falla'!JF97)","v":"XXXX"},{"$f":"IF('[3]Tasa de Falla'!JG97=0,\"\",'[3]Tasa de Falla'!JG97)","v":"XXXX"}]
[null,null,{"$f":"'[3]Tasa de Falla'!C98","v":80},{"$f":"'[3]Tasa de Falla'!D98","v":"BURRUYACU - COBOS"},{"$f":"'[3]Tasa de Falla'!E98","v":132},{"$f":"'[3]Tasa de Falla'!F98","v":229.5},{"$f":"IF('[3]Tasa de Falla'!IV98=0,\"\",'[3]Tasa de Falla'!IV98)","v":"XXXX"},{"$f":"IF('[3]Tasa de Falla'!IW98=0,\"\",'[3]Tasa de Falla'!IW98)","v":"XXXX"},{"$f":"IF('[3]Tasa de Falla'!IX98=0,\"\",'[3]Tasa de Falla'!IX98)","v":"XXXX"},{"$f":"IF('[3]Tasa de Falla'!IY98=0,\"\",'[3]Tasa de Falla'!IY98)","v":"XXXX"},{"$f":"IF('[3]Tasa de Falla'!IZ98=0,\"\",'[3]Tasa de Falla'!IZ98)","v":"XXXX"},{"$f":"IF('[3]Tasa de Falla'!JA98=0,\"\",'[3]Tasa de Falla'!JA98)","v":"XXXX"},{"$f":"IF('[3]Tasa de Falla'!JB98=0,\"\",'[3]Tasa de Falla'!JB98)","v":"XXXX"},{"$f":"IF('[3]Tasa de Falla'!JC98=0,\"\",'[3]Tasa de Falla'!JC98)","v":"XXXX"},{"$f":"IF('[3]Tasa de Falla'!JD98=0,\"\",'[3]Tasa de Falla'!JD98)","v":"XXXX"},{"$f":"IF('[3]Tasa de Falla'!JE98=0,\"\",'[3]Tasa de Falla'!JE98)","v":"XXXX"},{"$f":"IF('[3]Tasa de Falla'!JF98=0,\"\",'[3]Tasa de Falla'!JF98)","v":"XXXX"},{"$f":"IF('[3]Tasa de Falla'!JG98=0,\"\",'[3]Tasa de Falla'!JG98)","v":"XXXX"}]
[null,null,{"$f":"'[3]Tasa de Falla'!C99","v":81},{"$f":"'[3]Tasa de Falla'!D99","v":"METAN - COBOS"},{"$f":"'[3]Tasa de Falla'!E99","v":132},{"$f":"'[3]Tasa de Falla'!F99","v":89.2},{"$f":"IF('[3]Tasa de Falla'!IV99=0,\"\",'[3]Tasa de Falla'!IV99)","v":""},{"$f":"IF('[3]Tasa de Falla'!IW99=0,\"\",'[3]Tasa de Falla'!IW99)","v":""},{"$f":"IF('[3]Tasa de Falla'!IX99=0,\"\",'[3]Tasa de Falla'!IX99)","v":""},{"$f":"IF('[3]Tasa de Falla'!IY99=0,\"\",'[3]Tasa de Falla'!IY99)","v":""},{"$f":"IF('[3]Tasa de Falla'!IZ99=0,\"\",'[3]Tasa de Falla'!IZ99)","v":""},{"$f":"IF('[3]Tasa de Falla'!JA99=0,\"\",'[3]Tasa de Falla'!JA99)","v":""},{"$f":"IF('[3]Tasa de Falla'!JB99=0,\"\",'[3]Tasa de Falla'!JB99)","v":""},{"$f":"IF('[3]Tasa de Falla'!JC99=0,\"\",'[3]Tasa de Falla'!JC99)","v":""},{"$f":"IF('[3]Tasa de Falla'!JD99=0,\"\",'[3]Tasa de Falla'!JD99)","v":""},{"$f":"IF('[3]Tasa de Falla'!JE99=0,\"\",'[3]Tasa de Falla'!JE99)","v":""},{"$f":"IF('[3]Tasa de Falla'!JF99=0,\"\",'[3]Tasa de Falla'!JF99)","v":""},{"$f":"IF('[3]Tasa de Falla'!JG99=0,\"\",'[3]Tasa de Falla'!JG99)","v":""}]
[null,null,{"$f":"'[3]Tasa de Falla'!C100","v":82},{"$f":"'[3]Tasa de Falla'!D100","v":"AÑATUYA - BANDERA"},{"$f":"'[3]Tasa de Falla'!E100","v":132},{"$f":"'[3]Tasa de Falla'!F100","v":76},{"$f":"IF('[3]Tasa de Falla'!IV100=0,\"\",'[3]Tasa de Falla'!IV100)","v":1},{"$f":"IF('[3]Tasa de Falla'!IW100=0,\"\",'[3]Tasa de Falla'!IW100)","v":""},{"$f":"IF('[3]Tasa de Falla'!IX100=0,\"\",'[3]Tasa de Falla'!IX100)","v":""},{"$f":"IF('[3]Tasa de Falla'!IY100=0,\"\",'[3]Tasa de Falla'!IY100)","v":""},{"$f":"IF('[3]Tasa de Falla'!IZ100=0,\"\",'[3]Tasa de Falla'!IZ100)","v":""},{"$f":"IF('[3]Tasa de Falla'!JA100=0,\"\",'[3]Tasa de Falla'!JA100)","v":""},{"$f":"IF('[3]Tasa de Falla'!JB100=0,\"\",'[3]Tasa de Falla'!JB100)","v":""},{"$f":"IF('[3]Tasa de Falla'!JC100=0,\"\",'[3]Tasa de Falla'!JC100)","v":""},{"$f":"IF('[3]Tasa de Falla'!JD100=0,\"\",'[3]Tasa de Falla'!JD100)","v":""},{"$f":"IF('[3]Tasa de Falla'!JE100=0,\"\",'[3]Tasa de Falla'!JE100)","v":1},{"$f":"IF('[3]Tasa de Falla'!JF100=0,\"\",'[3]Tasa de Falla'!JF100)","v":""},{"$f":"IF('[3]Tasa de Falla'!JG100=0,\"\",'[3]Tasa de Falla'!JG100)","v":""}]
[null,null,{"$f":"'[3]Tasa de Falla'!C101","v":84},{"$f":"'[3]Tasa de Falla'!D101","v":"GÜEMES SALTA - COBOS 1"},{"$f":"'[3]Tasa de Falla'!E101","v":132},{"$f":"'[3]Tasa de Falla'!F101","v":12.1},{"$f":"IF('[3]Tasa de Falla'!IV101=0,\"\",'[3]Tasa de Falla'!IV101)","v":""},{"$f":"IF('[3]Tasa de Falla'!IW101=0,\"\",'[3]Tasa de Falla'!IW101)","v":""},{"$f":"IF('[3]Tasa de Falla'!IX101=0,\"\",'[3]Tasa de Falla'!IX101)","v":""},{"$f":"IF('[3]Tasa de Falla'!IY101=0,\"\",'[3]Tasa de Falla'!IY101)","v":""},{"$f":"IF('[3]Tasa de Falla'!IZ101=0,\"\",'[3]Tasa de Falla'!IZ101)","v":""},{"$f":"IF('[3]Tasa de Falla'!JA101=0,\"\",'[3]Tasa de Falla'!JA101)","v":""},{"$f":"IF('[3]Tasa de Falla'!JB101=0,\"\",'[3]Tasa de Falla'!JB101)","v":""},{"$f":"IF('[3]Tasa de Falla'!JC101=0,\"\",'[3]Tasa de Falla'!JC101)","v":""},{"$f":"IF('[3]Tasa de Falla'!JD101=0,\"\",'[3]Tasa de Falla'!JD101)","v":""},{"$f":"IF('[3]Tasa de Falla'!JE101=0,\"\",'[3]Tasa de Falla'!JE101)","v":1},{"$f":"IF('[3]Tasa de Falla'!JF101=0,\"\",'[3]Tasa de Falla'!JF101)","v":1},{"$f":"IF('[3]Tasa de Falla'!JG101=0,\"\",'[3]Tasa de Falla'!JG101)","v":""}]
[null,null,{"$f":"'[3]Tasa de Falla'!C102","v":85},{"$f":"'[3]Tasa de Falla'!D102","v":"GÜEMES SALTA - COBOS 2"},{"$f":"'[3]Tasa de Falla'!E102","v":132},{"$f":"'[3]Tasa de Falla'!F102","v":12.1},{"$f":"IF('[3]Tasa de Falla'!IV102=0,\"\",'[3]Tasa de Falla'!IV102)","v":""},{"$f":"IF('[3]Tasa de Falla'!IW102=0,\"\",'[3]Tasa de Falla'!IW102)","v":""},{"$f":"IF('[3]Tasa de Falla'!IX102=0,\"\",'[3]Tasa de Falla'!IX102)","v":""},{"$f":"IF('[3]Tasa de Falla'!IY102=0,\"\",'[3]Tasa de Falla'!IY102)","v":""},{"$f":"IF('[3]Tasa de Falla'!IZ102=0,\"\",'[3]Tasa de Falla'!IZ102)","v":1},{"$f":"IF('[3]Tasa de Falla'!JA102=0,\"\",'[3]Tasa de Falla'!JA102)","v":""},{"$f":"IF('[3]Tasa de Falla'!JB102=0,\"\",'[3]Tasa de Falla'!JB102)","v":""},{"$f":"IF('[3]Tasa de Falla'!JC102=0,\"\",'[3]Tasa de Falla'!JC102)","v":""},{"$f":"IF('[3]Tasa de Falla'!JD102=0,\"\",'[3]Tasa de Falla'!JD102)","v":""},{"$f":"IF('[3]Tasa de Falla'!JE102=0,\"\",'[3]Tasa de Falla'!JE102)","v":2},{"$f":"IF('[3]Tasa de Falla'!JF102=0,\"\",'[3]Tasa de Falla'!JF102)","v":""},{"$f":"IF('[3]Tasa de Falla'!JG102=0,\"\",'[3]Tasa de Falla'!JG102)","v":""}]
[null,null,{"$f":"'[3]Tasa de Falla'!C103","v":86},{"$f":"'[3]Tasa de Falla'!D103","v":"EL BRACHO - LA BANDA"},{"$f":"'[3]Tasa de Falla'!E103","v":132},{"$f":"'[3]Tasa de Falla'!F103","v":133.5},{"$f":"IF('[3]Tasa de Falla'!IV103=0,\"\",'[3]Tasa de Falla'!IV103)","v":"XXXX"},{"$f":"IF('[3]Tasa de Falla'!IW103=0,\"\",'[3]Tasa de Falla'!IW103)","v":"XXXX"},{"$f":"IF('[3]Tasa de Falla'!IX103=0,\"\",'[3]Tasa de Falla'!IX103)","v":"XXXX"},{"$f":"IF('[3]Tasa de Falla'!IY103=0,\"\",'[3]Tasa de Falla'!IY103)","v":"XXXX"},{"$f":"IF('[3]Tasa de Falla'!IZ103=0,\"\",'[3]Tasa de Falla'!IZ103)","v":"XXXX"},{"$f":"IF('[3]Tasa de Falla'!JA103=0,\"\",'[3]Tasa de Falla'!JA103)","v":"XXXX"},{"$f":"IF('[3]Tasa de Falla'!JB103=0,\"\",'[3]Tasa de Falla'!JB103)","v":"XXXX"},{"$f":"IF('[3]Tasa de Falla'!JC103=0,\"\",'[3]Tasa de Falla'!JC103)","v":"XXXX"},{"$f":"IF('[3]Tasa de Falla'!JD103=0,\"\",'[3]Tasa de Falla'!JD103)","v":"XXXX"},{"$f":"IF('[3]Tasa de Falla'!JE103=0,\"\",'[3]Tasa de Falla'!JE103)","v":"XXXX"},{"$f":"IF('[3]Tasa de Falla'!JF103=0,\"\",'[3]Tasa de Falla'!JF103)","v":"XXXX"},{"$f":"IF('[3]Tasa de Falla'!JG103=0,\"\",'[3]Tasa de Falla'!JG103)","v":"XXXX"}]
[null,null,{"$f":"'[3]Tasa de Falla'!C104","v":87},{"$f":"'[3]Tasa de Falla'!D104","v":"SANTIAGO OESTE - SANTIAGO SUR "},{"$f":"'[3]Tasa de Falla'!E104","v":132},{"$f":"'[3]Tasa de Falla'!F104","v":10.6},{"$f":"IF('[3]Tasa de Falla'!IV104=0,\"\",'[3]Tasa de Falla'!IV104)","v":""},{"$f":"IF('[3]Tasa de Falla'!IW104=0,\"\",'[3]Tasa de Falla'!IW104)","v":""},{"$f":"IF('[3]Tasa de Falla'!IX104=0,\"\",'[3]Tasa de Falla'!IX104)","v":""},{"$f":"IF('[3]Tasa de Falla'!IY104=0,\"\",'[3]Tasa de Falla'!IY104)","v":""},{"$f":"IF('[3]Tasa de Falla'!IZ104=0,\"\",'[3]Tasa de Falla'!IZ104)","v":""},{"$f":"IF('[3]Tasa de Falla'!JA104=0,\"\",'[3]Tasa de Falla'!JA104)","v":""},{"$f":"IF('[3]Tasa de Falla'!JB104=0,\"\",'[3]Tasa de Falla'!JB104)","v":""},{"$f":"IF('[3]Tasa de Falla'!JC104=0,\"\",'[3]Tasa de Falla'!JC104)","v":""},{"$f":"IF('[3]Tasa de Falla'!JD104=0,\"\",'[3]Tasa de Falla'!JD104)","v":""},{"$f":"IF('[3]Tasa de Falla'!JE104=0,\"\",'[3]Tasa de Falla'!JE104)","v":""},{"$f":"IF('[3]Tasa de Falla'!JF104=0,\"\",'[3]Tasa de Falla'!JF104)","v":""},{"$f":"IF('[3]Tasa de Falla'!JG104=0,\"\",'[3]Tasa de Falla'!JG104)","v":""}]
[null,null,{"$f":"'[3]Tasa de Falla'!C105","v":88},{"$f":"'[3]Tasa de Falla'!D105","v":"SANTIAGO SUR - SANTIAGO CENTRO"},{"$f":"'[3]Tasa de Falla'!E105","v":132},{"$f":"'[3]Tasa de Falla'!F105","v":4},{"$f":"IF('[3]Tasa de Falla'!IV105=0,\"\",'[3]Tasa de Falla'!IV105)","v":""},{"$f":"IF('[3]Tasa de Falla'!IW105=0,\"\",'[3]Tasa de Falla'!IW105)","v":""},{"$f":"IF('[3]Tasa de Falla'!IX105=0,\"\",'[3]Tasa de Falla'!IX105)","v":""},{"$f":"IF('[3]Tasa de Falla'!IY105=0,\"\",'[3]Tasa de Falla'!IY105)","v":""},{"$f":"IF('[3]Tasa de Falla'!IZ105=0,\"\",'[3]Tasa de Falla'!IZ105)","v":""},{"$f":"IF('[3]Tasa de Falla'!JA105=0,\"\",'[3]Tasa de Falla'!JA105)","v":""},{"$f":"IF('[3]Tasa de Falla'!JB105=0,\"\",'[3]Tasa de Falla'!JB105)","v":""},{"$f":"IF('[3]Tasa de Falla'!JC105=0,\"\",'[3]Tasa de Falla'!JC105)","v":""},{"$f":"IF('[3]Tasa de Falla'!JD105=0,\"\",'[3]Tasa de Falla'!JD105)","v":""},{"$f":"IF('[3]Tasa de Falla'!JE105=0,\"\",'[3]Tasa de Falla'!JE105)","v":""},{"$f":"IF('[3]Tasa de Falla'!JF105=0,\"\",'[3]Tasa de Falla'!JF105)","v":""},{"$f":"IF('[3]Tasa de Falla'!JG105=0,\"\",'[3]Tasa de Falla'!JG105)","v":""}]
[null,null,{"$f":"'[3]Tasa de Falla'!C106","v":89},{"$f":"'[3]Tasa de Falla'!D106","v":"C.H. RIO HONDO - SANTIAGO OESTE"},{"$f":"'[3]Tasa de Falla'!E106","v":132},{"$f":"'[3]Tasa de Falla'!F106","v":69.8},{"$f":"IF('[3]Tasa de Falla'!IV106=0,\"\",'[3]Tasa de Falla'!IV106)","v":""},{"$f":"IF('[3]Tasa de Falla'!IW106=0,\"\",'[3]Tasa de Falla'!IW106)","v":""},{"$f":"IF('[3]Tasa de Falla'!IX106=0,\"\",'[3]Tasa de Falla'!IX106)","v":""},{"$f":"IF('[3]Tasa de Falla'!IY106=0,\"\",'[3]Tasa de Falla'!IY106)","v":""},{"$f":"IF('[3]Tasa de Falla'!IZ106=0,\"\",'[3]Tasa de Falla'!IZ106)","v":""},{"$f":"IF('[3]Tasa de Falla'!JA106=0,\"\",'[3]Tasa de Falla'!JA106)","v":""},{"$f":"IF('[3]Tasa de Falla'!JB106=0,\"\",'[3]Tasa de Falla'!JB106)","v":""},{"$f":"IF('[3]Tasa de Falla'!JC106=0,\"\",'[3]Tasa de Falla'!JC106)","v":""},{"$f":"IF('[3]Tasa de Falla'!JD106=0,\"\",'[3]Tasa de Falla'!JD106)","v":""},{"$f":"IF('[3]Tasa de Falla'!JE106=0,\"\",'[3]Tasa de Falla'!JE106)","v":""},{"$f":"IF('[3]Tasa de Falla'!JF106=0,\"\",'[3]Tasa de Falla'!JF106)","v":""},{"$f":"IF('[3]Tasa de Falla'!JG106=0,\"\",'[3]Tasa de Falla'!JG106)","v":""}]
[null,null,{"$f":"'[3]Tasa de Falla'!C107","v":90},{"$f":"'[3]Tasa de Falla'!D107","v":"GÜEMES - MINETTI"},{"$f":"'[3]Tasa de Falla'!E107","v":132},{"$f":"'[3]Tasa de Falla'!F107","v":36.1},{"$f":"IF('[3]Tasa de Falla'!IV107=0,\"\",'[3]Tasa de Falla'!IV107)","v":"XXXX"},{"$f":"IF('[3]Tasa de Falla'!IW107=0,\"\",'[3]Tasa de Falla'!IW107)","v":"XXXX"},{"$f":"IF('[3]Tasa de Falla'!IX107=0,\"\",'[3]Tasa de Falla'!IX107)","v":"XXXX"},{"$f":"IF('[3]Tasa de Falla'!IY107=0,\"\",'[3]Tasa de Falla'!IY107)","v":"XXXX"},{"$f":"IF('[3]Tasa de Falla'!IZ107=0,\"\",'[3]Tasa de Falla'!IZ107)","v":"XXXX"},{"$f":"IF('[3]Tasa de Falla'!JA107=0,\"\",'[3]Tasa de Falla'!JA107)","v":"XXXX"},{"$f":"IF('[3]Tasa de Falla'!JB107=0,\"\",'[3]Tasa de Falla'!JB107)","v":"XXXX"},{"$f":"IF('[3]Tasa de Falla'!JC107=0,\"\",'[3]Tasa de Falla'!JC107)","v":"XXXX"},{"$f":"IF('[3]Tasa de Falla'!JD107=0,\"\",'[3]Tasa de Falla'!JD107)","v":"XXXX"},{"$f":"IF('[3]Tasa de Falla'!JE107=0,\"\",'[3]Tasa de Falla'!JE107)","v":"XXXX"},{"$f":"IF('[3]Tasa de Falla'!JF107=0,\"\",'[3]Tasa de Falla'!JF107)","v":"XXXX"},{"$f":"IF('[3]Tasa de Falla'!JG107=0,\"\",'[3]Tasa de Falla'!JG107)","v":"XXXX"}]
[null,null,{"$f":"'[3]Tasa de Falla'!C108","v":91},{"$f":"'[3]Tasa de Falla'!D108","v":"GÜEMES - SALTA NORTE"},{"$f":"'[3]Tasa de Falla'!E108","v":132},{"$f":"'[3]Tasa de Falla'!F108","v":38.97},{"$f":"IF('[3]Tasa de Falla'!IV108=0,\"\",'[3]Tasa de Falla'!IV108)","v":""},{"$f":"IF('[3]Tasa de Falla'!IW108=0,\"\",'[3]Tasa de Falla'!IW108)","v":""},{"$f":"IF('[3]Tasa de Falla'!IX108=0,\"\",'[3]Tasa de Falla'!IX108)","v":""},{"$f":"IF('[3]Tasa de Falla'!IY108=0,\"\",'[3]Tasa de Falla'!IY108)","v":""},{"$f":"IF('[3]Tasa de Falla'!IZ108=0,\"\",'[3]Tasa de Falla'!IZ108)","v":""},{"$f":"IF('[3]Tasa de Falla'!JA108=0,\"\",'[3]Tasa de Falla'!JA108)","v":""},{"$f":"IF('[3]Tasa de Falla'!JB108=0,\"\",'[3]Tasa de Falla'!JB108)","v":""},{"$f":"IF('[3]Tasa de Falla'!JC108=0,\"\",'[3]Tasa de Falla'!JC108)","v":""},{"$f":"IF('[3]Tasa de Falla'!JD108=0,\"\",'[3]Tasa de Falla'!JD108)","v":""},{"$f":"IF('[3]Tasa de Falla'!JE108=0,\"\",'[3]Tasa de Falla'!JE108)","v":""},{"$f":"IF('[3]Tasa de Falla'!JF108=0,\"\",'[3]Tasa de Falla'!JF108)","v":""},{"$f":"IF('[3]Tasa de Falla'!JG108=0,\"\",'[3]Tasa de Falla'!JG108)","v":""}]
[null,null,{"$f":"'[3]Tasa de Falla'!C109","v":92},{"$f":"'[3]Tasa de Falla'!D109","v":"BURRUYACU - R. DE LA FRONTERA"},{"$f":"'[3]Tasa de Falla'!E109","v":132},{"$f":"'[3]Tasa de Falla'!F109","v":99.1},{"$f":"IF('[3]Tasa de Falla'!IV109=0,\"\",'[3]Tasa de Falla'!IV109)","v":""},{"$f":"IF('[3]Tasa de Falla'!IW109=0,\"\",'[3]Tasa de Falla'!IW109)","v":""},{"$f":"IF('[3]Tasa de Falla'!IX109=0,\"\",'[3]Tasa de Falla'!IX109)","v":""},{"$f":"IF('[3]Tasa de Falla'!IY109=0,\"\",'[3]Tasa de Falla'!IY109)","v":""},{"$f":"IF('[3]Tasa de Falla'!IZ109=0,\"\",'[3]Tasa de Falla'!IZ109)","v":""},{"$f":"IF('[3]Tasa de Falla'!JA109=0,\"\",'[3]Tasa de Falla'!JA109)","v":1},{"$f":"IF('[3]Tasa de Falla'!JB109=0,\"\",'[3]Tasa de Falla'!JB109)","v":""},{"$f":"IF('[3]Tasa de Falla'!JC109=0,\"\",'[3]Tasa de Falla'!JC109)","v":""},{"$f":"IF('[3]Tasa de Falla'!JD109=0,\"\",'[3]Tasa de Falla'!JD109)","v":""},{"$f":"IF('[3]Tasa de Falla'!JE109=0,\"\",'[3]Tasa de Falla'!JE109)","v":""},{"$f":"IF('[3]Tasa de Falla'!JF109=0,\"\",'[3]Tasa de Falla'!JF109)","v":""},{"$f":"IF('[3]Tasa de Falla'!JG109=0,\"\",'[3]Tasa de Falla'!JG109)","v":""}]
[null,null,{"$f":"'[3]Tasa de Falla'!C110","v":93},{"$f":"'[3]Tasa de Falla'!D110","v":"R. DE LA FRONTERA - COBOS"},{"$f":"'[3]Tasa de Falla'!E110","v":132},{"$f":"'[3]Tasa de Falla'!F110","v":130.4},{"$f":"IF('[3]Tasa de Falla'!IV110=0,\"\",'[3]Tasa de Falla'!IV110)","v":""},{"$f":"IF('[3]Tasa de Falla'!IW110=0,\"\",'[3]Tasa de Falla'!IW110)","v":""},{"$f":"IF('[3]Tasa de Falla'!IX110=0,\"\",'[3]Tasa de Falla'!IX110)","v":""},{"$f":"IF('[3]Tasa de Falla'!IY110=0,\"\",'[3]Tasa de Falla'!IY110)","v":""},{"$f":"IF('[3]Tasa de Falla'!IZ110=0,\"\",'[3]Tasa de Falla'!IZ110)","v":""},{"$f":"IF('[3]Tasa de Falla'!JA110=0,\"\",'[3]Tasa de Falla'!JA110)","v":1},{"$f":"IF('[3]Tasa de Falla'!JB110=0,\"\",'[3]Tasa de Falla'!JB110)","v":""},{"$f":"IF('[3]Tasa de Falla'!JC110=0,\"\",'[3]Tasa de Falla'!JC110)","v":""},{"$f":"IF('[3]Tasa de Falla'!JD110=0,\"\",'[3]Tasa de Falla'!JD110)","v":""},{"$f":"IF('[3]Tasa de Falla'!JE110=0,\"\",'[3]Tasa de Falla'!JE110)","v":""},{"$f":"IF('[3]Tasa de Falla'!JF110=0,\"\",'[3]Tasa de Falla'!JF110)","v":1},{"$f":"IF('[3]Tasa de Falla'!JG110=0,\"\",'[3]Tasa de Falla'!JG110)","v":1}]
[null,null,{"$f":"'[3]Tasa de Falla'!C111","v":94},{"$f":"'[3]Tasa de Falla'!D111","v":"J.V. GONZALEZ - APOLINARIO SARAVIA"},{"$f":"'[3]Tasa de Falla'!E111","v":132},{"$f":"'[3]Tasa de Falla'!F111","v":94},{"$f":"IF('[3]Tasa de Falla'!IV111=0,\"\",'[3]Tasa de Falla'!IV111)","v":""},{"$f":"IF('[3]Tasa de Falla'!IW111=0,\"\",'[3]Tasa de Falla'!IW111)","v":""},{"$f":"IF('[3]Tasa de Falla'!IX111=0,\"\",'[3]Tasa de Falla'!IX111)","v":""},{"$f":"IF('[3]Tasa de Falla'!IY111=0,\"\",'[3]Tasa de Falla'!IY111)","v":""},{"$f":"IF('[3]Tasa de Falla'!IZ111=0,\"\",'[3]Tasa de Falla'!IZ111)","v":""},{"$f":"IF('[3]Tasa de Falla'!JA111=0,\"\",'[3]Tasa de Falla'!JA111)","v":""},{"$f":"IF('[3]Tasa de Falla'!JB111=0,\"\",'[3]Tasa de Falla'!JB111)","v":""},{"$f":"IF('[3]Tasa de Falla'!JC111=0,\"\",'[3]Tasa de Falla'!JC111)","v":1},{"$f":"IF('[3]Tasa de Falla'!JD111=0,\"\",'[3]Tasa de Falla'!JD111)","v":""},{"$f":"IF('[3]Tasa de Falla'!JE111=0,\"\",'[3]Tasa de Falla'!JE111)","v":""},{"$f":"IF('[3]Tasa de Falla'!JF111=0,\"\",'[3]Tasa de Falla'!JF111)","v":""},{"$f":"IF('[3]Tasa de Falla'!JG111=0,\"\",'[3]Tasa de Falla'!JG111)","v":""}]
[null,null,{"$f":"'[3]Tasa de Falla'!C112","v":95},{"$f":"'[3]Tasa de Falla'!D112","v":"ANDALGALA - SAULIL"},{"$f":"'[3]Tasa de Falla'!E112","v":132},{"$f":"'[3]Tasa de Falla'!F112","v":76},{"$f":"IF('[3]Tasa de Falla'!IV112=0,\"\",'[3]Tasa de Falla'!IV112)","v":""},{"$f":"IF('[3]Tasa de Falla'!IW112=0,\"\",'[3]Tasa de Falla'!IW112)","v":""},{"$f":"IF('[3]Tasa de Falla'!IX112=0,\"\",'[3]Tasa de Falla'!IX112)","v":""},{"$f":"IF('[3]Tasa de Falla'!IY112=0,\"\",'[3]Tasa de Falla'!IY112)","v":""},{"$f":"IF('[3]Tasa de Falla'!IZ112=0,\"\",'[3]Tasa de Falla'!IZ112)","v":""},{"$f":"IF('[3]Tasa de Falla'!JA112=0,\"\",'[3]Tasa de Falla'!JA112)","v":""},{"$f":"IF('[3]Tasa de Falla'!JB112=0,\"\",'[3]Tasa de Falla'!JB112)","v":""},{"$f":"IF('[3]Tasa de Falla'!JC112=0,\"\",'[3]Tasa de Falla'!JC112)","v":1},{"$f":"IF('[3]Tasa de Falla'!JD112=0,\"\",'[3]Tasa de Falla'!JD112)","v":""},{"$f":"IF('[3]Tasa de Falla'!JE112=0,\"\",'[3]Tasa de Falla'!JE112)","v":1},{"$f":"IF('[3]Tasa de Falla'!JF112=0,\"\",'[3]Tasa de Falla'!JF112)","v":""},{"$f":"IF('[3]Tasa de Falla'!JG112=0,\"\",'[3]Tasa de Falla'!JG112)","v":""}]
[null,null,{"$f":"'[3]Tasa de Falla'!C113","v":96},{"$f":"'[3]Tasa de Falla'!D113","v":"SANTIAGO OESTE - SANT. SUR  - SANT. CENTRO"},{"$f":"'[3]Tasa de Falla'!E113","v":132},{"$f":"'[3]Tasa de Falla'!F113","v":14.6},{"$f":"IF('[3]Tasa de Falla'!IV113=0,\"\",'[3]Tasa de Falla'!IV113)","v":"XXXX"},{"$f":"IF('[3]Tasa de Falla'!IW113=0,\"\",'[3]Tasa de Falla'!IW113)","v":"XXXX"},{"$f":"IF('[3]Tasa de Falla'!IX113=0,\"\",'[3]Tasa de Falla'!IX113)","v":"XXXX"},{"$f":"IF('[3]Tasa de Falla'!IY113=0,\"\",'[3]Tasa de Falla'!IY113)","v":"XXXX"},{"$f":"IF('[3]Tasa de Falla'!IZ113=0,\"\",'[3]Tasa de Falla'!IZ113)","v":"XXXX"},{"$f":"IF('[3]Tasa de Falla'!JA113=0,\"\",'[3]Tasa de Falla'!JA113)","v":"XXXX"},{"$f":"IF('[3]Tasa de Falla'!JB113=0,\"\",'[3]Tasa de Falla'!JB113)","v":"XXXX"},{"$f":"IF('[3]Tasa de Falla'!JC113=0,\"\",'[3]Tasa de Falla'!JC113)","v":"XXXX"},{"$f":"IF('[3]Tasa de Falla'!JD113=0,\"\",'[3]Tasa de Falla'!JD113)","v":"XXXX"},{"$f":"IF('[3]Tasa de Falla'!JE113=0,\"\",'[3]Tasa de Falla'!JE113)","v":"XXXX"},{"$f":"IF('[3]Tasa de Falla'!JF113=0,\"\",'[3]Tasa de Falla'!JF113)","v":"XXXX"},{"$f":"IF('[3]Tasa de Falla'!JG113=0,\"\",'[3]Tasa de Falla'!JG113)","v":"XXXX"}]
[null,null,{"$f":"'[3]Tasa de Falla'!C114","v":97},{"$f":"'[3]Tasa de Falla'!D114","v":"SUNCHO CORRAL - QUIMILI"},{"$f":"'[3]Tasa de Falla'!E114","v":132},{"$f":"'[3]Tasa de Falla'!F114","v":108},{"$f":"IF('[3]Tasa de Falla'!IV114=0,\"\",'[3]Tasa de Falla'!IV114)","v":""},{"$f":"IF('[3]Tasa de Falla'!IW114=0,\"\",'[3]Tasa de Falla'!IW114)","v":""},{"$f":"IF('[3]Tasa de Falla'!IX114=0,\"\",'[3]Tasa de Falla'!IX114)","v":""},{"$f":"IF('[3]Tasa de Falla'!IY114=0,\"\",'[3]Tasa de Falla'!IY114)","v":""},{"$f":"IF('[3]Tasa de Falla'!IZ114=0,\"\",'[3]Tasa de Falla'!IZ114)","v":""},{"$f":"IF('[3]Tasa de Falla'!JA114=0,\"\",'[3]Tasa de Falla'!JA114)","v":""},{"$f":"IF('[3]Tasa de Falla'!JB114=0,\"\",'[3]Tasa de Falla'!JB114)","v":""},{"$f":"IF('[3]Tasa de Falla'!JC114=0,\"\",'[3]Tasa de Falla'!JC114)","v":""},{"$f":"IF('[3]Tasa de Falla'!JD114=0,\"\",'[3]Tasa de Falla'!JD114)","v":""},{"$f":"IF('[3]Tasa de Falla'!JE114=0,\"\",'[3]Tasa de Falla'!JE114)","v":""},{"$f":"IF('[3]Tasa de Falla'!JF114=0,\"\",'[3]Tasa de Falla'!JF114)","v":""},{"$f":"IF('[3]Tasa de Falla'!JG114=0,\"\",'[3]Tasa de Falla'!JG114)","v":""}]
[null,null,{"$f":"'[3]Tasa de Falla'!C115","v":98},{"$f":"'[3]Tasa de Falla'!D115","v":"EL BRACHO - LA BANDA ESTE"},{"$f":"'[3]Tasa de Falla'!E115","v":132},{"$f":"'[3]Tasa de Falla'!F115","v":140.9},{"$f":"IF('[3]Tasa de Falla'!IV115=0,\"\",'[3]Tasa de Falla'!IV115)","v":1},{"$f":"IF('[3]Tasa de Falla'!IW115=0,\"\",'[3]Tasa de Falla'!IW115)","v":""},{"$f":"IF('[3]Tasa de Falla'!IX115=0,\"\",'[3]Tasa de Falla'!IX115)","v":""},{"$f":"IF('[3]Tasa de Falla'!IY115=0,\"\",'[3]Tasa de Falla'!IY115)","v":""},{"$f":"IF('[3]Tasa de Falla'!IZ115=0,\"\",'[3]Tasa de Falla'!IZ115)","v":""},{"$f":"IF('[3]Tasa de Falla'!JA115=0,\"\",'[3]Tasa de Falla'!JA115)","v":""},{"$f":"IF('[3]Tasa de Falla'!JB115=0,\"\",'[3]Tasa de Falla'!JB115)","v":""},{"$f":"IF('[3]Tasa de Falla'!JC115=0,\"\",'[3]Tasa de Falla'!JC115)","v":1},{"$f":"IF('[3]Tasa de Falla'!JD115=0,\"\",'[3]Tasa de Falla'!JD115)","v":""},{"$f":"IF('[3]Tasa de Falla'!JE115=0,\"\",'[3]Tasa de Falla'!JE115)","v":""},{"$f":"IF('[3]Tasa de Falla'!JF115=0,\"\",'[3]Tasa de Falla'!JF115)","v":1},{"$f":"IF('[3]Tasa de Falla'!JG115=0,\"\",'[3]Tasa de Falla'!JG115)","v":""}]
[null,null,{"$f":"'[3]Tasa de Falla'!C116","v":99},{"$f":"'[3]Tasa de Falla'!D116","v":"LA BANDA ESTE - LA BANDA"},{"$f":"'[3]Tasa de Falla'!E116","v":132},{"$f":"'[3]Tasa de Falla'!F116","v":16.2},{"$f":"IF('[3]Tasa de Falla'!IV116=0,\"\",'[3]Tasa de Falla'!IV116)","v":""},{"$f":"IF('[3]Tasa de Falla'!IW116=0,\"\",'[3]Tasa de Falla'!IW116)","v":""},{"$f":"IF('[3]Tasa de Falla'!IX116=0,\"\",'[3]Tasa de Falla'!IX116)","v":""},{"$f":"IF('[3]Tasa de Falla'!IY116=0,\"\",'[3]Tasa de Falla'!IY116)","v":""},{"$f":"IF('[3]Tasa de Falla'!IZ116=0,\"\",'[3]Tasa de Falla'!IZ116)","v":""},{"$f":"IF('[3]Tasa de Falla'!JA116=0,\"\",'[3]Tasa de Falla'!JA116)","v":""},{"$f":"IF('[3]Tasa de Falla'!JB116=0,\"\",'[3]Tasa de Falla'!JB116)","v":""},{"$f":"IF('[3]Tasa de Falla'!JC116=0,\"\",'[3]Tasa de Falla'!JC116)","v":""},{"$f":"IF('[3]Tasa de Falla'!JD116=0,\"\",'[3]Tasa de Falla'!JD116)","v":""},{"$f":"IF('[3]Tasa de Falla'!JE116=0,\"\",'[3]Tasa de Falla'!JE116)","v":""},{"$f":"IF('[3]Tasa de Falla'!JF116=0,\"\",'[3]Tasa de Falla'!JF116)","v":""},{"$f":"IF('[3]Tasa de Falla'!JG116=0,\"\",'[3]Tasa de Falla'!JG116)","v":""}]
[null,null,{"$f":"'[3]Tasa de Falla'!C117","v":100},{"$f":"'[3]Tasa de Falla'!D117","v":"TABACAL - PICHANAL"},{"$f":"'[3]Tasa de Falla'!E117","v":132},{"$f":"'[3]Tasa de Falla'!F117","v":9.0399999999999991},{"$f":"IF('[3]Tasa de Falla'!IV117=0,\"\",'[3]Tasa de Falla'!IV117)","v":""},{"$f":"IF('[3]Tasa de Falla'!IW117=0,\"\",'[3]Tasa de Falla'!IW117)","v":""},{"$f":"IF('[3]Tasa de Falla'!IX117=0,\"\",'[3]Tasa de Falla'!IX117)","v":""},{"$f":"IF('[3]Tasa de Falla'!IY117=0,\"\",'[3]Tasa de Falla'!IY117)","v":""},{"$f":"IF('[3]Tasa de Falla'!IZ117=0,\"\",'[3]Tasa de Falla'!IZ117)","v":""},{"$f":"IF('[3]Tasa de Falla'!JA117=0,\"\",'[3]Tasa de Falla'!JA117)","v":""},{"$f":"IF('[3]Tasa de Falla'!JB117=0,\"\",'[3]Tasa de Falla'!JB117)","v":""},{"$f":"IF('[3]Tasa de Falla'!JC117=0,\"\",'[3]Tasa de Falla'!JC117)","v":""},{"$f":"IF('[3]Tasa de Falla'!JD117=0,\"\",'[3]Tasa de Falla'!JD117)","v":""},{"$f":"IF('[3]Tasa de Falla'!JE117=0,\"\",'[3]Tasa de Falla'!JE117)","v":1},{"$f":"IF('[3]Tasa de Falla'!JF117=0,\"\",'[3]Tasa de Falla'!JF117)","v":""},{"$f":"IF('[3]Tasa de Falla'!JG117=0,\"\",'[3]Tasa de Falla'!JG117)","v":""}]
[null,null,{"$f":"'[3]Tasa de Falla'!C118","v":101},{"$f":"'[3]Tasa de Falla'!D118","v":"ORAN - TABACAL"},{"$f":"'[3]Tasa de Falla'!E118","v":132},{"$f":"'[3]Tasa de Falla'!F118","v":10},{"$f":"IF('[3]Tasa de Falla'!IV118=0,\"\",'[3]Tasa de Falla'!IV118)","v":""},{"$f":"IF('[3]Tasa de Falla'!IW118=0,\"\",'[3]Tasa de Falla'!IW118)","v":""},{"$f":"IF('[3]Tasa de Falla'!IX118=0,\"\",'[3]Tasa de Falla'!IX118)","v":""},{"$f":"IF('[3]Tasa de Falla'!IY118=0,\"\",'[3]Tasa de Falla'!IY118)","v":1},{"$f":"IF('[3]Tasa de Falla'!IZ118=0,\"\",'[3]Tasa de Falla'!IZ118)","v":""},{"$f":"IF('[3]Tasa de Falla'!JA118=0,\"\",'[3]Tasa de Falla'!JA118)","v":""},{"$f":"IF('[3]Tasa de Falla'!JB118=0,\"\",'[3]Tasa de Falla'!JB118)","v":""},{"$f":"IF('[3]Tasa de Falla'!JC118=0,\"\",'[3]Tasa de Falla'!JC118)","v":""},{"$f":"IF('[3]Tasa de Falla'!JD118=0,\"\",'[3]Tasa de Falla'!JD118)","v":"XXXX"},{"$f":"IF('[3]Tasa de Falla'!JE118=0,\"\",'[3]Tasa de Falla'!JE118)","v":"XXXX"},{"$f":"IF('[3]Tasa de Falla'!JF118=0,\"\",'[3]Tasa de Falla'!JF118)","v":"XXXX"},{"$f":"IF('[3]Tasa de Falla'!JG118=0,\"\",'[3]Tasa de Falla'!JG118)","v":"XXXX"}]
[null,null,{"$f":"'[3]Tasa de Falla'!C119","v":102},{"$f":"'[3]Tasa de Falla'!D119","v":"MONTE QUEMADO -COPO - QUIMILI"},{"$f":"'[3]Tasa de Falla'!E119","v":132},{"$f":"'[3]Tasa de Falla'!F119","v":218},{"$f":"IF('[3]Tasa de Falla'!IV119=0,\"\",'[3]Tasa de Falla'!IV119)","v":""},{"$f":"IF('[3]Tasa de Falla'!IW119=0,\"\",'[3]Tasa de Falla'!IW119)","v":""},{"$f":"IF('[3]Tasa de Falla'!IX119=0,\"\",'[3]Tasa de Falla'!IX119)","v":""},{"$f":"IF('[3]Tasa de Falla'!IY119=0,\"\",'[3]Tasa de Falla'!IY119)","v":""},{"$f":"IF('[3]Tasa de Falla'!IZ119=0,\"\",'[3]Tasa de Falla'!IZ119)","v":""},{"$f":"IF('[3]Tasa de Falla'!JA119=0,\"\",'[3]Tasa de Falla'!JA119)","v":""},{"$f":"IF('[3]Tasa de Falla'!JB119=0,\"\",'[3]Tasa de Falla'!JB119)","v":""},{"$f":"IF('[3]Tasa de Falla'!JC119=0,\"\",'[3]Tasa de Falla'!JC119)","v":""},{"$f":"IF('[3]Tasa de Falla'!JD119=0,\"\",'[3]Tasa de Falla'!JD119)","v":""},{"$f":"IF('[3]Tasa de Falla'!JE119=0,\"\",'[3]Tasa de Falla'!JE119)","v":""},{"$f":"IF('[3]Tasa de Falla'!JF119=0,\"\",'[3]Tasa de Falla'!JF119)","v":""},{"$f":"IF('[3]Tasa de Falla'!JG119=0,\"\",'[3]Tasa de Falla'!JG119)","v":""}]
[null,null,{"$f":"'[3]Tasa de Falla'!C120","v":103},{"$f":"'[3]Tasa de Falla'!D120","v":"PI. CIRCUNVALACIÓN - LARIOJA N. 1"},{"$f":"'[3]Tasa de Falla'!E120","v":132},{"$f":"'[3]Tasa de Falla'!F120","v":16.649999999999999},{"$f":"IF('[3]Tasa de Falla'!IV120=0,\"\",'[3]Tasa de Falla'!IV120)","v":""},{"$f":"IF('[3]Tasa de Falla'!IW120=0,\"\",'[3]Tasa de Falla'!IW120)","v":""},{"$f":"IF('[3]Tasa de Falla'!IX120=0,\"\",'[3]Tasa de Falla'!IX120)","v":""},{"$f":"IF('[3]Tasa de Falla'!IY120=0,\"\",'[3]Tasa de Falla'!IY120)","v":""},{"$f":"IF('[3]Tasa de Falla'!IZ120=0,\"\",'[3]Tasa de Falla'!IZ120)","v":""},{"$f":"IF('[3]Tasa de Falla'!JA120=0,\"\",'[3]Tasa de Falla'!JA120)","v":""},{"$f":"IF('[3]Tasa de Falla'!JB120=0,\"\",'[3]Tasa de Falla'!JB120)","v":""},{"$f":"IF('[3]Tasa de Falla'!JC120=0,\"\",'[3]Tasa de Falla'!JC120)","v":""},{"$f":"IF('[3]Tasa de Falla'!JD120=0,\"\",'[3]Tasa de Falla'!JD120)","v":""},{"$f":"IF('[3]Tasa de Falla'!JE120=0,\"\",'[3]Tasa de Falla'!JE120)","v":""},{"$f":"IF('[3]Tasa de Falla'!JF120=0,\"\",'[3]Tasa de Falla'!JF120)","v":1},{"$f":"IF('[3]Tasa de Falla'!JG120=0,\"\",'[3]Tasa de Falla'!JG120)","v":""}]
[null,null,{"$f":"'[3]Tasa de Falla'!C121","v":104},{"$f":"'[3]Tasa de Falla'!D121","v":"PATQUIA NONOGASTA 132 1"},{"$f":"'[3]Tasa de Falla'!E121","v":132},{"$f":"'[3]Tasa de Falla'!F121","v":108.3},{"$f":"IF('[3]Tasa de Falla'!IV121=0,\"\",'[3]Tasa de Falla'!IV121)","v":""},{"$f":"IF('[3]Tasa de Falla'!IW121=0,\"\",'[3]Tasa de Falla'!IW121)","v":""},{"$f":"IF('[3]Tasa de Falla'!IX121=0,\"\",'[3]Tasa de Falla'!IX121)","v":""},{"$f":"IF('[3]Tasa de Falla'!IY121=0,\"\",'[3]Tasa de Falla'!IY121)","v":""},{"$f":"IF('[3]Tasa de Falla'!IZ121=0,\"\",'[3]Tasa de Falla'!IZ121)","v":""},{"$f":"IF('[3]Tasa de Falla'!JA121=0,\"\",'[3]Tasa de Falla'!JA121)","v":""},{"$f":"IF('[3]Tasa de Falla'!JB121=0,\"\",'[3]Tasa de Falla'!JB121)","v":""},{"$f":"IF('[3]Tasa de Falla'!JC121=0,\"\",'[3]Tasa de Falla'!JC121)","v":""},{"$f":"IF('[3]Tasa de Falla'!JD121=0,\"\",'[3]Tasa de Falla'!JD121)","v":""},{"$f":"IF('[3]Tasa de Falla'!JE121=0,\"\",'[3]Tasa de Falla'!JE121)","v":""},{"$f":"IF('[3]Tasa de Falla'!JF121=0,\"\",'[3]Tasa de Falla'!JF121)","v":""},{"$f":"IF('[3]Tasa de Falla'!JG121=0,\"\",'[3]Tasa de Falla'!JG121)","v":""}]
[null,null,{"$f":"'[3]Tasa de Falla'!C122","v":105},{"$f":"'[3]Tasa de Falla'!D122","v":"NONOGASTA - VILLA UNION 132 1"},{"$f":"'[3]Tasa de Falla'!E122","v":132},{"$f":"'[3]Tasa de Falla'!F122","v":82.1},{"$f":"IF('[3]Tasa de Falla'!IV122=0,\"\",'[3]Tasa de Falla'!IV122)","v":""},{"$f":"IF('[3]Tasa de Falla'!IW122=0,\"\",'[3]Tasa de Falla'!IW122)","v":""},{"$f":"IF('[3]Tasa de Falla'!IX122=0,\"\",'[3]Tasa de Falla'!IX122)","v":""},{"$f":"IF('[3]Tasa de Falla'!IY122=0,\"\",'[3]Tasa de Falla'!IY122)","v":""},{"$f":"IF('[3]Tasa de Falla'!IZ122=0,\"\",'[3]Tasa de Falla'!IZ122)","v":""},{"$f":"IF('[3]Tasa de Falla'!JA122=0,\"\",'[3]Tasa de Falla'!JA122)","v":""},{"$f":"IF('[3]Tasa de Falla'!JB122=0,\"\",'[3]Tasa de Falla'!JB122)","v":""},{"$f":"IF('[3]Tasa de Falla'!JC122=0,\"\",'[3]Tasa de Falla'!JC122)","v":""},{"$f":"IF('[3]Tasa de Falla'!JD122=0,\"\",'[3]Tasa de Falla'!JD122)","v":""},{"$f":"IF('[3]Tasa de Falla'!JE122=0,\"\",'[3]Tasa de Falla'!JE122)","v":""},{"$f":"IF('[3]Tasa de Falla'!JF122=0,\"\",'[3]Tasa de Falla'!JF122)","v":""},{"$f":"IF('[3]Tasa de Falla'!JG122=0,\"\",'[3]Tasa de Falla'!JG122)","v":2}]
[null,null,{"$f":"'[3]Tasa de Falla'!C123","v":106},{"$f":"'[3]Tasa de Falla'!D123","v":"ARAUCO - AIMOGASTA 132 1"},{"$f":"'[3]Tasa de Falla'!E123","v":132},{"$f":"'[3]Tasa de Falla'!F123","v":20},{"$f":"IF('[3]Tasa de Falla'!IV123=0,\"\",'[3]Tasa de Falla'!IV123)","v":""},{"$f":"IF('[3]Tasa de Falla'!IW123=0,\"\",'[3]Tasa de Falla'!IW123)","v":""},{"$f":"IF('[3]Tasa de Falla'!IX123=0,\"\",'[3]Tasa de Falla'!IX123)","v":""},{"$f":"IF('[3]Tasa de Falla'!IY123=0,\"\",'[3]Tasa de Falla'!IY123)","v":""},{"$f":"IF('[3]Tasa de Falla'!IZ123=0,\"\",'[3]Tasa de Falla'!IZ123)","v":""},{"$f":"IF('[3]Tasa de Falla'!JA123=0,\"\",'[3]Tasa de Falla'!JA123)","v":""},{"$f":"IF('[3]Tasa de Falla'!JB123=0,\"\",'[3]Tasa de Falla'!JB123)","v":""},{"$f":"IF('[3]Tasa de Falla'!JC123=0,\"\",'[3]Tasa de Falla'!JC123)","v":""},{"$f":"IF('[3]Tasa de Falla'!JD123=0,\"\",'[3]Tasa de Falla'!JD123)","v":""},{"$f":"IF('[3]Tasa de Falla'!JE123=0,\"\",'[3]Tasa de Falla'!JE123)","v":""},{"$f":"IF('[3]Tasa de Falla'!JF123=0,\"\",'[3]Tasa de Falla'!JF123)","v":""},{"$f":"IF('[3]Tasa de Falla'!JG123=0,\"\",'[3]Tasa de Falla'!JG123)","v":""}]
[null,null,{"$f":"'[3]Tasa de Falla'!C124","v":107},{"$f":"'[3]Tasa de Falla'!D124","v":"PATQUIA - CHAMICAL 132 1"},{"$f":"'[3]Tasa de Falla'!E124","v":132},{"$f":"'[3]Tasa de Falla'!F124","v":67.400000000000006},{"$f":"IF('[3]Tasa de Falla'!IV124=0,\"\",'[3]Tasa de Falla'!IV124)","v":""},{"$f":"IF('[3]Tasa de Falla'!IW124=0,\"\",'[3]Tasa de Falla'!IW124)","v":""},{"$f":"IF('[3]Tasa de Falla'!IX124=0,\"\",'[3]Tasa de Falla'!IX124)","v":""},{"$f":"IF('[3]Tasa de Falla'!IY124=0,\"\",'[3]Tasa de Falla'!IY124)","v":""},{"$f":"IF('[3]Tasa de Falla'!IZ124=0,\"\",'[3]Tasa de Falla'!IZ124)","v":""},{"$f":"IF('[3]Tasa de Falla'!JA124=0,\"\",'[3]Tasa de Falla'!JA124)","v":""},{"$f":"IF('[3]Tasa de Falla'!JB124=0,\"\",'[3]Tasa de Falla'!JB124)","v":""},{"$f":"IF('[3]Tasa de Falla'!JC124=0,\"\",'[3]Tasa de Falla'!JC124)","v":""},{"$f":"IF('[3]Tasa de Falla'!JD124=0,\"\",'[3]Tasa de Falla'!JD124)","v":""},{"$f":"IF('[3]Tasa de Falla'!JE124=0,\"\",'[3]Tasa de Falla'!JE124)","v":2},{"$f":"IF('[3]Tasa de Falla'!JF124=0,\"\",'[3]Tasa de Falla'!JF124)","v":""},{"$f":"IF('[3]Tasa de Falla'!JG124=0,\"\",'[3]Tasa de Falla'!JG124)","v":""}]
[null,null,{"$f":"'[3]Tasa de Falla'!C125","v":108},{"$f":"'[3]Tasa de Falla'!D125","v":"LA RIOJA - ARAUCO 132 1"},{"$f":"'[3]Tasa de Falla'!E125","v":132},{"$f":"'[3]Tasa de Falla'!F125","v":84.3},{"$f":"IF('[3]Tasa de Falla'!IV125=0,\"\",'[3]Tasa de Falla'!IV125)","v":""},{"$f":"IF('[3]Tasa de Falla'!IW125=0,\"\",'[3]Tasa de Falla'!IW125)","v":1},{"$f":"IF('[3]Tasa de Falla'!IX125=0,\"\",'[3]Tasa de Falla'!IX125)","v":""},{"$f":"IF('[3]Tasa de Falla'!IY125=0,\"\",'[3]Tasa de Falla'!IY125)","v":""},{"$f":"IF('[3]Tasa de Falla'!IZ125=0,\"\",'[3]Tasa de Falla'!IZ125)","v":""},{"$f":"IF('[3]Tasa de Falla'!JA125=0,\"\",'[3]Tasa de Falla'!JA125)","v":""},{"$f":"IF('[3]Tasa de Falla'!JB125=0,\"\",'[3]Tasa de Falla'!JB125)","v":""},{"$f":"IF('[3]Tasa de Falla'!JC125=0,\"\",'[3]Tasa de Falla'!JC125)","v":""},{"$f":"IF('[3]Tasa de Falla'!JD125=0,\"\",'[3]Tasa de Falla'!JD125)","v":1},{"$f":"IF('[3]Tasa de Falla'!JE125=0,\"\",'[3]Tasa de Falla'!JE125)","v":5},{"$f":"IF('[3]Tasa de Falla'!JF125=0,\"\",'[3]Tasa de Falla'!JF125)","v":1},{"$f":"IF('[3]Tasa de Falla'!JG125=0,\"\",'[3]Tasa de Falla'!JG125)","v":""}]
[null,null,{"$f":"'[3]Tasa de Falla'!C126","v":109},{"$f":"'[3]Tasa de Falla'!D126","v":"PI PATQUIA - PATQUIA 132 1"},{"$f":"'[3]Tasa de Falla'!E126","v":132},{"$f":"'[3]Tasa de Falla'!F126","v":58.65},{"$f":"IF('[3]Tasa de Falla'!IV126=0,\"\",'[3]Tasa de Falla'!IV126)","v":""},{"$f":"IF('[3]Tasa de Falla'!IW126=0,\"\",'[3]Tasa de Falla'!IW126)","v":""},{"$f":"IF('[3]Tasa de Falla'!IX126=0,\"\",'[3]Tasa de Falla'!IX126)","v":""},{"$f":"IF('[3]Tasa de Falla'!IY126=0,\"\",'[3]Tasa de Falla'!IY126)","v":""},{"$f":"IF('[3]Tasa de Falla'!IZ126=0,\"\",'[3]Tasa de Falla'!IZ126)","v":""},{"$f":"IF('[3]Tasa de Falla'!JA126=0,\"\",'[3]Tasa de Falla'!JA126)","v":""},{"$f":"IF('[3]Tasa de Falla'!JB126=0,\"\",'[3]Tasa de Falla'!JB126)","v":""},{"$f":"IF('[3]Tasa de Falla'!JC126=0,\"\",'[3]Tasa de Falla'!JC126)","v":""},{"$f":"IF('[3]Tasa de Falla'!JD126=0,\"\",'[3]Tasa de Falla'!JD126)","v":""},{"$f":"IF('[3]Tasa de Falla'!JE126=0,\"\",'[3]Tasa de Falla'!JE126)","v":""},{"$f":"IF('[3]Tasa de Falla'!JF126=0,\"\",'[3]Tasa de Falla'!JF126)","v":""},{"$f":"IF('[3]Tasa de Falla'!JG126=0,\"\",'[3]Tasa de Falla'!JG126)","v":""}]
[null,null,{"$f":"'[3]Tasa de Falla'!C127","v":110},{"$f":"'[3]Tasa de Falla'!D127","v":"RIO HONDO - TERMAS NORTE"},{"$f":"'[3]Tasa de Falla'!E127","v":132},{"$f":"'[3]Tasa de Falla'!F127","v":5.8},{"$f":"IF('[3]Tasa de Falla'!IV127=0,\"\",'[3]Tasa de Falla'!IV127)","v":""},{"$f":"IF('[3]Tasa de Falla'!IW127=0,\"\",'[3]Tasa de Falla'!IW127)","v":""},{"$f":"IF('[3]Tasa de Falla'!IX127=0,\"\",'[3]Tasa de Falla'!IX127)","v":""},{"$f":"IF('[3]Tasa de Falla'!IY127=0,\"\",'[3]Tasa de Falla'!IY127)","v":""},{"$f":"IF('[3]Tasa de Falla'!IZ127=0,\"\",'[3]Tasa de Falla'!IZ127)","v":""},{"$f":"IF('[3]Tasa de Falla'!JA127=0,\"\",'[3]Tasa de Falla'!JA127)","v":""},{"$f":"IF('[3]Tasa de Falla'!JB127=0,\"\",'[3]Tasa de Falla'!JB127)","v":""},{"$f":"IF('[3]Tasa de Falla'!JC127=0,\"\",'[3]Tasa de Falla'!JC127)","v":""},{"$f":"IF('[3]Tasa de Falla'!JD127=0,\"\",'[3]Tasa de Falla'!JD127)","v":""},{"$f":"IF('[3]Tasa de Falla'!JE127=0,\"\",'[3]Tasa de Falla'!JE127)","v":""},{"$f":"IF('[3]Tasa de Falla'!JF127=0,\"\",'[3]Tasa de Falla'!JF127)","v":""},{"$f":"IF('[3]Tasa de Falla'!JG127=0,\"\",'[3]Tasa de Falla'!JG127)","v":""}]
[null,null,{"$f":"'[3]Tasa de Falla'!C128","v":111},{"$f":"'[3]Tasa de Falla'!D128","v":"EL BRACHO - TETRMAS NORTE"},{"$f":"'[3]Tasa de Falla'!E128","v":132},{"$f":"'[3]Tasa de Falla'!F128","v":78.400000000000006},{"$f":"IF('[3]Tasa de Falla'!IV128=0,\"\",'[3]Tasa de Falla'!IV128)","v":""},{"$f":"IF('[3]Tasa de Falla'!IW128=0,\"\",'[3]Tasa de Falla'!IW128)","v":""},{"$f":"IF('[3]Tasa de Falla'!IX128=0,\"\",'[3]Tasa de Falla'!IX128)","v":""},{"$f":"IF('[3]Tasa de Falla'!IY128=0,\"\",'[3]Tasa de Falla'!IY128)","v":""},{"$f":"IF('[3]Tasa de Falla'!IZ128=0,\"\",'[3]Tasa de Falla'!IZ128)","v":1},{"$f":"IF('[3]Tasa de Falla'!JA128=0,\"\",'[3]Tasa de Falla'!JA128)","v":1},{"$f":"IF('[3]Tasa de Falla'!JB128=0,\"\",'[3]Tasa de Falla'!JB128)","v":""},{"$f":"IF('[3]Tasa de Falla'!JC128=0,\"\",'[3]Tasa de Falla'!JC128)","v":""},{"$f":"IF('[3]Tasa de Falla'!JD128=0,\"\",'[3]Tasa de Falla'!JD128)","v":""},{"$f":"IF('[3]Tasa de Falla'!JE128=0,\"\",'[3]Tasa de Falla'!JE128)","v":""},{"$f":"IF('[3]Tasa de Falla'!JF128=0,\"\",'[3]Tasa de Falla'!JF128)","v":""},{"$f":"IF('[3]Tasa de Falla'!JG128=0,\"\",'[3]Tasa de Falla'!JG128)","v":""}]
[null,null,{"$f":"'[3]Tasa de Falla'!C129","v":112},{"$f":"'[3]Tasa de Falla'!D129","v":"PI 150 NORTE - LA RIOJA ESTE"},{"$f":"'[3]Tasa de Falla'!E129","v":132},{"$f":"'[3]Tasa de Falla'!F129","v":4},{"$f":"IF('[3]Tasa de Falla'!IV129=0,\"\",'[3]Tasa de Falla'!IV129)","v":""},{"$f":"IF('[3]Tasa de Falla'!IW129=0,\"\",'[3]Tasa de Falla'!IW129)","v":""},{"$f":"IF('[3]Tasa de Falla'!IX129=0,\"\",'[3]Tasa de Falla'!IX129)","v":""},{"$f":"IF('[3]Tasa de Falla'!IY129=0,\"\",'[3]Tasa de Falla'!IY129)","v":""},{"$f":"IF('[3]Tasa de Falla'!IZ129=0,\"\",'[3]Tasa de Falla'!IZ129)","v":""},{"$f":"IF('[3]Tasa de Falla'!JA129=0,\"\",'[3]Tasa de Falla'!JA129)","v":""},{"$f":"IF('[3]Tasa de Falla'!JB129=0,\"\",'[3]Tasa de Falla'!JB129)","v":""},{"$f":"IF('[3]Tasa de Falla'!JC129=0,\"\",'[3]Tasa de Falla'!JC129)","v":""},{"$f":"IF('[3]Tasa de Falla'!JD129=0,\"\",'[3]Tasa de Falla'!JD129)","v":""},{"$f":"IF('[3]Tasa de Falla'!JE129=0,\"\",'[3]Tasa de Falla'!JE129)","v":""},{"$f":"IF('[3]Tasa de Falla'!JF129=0,\"\",'[3]Tasa de Falla'!JF129)","v":""},{"$f":"IF('[3]Tasa de Falla'!JG129=0,\"\",'[3]Tasa de Falla'!JG129)","v":""}]
[null,null,{"$f":"'[3]Tasa de Falla'!C130","v":113},{"$f":"'[3]Tasa de Falla'!D130","v":"PI 150 SUR - LA RIOJA ESTE"},{"$f":"'[3]Tasa de Falla'!E130","v":132},{"$f":"'[3]Tasa de Falla'!F130","v":4},{"$f":"IF('[3]Tasa de Falla'!IV130=0,\"\",'[3]Tasa de Falla'!IV130)","v":""},{"$f":"IF('[3]Tasa de Falla'!IW130=0,\"\",'[3]Tasa de Falla'!IW130)","v":""},{"$f":"IF('[3]Tasa de Falla'!IX130=0,\"\",'[3]Tasa de Falla'!IX130)","v":""},{"$f":"IF('[3]Tasa de Falla'!IY130=0,\"\",'[3]Tasa de Falla'!IY130)","v":""},{"$f":"IF('[3]Tasa de Falla'!IZ130=0,\"\",'[3]Tasa de Falla'!IZ130)","v":""},{"$f":"IF('[3]Tasa de Falla'!JA130=0,\"\",'[3]Tasa de Falla'!JA130)","v":""},{"$f":"IF('[3]Tasa de Falla'!JB130=0,\"\",'[3]Tasa de Falla'!JB130)","v":""},{"$f":"IF('[3]Tasa de Falla'!JC130=0,\"\",'[3]Tasa de Falla'!JC130)","v":""},{"$f":"IF('[3]Tasa de Falla'!JD130=0,\"\",'[3]Tasa de Falla'!JD130)","v":""},{"$f":"IF('[3]Tasa de Falla'!JE130=0,\"\",'[3]Tasa de Falla'!JE130)","v":""},{"$f":"IF('[3]Tasa de Falla'!JF130=0,\"\",'[3]Tasa de Falla'!JF130)","v":""},{"$f":"IF('[3]Tasa de Falla'!JG130=0,\"\",'[3]Tasa de Falla'!JG130)","v":""}]
[null,null,{"$f":"'[3]Tasa de Falla'!C131","v":114},{"$f":"'[3]Tasa de Falla'!D131","v":"QUIMILI - CAMPO GALLO 132 1"},{"$f":"'[3]Tasa de Falla'!E131","v":132},{"$f":"'[3]Tasa de Falla'!F131","v":140},{"$f":"IF('[3]Tasa de Falla'!IV131=0,\"\",'[3]Tasa de Falla'!IV131)","v":""},{"$f":"IF('[3]Tasa de Falla'!IW131=0,\"\",'[3]Tasa de Falla'!IW131)","v":""},{"$f":"IF('[3]Tasa de Falla'!IX131=0,\"\",'[3]Tasa de Falla'!IX131)","v":""},{"$f":"IF('[3]Tasa de Falla'!IY131=0,\"\",'[3]Tasa de Falla'!IY131)","v":""},{"$f":"IF('[3]Tasa de Falla'!IZ131=0,\"\",'[3]Tasa de Falla'!IZ131)","v":""},{"$f":"IF('[3]Tasa de Falla'!JA131=0,\"\",'[3]Tasa de Falla'!JA131)","v":""},{"$f":"IF('[3]Tasa de Falla'!JB131=0,\"\",'[3]Tasa de Falla'!JB131)","v":""},{"$f":"IF('[3]Tasa de Falla'!JC131=0,\"\",'[3]Tasa de Falla'!JC131)","v":""},{"$f":"IF('[3]Tasa de Falla'!JD131=0,\"\",'[3]Tasa de Falla'!JD131)","v":""},{"$f":"IF('[3]Tasa de Falla'!JE131=0,\"\",'[3]Tasa de Falla'!JE131)","v":""},{"$f":"IF('[3]Tasa de Falla'!JF131=0,\"\",'[3]Tasa de Falla'!JF131)","v":1},{"$f":"IF('[3]Tasa de Falla'!JG131=0,\"\",'[3]Tasa de Falla'!JG131)","v":""}]
[null,null,{"$f":"'[3]Tasa de Falla'!C132","v":115},{"$f":"'[3]Tasa de Falla'!D132","v":"CAMPO GALLO - COPO 132 1"},{"$f":"'[3]Tasa de Falla'!E132","v":132},{"$f":"'[3]Tasa de Falla'!F132","v":90},{"$f":"IF('[3]Tasa de Falla'!IV132=0,\"\",'[3]Tasa de Falla'!IV132)","v":""},{"$f":"IF('[3]Tasa de Falla'!IW132=0,\"\",'[3]Tasa de Falla'!IW132)","v":""},{"$f":"IF('[3]Tasa de Falla'!IX132=0,\"\",'[3]Tasa de Falla'!IX132)","v":""},{"$f":"IF('[3]Tasa de Falla'!IY132=0,\"\",'[3]Tasa de Falla'!IY132)","v":""},{"$f":"IF('[3]Tasa de Falla'!IZ132=0,\"\",'[3]Tasa de Falla'!IZ132)","v":""},{"$f":"IF('[3]Tasa de Falla'!JA132=0,\"\",'[3]Tasa de Falla'!JA132)","v":""},{"$f":"IF('[3]Tasa de Falla'!JB132=0,\"\",'[3]Tasa de Falla'!JB132)","v":""},{"$f":"IF('[3]Tasa de Falla'!JC132=0,\"\",'[3]Tasa de Falla'!JC132)","v":""},{"$f":"IF('[3]Tasa de Falla'!JD132=0,\"\",'[3]Tasa de Falla'!JD132)","v":""},{"$f":"IF('[3]Tasa de Falla'!JE132=0,\"\",'[3]Tasa de Falla'!JE132)","v":""},{"$f":"IF('[3]Tasa de Falla'!JF132=0,\"\",'[3]Tasa de Falla'!JF132)","v":""},{"$f":"IF('[3]Tasa de Falla'!JG132=0,\"\",'[3]Tasa de Falla'!JG132)","v":""}]
[null,null,{"$f":"'[3]Tasa de Falla'!C133","v":116},{"$f":"'[3]Tasa de Falla'!D133","v":"PICHANAL - SENDA HACHADA 132 1"},{"$f":"'[3]Tasa de Falla'!E133","v":132},{"$f":"'[3]Tasa de Falla'!F133","v":46.5},{"$f":"IF('[3]Tasa de Falla'!IV133=0,\"\",'[3]Tasa de Falla'!IV133)","v":""},{"$f":"IF('[3]Tasa de Falla'!IW133=0,\"\",'[3]Tasa de Falla'!IW133)","v":""},{"$f":"IF('[3]Tasa de Falla'!IX133=0,\"\",'[3]Tasa de Falla'!IX133)","v":""},{"$f":"IF('[3]Tasa de Falla'!IY133=0,\"\",'[3]Tasa de Falla'!IY133)","v":""},{"$f":"IF('[3]Tasa de Falla'!IZ133=0,\"\",'[3]Tasa de Falla'!IZ133)","v":""},{"$f":"IF('[3]Tasa de Falla'!JA133=0,\"\",'[3]Tasa de Falla'!JA133)","v":""},{"$f":"IF('[3]Tasa de Falla'!JB133=0,\"\",'[3]Tasa de Falla'!JB133)","v":""},{"$f":"IF('[3]Tasa de Falla'!JC133=0,\"\",'[3]Tasa de Falla'!JC133)","v":""},{"$f":"IF('[3]Tasa de Falla'!JD133=0,\"\",'[3]Tasa de Falla'!JD133)","v":""},{"$f":"IF('[3]Tasa de Falla'!JE133=0,\"\",'[3]Tasa de Falla'!JE133)","v":""},{"$f":"IF('[3]Tasa de Falla'!JF133=0,\"\",'[3]Tasa de Falla'!JF133)","v":""},{"$f":"IF('[3]Tasa de Falla'!JG133=0,\"\",'[3]Tasa de Falla'!JG133)","v":""}]
[null,null,{"$f":"'[3]Tasa de Falla'!C134","v":117},{"$f":"'[3]Tasa de Falla'!D134","v":"SENDA HACHADA - TARTAGAL 132 1"},{"$f":"'[3]Tasa de Falla'!E134","v":132},{"$f":"'[3]Tasa de Falla'!F134","v":58.5},{"$f":"IF('[3]Tasa de Falla'!IV134=0,\"\",'[3]Tasa de Falla'!IV134)","v":""},{"$f":"IF('[3]Tasa de Falla'!IW134=0,\"\",'[3]Tasa de Falla'!IW134)","v":""},{"$f":"IF('[3]Tasa de Falla'!IX134=0,\"\",'[3]Tasa de Falla'!IX134)","v":""},{"$f":"IF('[3]Tasa de Falla'!IY134=0,\"\",'[3]Tasa de Falla'!IY134)","v":""},{"$f":"IF('[3]Tasa de Falla'!IZ134=0,\"\",'[3]Tasa de Falla'!IZ134)","v":""},{"$f":"IF('[3]Tasa de Falla'!JA134=0,\"\",'[3]Tasa de Falla'!JA134)","v":""},{"$f":"IF('[3]Tasa de Falla'!JB134=0,\"\",'[3]Tasa de Falla'!JB134)","v":""},{"$f":"IF('[3]Tasa de Falla'!JC134=0,\"\",'[3]Tasa de Falla'!JC134)","v":""},{"$f":"IF('[3]Tasa de Falla'!JD134=0,\"\",'[3]Tasa de Falla'!JD134)","v":""},{"$f":"IF('[3]Tasa de Falla'!JE134=0,\"\",'[3]Tasa de Falla'!JE134)","v":""},{"$f":"IF('[3]Tasa de Falla'!JF134=0,\"\",'[3]Tasa de Falla'!JF134)","v":""},{"$f":"IF('[3]Tasa de Falla'!JG134=0,\"\",'[3]Tasa de Falla'!JG134)","v":3}]
[null,null,{"$f":"'[3]Tasa de Falla'!C135","v":118},{"$f":"'[3]Tasa de Falla'!D135","v":"ESTATICA - INDEPENDENCIA.TUC. 132 2"},{"$f":"'[3]Tasa de Falla'!E135","v":132},{"$f":"'[3]Tasa de Falla'!F135","v":3.1},{"$f":"IF('[3]Tasa de Falla'!IV135=0,\"\",'[3]Tasa de Falla'!IV135)","v":"XXXX"},{"$f":"IF('[3]Tasa de Falla'!IW135=0,\"\",'[3]Tasa de Falla'!IW135)","v":"XXXX"},{"$f":"IF('[3]Tasa de Falla'!IX135=0,\"\",'[3]Tasa de Falla'!IX135)","v":""},{"$f":"IF('[3]Tasa de Falla'!IY135=0,\"\",'[3]Tasa de Falla'!IY135)","v":""},{"$f":"IF('[3]Tasa de Falla'!IZ135=0,\"\",'[3]Tasa de Falla'!IZ135)","v":1},{"$f":"IF('[3]Tasa de Falla'!JA135=0,\"\",'[3]Tasa de Falla'!JA135)","v":""},{"$f":"IF('[3]Tasa de Falla'!JB135=0,\"\",'[3]Tasa de Falla'!JB135)","v":""},{"$f":"IF('[3]Tasa de Falla'!JC135=0,\"\",'[3]Tasa de Falla'!JC135)","v":""},{"$f":"IF('[3]Tasa de Falla'!JD135=0,\"\",'[3]Tasa de Falla'!JD135)","v":""},{"$f":"IF('[3]Tasa de Falla'!JE135=0,\"\",'[3]Tasa de Falla'!JE135)","v":""},{"$f":"IF('[3]Tasa de Falla'!JF135=0,\"\",'[3]Tasa de Falla'!JF135)","v":""},{"$f":"IF('[3]Tasa de Falla'!JG135=0,\"\",'[3]Tasa de Falla'!JG135)","v":""}]
[null,null,{"$f":"'[3]Tasa de Falla'!C136","v":119},{"$f":"'[3]Tasa de Falla'!D136","v":"SENDA HACHADA - DRAGONES 132 1"},{"$f":"'[3]Tasa de Falla'!E136","v":132},{"$f":"'[3]Tasa de Falla'!F136","v":65},{"$f":"IF('[3]Tasa de Falla'!IV136=0,\"\",'[3]Tasa de Falla'!IV136)","v":"XXXX"},{"$f":"IF('[3]Tasa de Falla'!IW136=0,\"\",'[3]Tasa de Falla'!IW136)","v":"XXXX"},{"$f":"IF('[3]Tasa de Falla'!IX136=0,\"\",'[3]Tasa de Falla'!IX136)","v":"XXXX"},{"$f":"IF('[3]Tasa de Falla'!IY136=0,\"\",'[3]Tasa de Falla'!IY136)","v":"XXXX"},{"$f":"IF('[3]Tasa de Falla'!IZ136=0,\"\",'[3]Tasa de Falla'!IZ136)","v":"XXXX"},{"$f":"IF('[3]Tasa de Falla'!JA136=0,\"\",'[3]Tasa de Falla'!JA136)","v":"XXXX"},{"$f":"IF('[3]Tasa de Falla'!JB136=0,\"\",'[3]Tasa de Falla'!JB136)","v":"XXXX"},{"$f":"IF('[3]Tasa de Falla'!JC136=0,\"\",'[3]Tasa de Falla'!JC136)","v":"XXXX"},{"$f":"IF('[3]Tasa de Falla'!JD136=0,\"\",'[3]Tasa de Falla'!JD136)","v":"XXXX"},{"$f":"IF('[3]Tasa de Falla'!JE136=0,\"\",'[3]Tasa de Falla'!JE136)","v":"XXXX"},{"$f":"IF('[3]Tasa de Falla'!JF136=0,\"\",'[3]Tasa de Falla'!JF136)","v":"XXXX"},{"$f":"IF('[3]Tasa de Falla'!JG136=0,\"\",'[3]Tasa de Falla'!JG136)","v":"XXXX"}]
[null,null,{"$f":"'[3]Tasa de Falla'!C137","v":120},{"$f":"'[3]Tasa de Falla'!D137","v":"COBOS - SALTA ESTE 132 1"},{"$f":"'[3]Tasa de Falla'!E137","v":132},{"$f":"'[3]Tasa de Falla'!F137","v":45.6},{"$f":"IF('[3]Tasa de Falla'!IV137=0,\"\",'[3]Tasa de Falla'!IV137)","v":"XXXX"},{"$f":"IF('[3]Tasa de Falla'!IW137=0,\"\",'[3]Tasa de Falla'!IW137)","v":"XXXX"},{"$f":"IF('[3]Tasa de Falla'!IX137=0,\"\",'[3]Tasa de Falla'!IX137)","v":""},{"$f":"IF('[3]Tasa de Falla'!IY137=0,\"\",'[3]Tasa de Falla'!IY137)","v":1},{"$f":"IF('[3]Tasa de Falla'!IZ137=0,\"\",'[3]Tasa de Falla'!IZ137)","v":""},{"$f":"IF('[3]Tasa de Falla'!JA137=0,\"\",'[3]Tasa de Falla'!JA137)","v":""},{"$f":"IF('[3]Tasa de Falla'!JB137=0,\"\",'[3]Tasa de Falla'!JB137)","v":""},{"$f":"IF('[3]Tasa de Falla'!JC137=0,\"\",'[3]Tasa de Falla'!JC137)","v":""},{"$f":"IF('[3]Tasa de Falla'!JD137=0,\"\",'[3]Tasa de Falla'!JD137)","v":""},{"$f":"IF('[3]Tasa de Falla'!JE137=0,\"\",'[3]Tasa de Falla'!JE137)","v":""},{"$f":"IF('[3]Tasa de Falla'!JF137=0,\"\",'[3]Tasa de Falla'!JF137)","v":""},{"$f":"IF('[3]Tasa de Falla'!JG137=0,\"\",'[3]Tasa de Falla'!JG137)","v":1}]
[null,null,{"$f":"'[3]Tasa de Falla'!C138","v":121},{"$f":"'[3]Tasa de Falla'!D138","v":"SANTIAGO - SANTIAGO SUR "},{"$f":"'[3]Tasa de Falla'!E138","v":132},{"$f":"'[3]Tasa de Falla'!F138","v":8.4},{"$f":"IF('[3]Tasa de Falla'!IV138=0,\"\",'[3]Tasa de Falla'!IV138)","v":"XXXX"},{"$f":"IF('[3]Tasa de Falla'!IW138=0,\"\",'[3]Tasa de Falla'!IW138)","v":"XXXX"},{"$f":"IF('[3]Tasa de Falla'!IX138=0,\"\",'[3]Tasa de Falla'!IX138)","v":"XXXX"},{"$f":"IF('[3]Tasa de Falla'!IY138=0,\"\",'[3]Tasa de Falla'!IY138)","v":""},{"$f":"IF('[3]Tasa de Falla'!IZ138=0,\"\",'[3]Tasa de Falla'!IZ138)","v":""},{"$f":"IF('[3]Tasa de Falla'!JA138=0,\"\",'[3]Tasa de Falla'!JA138)","v":""},{"$f":"IF('[3]Tasa de Falla'!JB138=0,\"\",'[3]Tasa de Falla'!JB138)","v":""},{"$f":"IF('[3]Tasa de Falla'!JC138=0,\"\",'[3]Tasa de Falla'!JC138)","v":1},{"$f":"IF('[3]Tasa de Falla'!JD138=0,\"\",'[3]Tasa de Falla'!JD138)","v":""},{"$f":"IF('[3]Tasa de Falla'!JE138=0,\"\",'[3]Tasa de Falla'!JE138)","v":""},{"$f":"IF('[3]Tasa de Falla'!JF138=0,\"\",'[3]Tasa de Falla'!JF138)","v":1},{"$f":"IF('[3]Tasa de Falla'!JG138=0,\"\",'[3]Tasa de Falla'!JG138)","v":""}]
[null,null,{"$f":"'[3]Tasa de Falla'!C139","v":122},{"$f":"'[3]Tasa de Falla'!D139","v":"SANTIAGO OESTE - SANTIAGO"},{"$f":"'[3]Tasa de Falla'!E139","v":132},{"$f":"'[3]Tasa de Falla'!F139","v":8.4},{"$f":"IF('[3]Tasa de Falla'!IV139=0,\"\",'[3]Tasa de Falla'!IV139)","v":"XXXX"},{"$f":"IF('[3]Tasa de Falla'!IW139=0,\"\",'[3]Tasa de Falla'!IW139)","v":"XXXX"},{"$f":"IF('[3]Tasa de Falla'!IX139=0,\"\",'[3]Tasa de Falla'!IX139)","v":"XXXX"},{"$f":"IF('[3]Tasa de Falla'!IY139=0,\"\",'[3]Tasa de Falla'!IY139)","v":"XXXX"},{"$f":"IF('[3]Tasa de Falla'!IZ139=0,\"\",'[3]Tasa de Falla'!IZ139)","v":"XXXX"},{"$f":"IF('[3]Tasa de Falla'!JA139=0,\"\",'[3]Tasa de Falla'!JA139)","v":"XXXX"},{"$f":"IF('[3]Tasa de Falla'!JB139=0,\"\",'[3]Tasa de Falla'!JB139)","v":"XXXX"},{"$f":"IF('[3]Tasa de Falla'!JC139=0,\"\",'[3]Tasa de Falla'!JC139)","v":"XXXX"},{"$f":"IF('[3]Tasa de Falla'!JD139=0,\"\",'[3]Tasa de Falla'!JD139)","v":"XXXX"},{"$f":"IF('[3]Tasa de Falla'!JE139=0,\"\",'[3]Tasa de Falla'!JE139)","v":"XXXX"},{"$f":"IF('[3]Tasa de Falla'!JF139=0,\"\",'[3]Tasa de Falla'!JF139)","v":"XXXX"},{"$f":"IF('[3]Tasa de Falla'!JG139=0,\"\",'[3]Tasa de Falla'!JG139)","v":"XXXX"}]
[null,null,{"$f":"'[3]Tasa de Falla'!C140","v":123},{"$f":"'[3]Tasa de Falla'!D140","v":"LA BANDA - MISQUI MAYU II - SANTIAGO ESTE"},{"$f":"'[3]Tasa de Falla'!E140","v":132},{"$f":"'[3]Tasa de Falla'!F140","v":4.92},{"$f":"IF('[3]Tasa de Falla'!IV140=0,\"\",'[3]Tasa de Falla'!IV140)","v":"XXXX"},{"$f":"IF('[3]Tasa de Falla'!IW140=0,\"\",'[3]Tasa de Falla'!IW140)","v":"XXXX"},{"$f":"IF('[3]Tasa de Falla'!IX140=0,\"\",'[3]Tasa de Falla'!IX140)","v":"XXXX"},{"$f":"IF('[3]Tasa de Falla'!IY140=0,\"\",'[3]Tasa de Falla'!IY140)","v":""},{"$f":"IF('[3]Tasa de Falla'!IZ140=0,\"\",'[3]Tasa de Falla'!IZ140)","v":""},{"$f":"IF('[3]Tasa de Falla'!JA140=0,\"\",'[3]Tasa de Falla'!JA140)","v":""},{"$f":"IF('[3]Tasa de Falla'!JB140=0,\"\",'[3]Tasa de Falla'!JB140)","v":1},{"$f":"IF('[3]Tasa de Falla'!JC140=0,\"\",'[3]Tasa de Falla'!JC140)","v":""},{"$f":"IF('[3]Tasa de Falla'!JD140=0,\"\",'[3]Tasa de Falla'!JD140)","v":""},{"$f":"IF('[3]Tasa de Falla'!JE140=0,\"\",'[3]Tasa de Falla'!JE140)","v":""},{"$f":"IF('[3]Tasa de Falla'!JF140=0,\"\",'[3]Tasa de Falla'!JF140)","v":1},{"$f":"IF('[3]Tasa de Falla'!JG140=0,\"\",'[3]Tasa de Falla'!JG140)","v":""}]
[null,null,{"$f":"'[3]Tasa de Falla'!C141","v":124},{"$f":"'[3]Tasa de Falla'!D141","v":"CABRA CORRAL - GUACHIPAS - PAMPA GRANDE"},{"$f":"'[3]Tasa de Falla'!E141","v":132},{"$f":"'[3]Tasa de Falla'!F141","v":72.099999999999994},{"$f":"IF('[3]Tasa de Falla'!IV141=0,\"\",'[3]Tasa de Falla'!IV141)","v":"XXXX"},{"$f":"IF('[3]Tasa de Falla'!IW141=0,\"\",'[3]Tasa de Falla'!IW141)","v":"XXXX"},{"$f":"IF('[3]Tasa de Falla'!IX141=0,\"\",'[3]Tasa de Falla'!IX141)","v":"XXXX"},{"$f":"IF('[3]Tasa de Falla'!IY141=0,\"\",'[3]Tasa de Falla'!IY141)","v":"XXXX"},{"$f":"IF('[3]Tasa de Falla'!IZ141=0,\"\",'[3]Tasa de Falla'!IZ141)","v":"XXXX"},{"$f":"IF('[3]Tasa de Falla'!JA141=0,\"\",'[3]Tasa de Falla'!JA141)","v":"XXXX"},{"$f":"IF('[3]Tasa de Falla'!JB141=0,\"\",'[3]Tasa de Falla'!JB141)","v":"XXXX"},{"$f":"IF('[3]Tasa de Falla'!JC141=0,\"\",'[3]Tasa de Falla'!JC141)","v":"XXXX"},{"$f":"IF('[3]Tasa de Falla'!JD141=0,\"\",'[3]Tasa de Falla'!JD141)","v":1},{"$f":"IF('[3]Tasa de Falla'!JE141=0,\"\",'[3]Tasa de Falla'!JE141)","v":2},{"$f":"IF('[3]Tasa de Falla'!JF141=0,\"\",'[3]Tasa de Falla'!JF141)","v":8},{"$f":"IF('[3]Tasa de Falla'!JG141=0,\"\",'[3]Tasa de Falla'!JG141)","v":2}]
[null,null,{"$f":"'[3]Tasa de Falla'!C142","v":125},{"$f":"'[3]Tasa de Falla'!D142","v":"EL TABACAL - PI. TABACAL II - ORAN"},{"$f":"'[3]Tasa de Falla'!E142","v":132},{"$f":"'[3]Tasa de Falla'!F142","v":12.04},{"$f":"IF('[3]Tasa de Falla'!IV142=0,\"\",'[3]Tasa de Falla'!IV142)","v":"XXXX"},{"$f":"IF('[3]Tasa de Falla'!IW142=0,\"\",'[3]Tasa de Falla'!IW142)","v":"XXXX"},{"$f":"IF('[3]Tasa de Falla'!IX142=0,\"\",'[3]Tasa de Falla'!IX142)","v":"XXXX"},{"$f":"IF('[3]Tasa de Falla'!IY142=0,\"\",'[3]Tasa de Falla'!IY142)","v":"XXXX"},{"$f":"IF('[3]Tasa de Falla'!IZ142=0,\"\",'[3]Tasa de Falla'!IZ142)","v":"XXXX"},{"$f":"IF('[3]Tasa de Falla'!JA142=0,\"\",'[3]Tasa de Falla'!JA142)","v":"XXXX"},{"$f":"IF('[3]Tasa de Falla'!JB142=0,\"\",'[3]Tasa de Falla'!JB142)","v":"XXXX"},{"$f":"IF('[3]Tasa de Falla'!JC142=0,\"\",'[3]Tasa de Falla'!JC142)","v":"XXXX"},{"$f":"IF('[3]Tasa de Falla'!JD142=0,\"\",'[3]Tasa de Falla'!JD142)","v":1},{"$f":"IF('[3]Tasa de Falla'!JE142=0,\"\",'[3]Tasa de Falla'!JE142)","v":1},{"$f":"IF('[3]Tasa de Falla'!JF142=0,\"\",'[3]Tasa de Falla'!JF142)","v":1},{"$f":"IF('[3]Tasa de Falla'!JG142=0,\"\",'[3]Tasa de Falla'!JG142)","v":1}]
[null,null,{"$f":"'[3]Tasa de Falla'!C143","v":126},{"$f":"'[3]Tasa de Falla'!D143","v":"GUEMES - CAMPO SANTO - MINETTI"},{"$f":"'[3]Tasa de Falla'!E143","v":132},{"$f":"'[3]Tasa de Falla'!F143","v":41.8},{"$f":"IF('[3]Tasa de Falla'!IV143=0,\"\",'[3]Tasa de Falla'!IV143)","v":""},{"$f":"IF('[3]Tasa de Falla'!IW143=0,\"\",'[3]Tasa de Falla'!IW143)","v":2},{"$f":"IF('[3]Tasa de Falla'!IX143=0,\"\",'[3]Tasa de Falla'!IX143)","v":3},{"$f":"IF('[3]Tasa de Falla'!IY143=0,\"\",'[3]Tasa de Falla'!IY143)","v":""},{"$f":"IF('[3]Tasa de Falla'!IZ143=0,\"\",'[3]Tasa de Falla'!IZ143)","v":""},{"$f":"IF('[3]Tasa de Falla'!JA143=0,\"\",'[3]Tasa de Falla'!JA143)","v":1},{"$f":"IF('[3]Tasa de Falla'!JB143=0,\"\",'[3]Tasa de Falla'!JB143)","v":1},{"$f":"IF('[3]Tasa de Falla'!JC143=0,\"\",'[3]Tasa de Falla'!JC143)","v":""},{"$f":"IF('[3]Tasa de Falla'!JD143=0,\"\",'[3]Tasa de Falla'!JD143)","v":""},{"$f":"IF('[3]Tasa de Falla'!JE143=0,\"\",'[3]Tasa de Falla'!JE143)","v":""},{"$f":"IF('[3]Tasa de Falla'!JF143=0,\"\",'[3]Tasa de Falla'!JF143)","v":1},{"$f":"IF('[3]Tasa de Falla'!JG143=0,\"\",'[3]Tasa de Falla'!JG143)","v":1}]
[null,null,{"$f":"'[3]Tasa de Falla'!C144","v":127},{"$f":"'[3]Tasa de Falla'!D144","v":"GUEMES - CAMPO SANTO - PARQUE IND."},{"$f":"'[3]Tasa de Falla'!E144","v":132},{"$f":"'[3]Tasa de Falla'!F144","v":38.86},{"$f":"IF('[3]Tasa de Falla'!IV144=0,\"\",'[3]Tasa de Falla'!IV144)","v":""},{"$f":"IF('[3]Tasa de Falla'!IW144=0,\"\",'[3]Tasa de Falla'!IW144)","v":""},{"$f":"IF('[3]Tasa de Falla'!IX144=0,\"\",'[3]Tasa de Falla'!IX144)","v":""},{"$f":"IF('[3]Tasa de Falla'!IY144=0,\"\",'[3]Tasa de Falla'!IY144)","v":""},{"$f":"IF('[3]Tasa de Falla'!IZ144=0,\"\",'[3]Tasa de Falla'!IZ144)","v":""},{"$f":"IF('[3]Tasa de Falla'!JA144=0,\"\",'[3]Tasa de Falla'!JA144)","v":""},{"$f":"IF('[3]Tasa de Falla'!JB144=0,\"\",'[3]Tasa de Falla'!JB144)","v":""},{"$f":"IF('[3]Tasa de Falla'!JC144=0,\"\",'[3]Tasa de Falla'!JC144)","v":""},{"$f":"IF('[3]Tasa de Falla'!JD144=0,\"\",'[3]Tasa de Falla'!JD144)","v":""},{"$f":"IF('[3]Tasa de Falla'!JE144=0,\"\",'[3]Tasa de Falla'!JE144)","v":1},{"$f":"IF('[3]Tasa de Falla'!JF144=0,\"\",'[3]Tasa de Falla'!JF144)","v":""},{"$f":"IF('[3]Tasa de Falla'!JG144=0,\"\",'[3]Tasa de Falla'!JG144)","v":1}]
[null,null,{"$f":"'[3]Tasa de Falla'!C145","v":128},{"$f":"'[3]Tasa de Falla'!D145","v":"SANTIAGO CENTRO - MISQUI MAYU I - SANTIAGO ESTE"},{"$f":"'[3]Tasa de Falla'!E145","v":132},{"$f":"'[3]Tasa de Falla'!F145","v":10.66},{"$f":"IF('[3]Tasa de Falla'!IV145=0,\"\",'[3]Tasa de Falla'!IV145)","v":"XXXX"},{"$f":"IF('[3]Tasa de Falla'!IW145=0,\"\",'[3]Tasa de Falla'!IW145)","v":"XXXX"},{"$f":"IF('[3]Tasa de Falla'!IX145=0,\"\",'[3]Tasa de Falla'!IX145)","v":"XXXX"},{"$f":"IF('[3]Tasa de Falla'!IY145=0,\"\",'[3]Tasa de Falla'!IY145)","v":""},{"$f":"IF('[3]Tasa de Falla'!IZ145=0,\"\",'[3]Tasa de Falla'!IZ145)","v":""},{"$f":"IF('[3]Tasa de Falla'!JA145=0,\"\",'[3]Tasa de Falla'!JA145)","v":""},{"$f":"IF('[3]Tasa de Falla'!JB145=0,\"\",'[3]Tasa de Falla'!JB145)","v":""},{"$f":"IF('[3]Tasa de Falla'!JC145=0,\"\",'[3]Tasa de Falla'!JC145)","v":""},{"$f":"IF('[3]Tasa de Falla'!JD145=0,\"\",'[3]Tasa de Falla'!JD145)","v":""},{"$f":"IF('[3]Tasa de Falla'!JE145=0,\"\",'[3]Tasa de Falla'!JE145)","v":""},{"$f":"IF('[3]Tasa de Falla'!JF145=0,\"\",'[3]Tasa de Falla'!JF145)","v":1},{"$f":"IF('[3]Tasa de Falla'!JG145=0,\"\",'[3]Tasa de Falla'!JG145)","v":""}]
[null,null,{"$f":"'[3]Tasa de Falla'!C146","v":129},{"$f":"'[3]Tasa de Falla'!D146","v":"LA RIOJA SUR - PI. PATQUIA   2"},{"$f":"'[3]Tasa de Falla'!E146","v":132},{"$f":"'[3]Tasa de Falla'!F146","v":40},{"$f":"IF('[3]Tasa de Falla'!IV146=0,\"\",'[3]Tasa de Falla'!IV146)","v":""},{"$f":"IF('[3]Tasa de Falla'!IW146=0,\"\",'[3]Tasa de Falla'!IW146)","v":""},{"$f":"IF('[3]Tasa de Falla'!IX146=0,\"\",'[3]Tasa de Falla'!IX146)","v":""},{"$f":"IF('[3]Tasa de Falla'!IY146=0,\"\",'[3]Tasa de Falla'!IY146)","v":""},{"$f":"IF('[3]Tasa de Falla'!IZ146=0,\"\",'[3]Tasa de Falla'!IZ146)","v":""},{"$f":"IF('[3]Tasa de Falla'!JA146=0,\"\",'[3]Tasa de Falla'!JA146)","v":""},{"$f":"IF('[3]Tasa de Falla'!JB146=0,\"\",'[3]Tasa de Falla'!JB146)","v":""},{"$f":"IF('[3]Tasa de Falla'!JC146=0,\"\",'[3]Tasa de Falla'!JC146)","v":""},{"$f":"IF('[3]Tasa de Falla'!JD146=0,\"\",'[3]Tasa de Falla'!JD146)","v":""},{"$f":"IF('[3]Tasa de Falla'!JE146=0,\"\",'[3]Tasa de Falla'!JE146)","v":""},{"$f":"IF('[3]Tasa de Falla'!JF146=0,\"\",'[3]Tasa de Falla'!JF146)","v":1},{"$f":"IF('[3]Tasa de Falla'!JG146=0,\"\",'[3]Tasa de Falla'!JG146)","v":""}]
[null,null,{"$f":"'[3]Tasa de Falla'!C147","v":130},{"$f":"'[3]Tasa de Falla'!D147","v":"LA RIOJA SUR - PI. CIRCUNVALACION   1"},{"$f":"'[3]Tasa de Falla'!E147","v":132},{"$f":"'[3]Tasa de Falla'!F147","v":41.35},{"$f":"IF('[3]Tasa de Falla'!IV147=0,\"\",'[3]Tasa de Falla'!IV147)","v":""},{"$f":"IF('[3]Tasa de Falla'!IW147=0,\"\",'[3]Tasa de Falla'!IW147)","v":""},{"$f":"IF('[3]Tasa de Falla'!IX147=0,\"\",'[3]Tasa de Falla'!IX147)","v":""},{"$f":"IF('[3]Tasa de Falla'!IY147=0,\"\",'[3]Tasa de Falla'!IY147)","v":""},{"$f":"IF('[3]Tasa de Falla'!IZ147=0,\"\",'[3]Tasa de Falla'!IZ147)","v":""},{"$f":"IF('[3]Tasa de Falla'!JA147=0,\"\",'[3]Tasa de Falla'!JA147)","v":""},{"$f":"IF('[3]Tasa de Falla'!JB147=0,\"\",'[3]Tasa de Falla'!JB147)","v":""},{"$f":"IF('[3]Tasa de Falla'!JC147=0,\"\",'[3]Tasa de Falla'!JC147)","v":""},{"$f":"IF('[3]Tasa de Falla'!JD147=0,\"\",'[3]Tasa de Falla'!JD147)","v":""},{"$f":"IF('[3]Tasa de Falla'!JE147=0,\"\",'[3]Tasa de Falla'!JE147)","v":""},{"$f":"IF('[3]Tasa de Falla'!JF147=0,\"\",'[3]Tasa de Falla'!JF147)","v":""},{"$f":"IF('[3]Tasa de Falla'!JG147=0,\"\",'[3]Tasa de Falla'!JG147)","v":""}]
[]
[null,null,null,null,"Longitud Total    ",{"$f":"SUM(F16:F148)-F19-F21-F22-F26-F27-F37-F39-F40-F43-F44-F47-F48-F49-F53-F60-F65-F78-F82-F96-F101-F111","v":6071.3800000000028}]
[null,null,null,null,null,"Indisponibilidades Forzadas  ",{"$f":"SUM(G17:G148)","v":14},{"$f":"SUM(H17:H148)","v":15},{"$f":"SUM(I17:I148)","v":10},4,11,15,6,9,14,29,32,26]
[null,null,null,null,null,"TASA DE FALLA  ",{"$f":"+'[3]Tasa de Falla'!IV154","v":2.31},{"$f":"+'[3]Tasa de Falla'!IW154","v":2.39},{"$f":"+'[3]Tasa de Falla'!IX154","v":2.4},{"$f":"+'[3]Tasa de Falla'!IY154","v":2.5099999999999998},{"$f":"+'[3]Tasa de Falla'!IZ154","v":2.2599999999999998},{"$f":"+'[3]Tasa de Falla'!JA154","v":2.44},{"$f":"+'[3]Tasa de Falla'!JB154","v":2.61},{"$f":"+'[3]Tasa de Falla'!JC154","v":2.67},{"$f":"+'[3]Tasa de Falla'!JD154","v":2.74},{"$f":"+'[3]Tasa de Falla'!JE154","v":2.68},{"$f":"+'[3]Tasa de Falla'!JF154","v":3.05},{"$f":"+'[3]Tasa de Falla'!JG154","v":3.3},{"$f":"+'[3]Tasa de Falla'!JH154","v":3.57}]
[]
[null,null,"XXX","  Línea no computada en el mes",null,null,null,null,"TASA DE FALLA",null,null,{"$f":"S151","v":3.57},null,"SALIDAS x AÑO / 100 km"]

{"sheet":"DATO","index":9,"n_rows":25,"n_cols":29,"rows_kept":25,"cut":false,"hidden":false,"merged":[]}
["Mes","Mes","Dia","Año"]
["enero","01",31,2006]
["febrero","02",{"$f":"IF(MOD(E14,4)=0,29,28)","v":29},{"$f":"+D2+1","v":2007}]
["marzo","03",31,2008]
["abril","04",30,2009]
["mayo","05",31,2010]
["junio","06",30,2011]
["julio","07",31,2012]
["agosto","08",31,2013]
["septiembre","09",30,2014]
["octubre","10",31,2015]
["noviembre","11",30,2016]
["diciembre","12",31,null,null,null,null,null,"Total"]
[11,3,{"$f":"CELL(\"CONTENIDO\",OFFSET(A1,B14,0))","v":"marzo"},{"$f":"CELL(\"CONTENIDO\",OFFSET(C1,B14,0))","v":31},{"$f":"CELL(\"CONTENIDO\",OFFSET(D1,A14,0))","v":2016},{"$f":"\"Desde el 01 al \" & D14 & \" de \" & C14 & \" de \" & E14","v":"Desde el 01 al 31 de marzo de 2016"},{"$f":"CELL(\"CONTENIDO\",OFFSET(B1,B14,0))","v":"03"},{"$f":"RIGHT(E14,2)","v":"16"},"B14"]
[null,{"$f":"\"\\\\rugor\\files\\Transporte\\Transporte\\AA PROCESO AUT ARCHIVOS J\\TRANSNOA\\\" &E14","v":"\\\\rugor\\files\\Transporte\\Transporte\\AA PROCESO AUT ARCHIVOS J\\TRANSNOA\\2016"},null,null,null,null,{"$f":"\"J\"&G14&H14&\"NOA\"","v":"J0316NOA"}]
[null,{"$f":"\"\\\\rugor\\files\\Transporte\\transporte\\AA PROCESO AUT\\INTERCAMBIO\\\" &H14&G14","v":"\\\\rugor\\files\\Transporte\\transporte\\AA PROCESO AUT\\INTERCAMBIO\\1603"}]
["Hoja","FilaInicio","FilasPlantilla","Columnas","NombreHoja","OrigenDeDatos","Col00","Col01","Col02","Col03","Col04","Col05","Col06","Col07","Col08","Col09","Col10","Col11","Col12","Col13","Col14","Col15","FILHTOTAL","COLHTOTAL","FILHCALC","COLHCALC","FILTRANSP","COLTRANSP","COL TSAL"]
["MODELO L",21,20,11,{"$f":"\"LI-\" & $G$14","v":"LI-03"},"TRANSNOA_INDISPONIBILIDADES_LINEAS_TRANSNOA.XLS",3,5,4,6,7,8,0,10,11,14,0,26,0,0,0,0,19,10,42,27,19,27,14]
["MODELO T",24,20,13,{"$f":"\"T-\" & $G$14","v":"T-03"},"TRANSNOA_INDISPONIBILIDADES_TRAFOS_TRANSNOA.XLS",3,5,4,6,7,8,9,11,12,15,16,18,28,17,0,0,25,10,45,29,22,29,15]
["MODELO S",23,20,10,{"$f":"\"SA-\" & $G$14","v":"SA-03"},"TRANSNOA_INDISPONIBILIDADES_SALIDAS_TRANSNOA.XLS",3,5,4,6,7,8,10,11,14,15,21,0,0,0,0,0,29,10,44,22,21,22,14]
["MODELO L RIOJA",21,20,11,{"$f":"\"LI-RIOJA-\" & $G$14","v":"LI-RIOJA-03"},"TRANSNOA_INDISPONIBILIDADES_LINEAS_RIOJA.XLS",3,5,4,6,7,8,0,10,11,14,2,26,0,0,0,0,21,10,42,27,19,27,14]
["MODELO L EDESA",21,20,11,{"$f":"\"LI-EDESA-\" & $G$14","v":"LI-EDESA-03"},"TRANSNOA_INDISPONIBILIDADES_LINEAS_EDESA.XLS",3,5,4,6,7,8,0,10,11,14,2,26,0,0,0,0,20,10,42,27,19,27,14]
["MODELO T EDESA",24,20,13,{"$f":"\"T-EDESA-\" & $G$14","v":"T-EDESA-03"},"TRANSNOA_INDISPONIBILIDADES_TRAFOS_EDESA.XLS",3,5,4,6,7,8,9,11,12,15,16,18,28,17,0,0,26,10,45,29,22,29,15]
["MODELO S EDESA",23,20,10,{"$f":"\"SA-EDESA-\" & $G$14","v":"SA-EDESA-03"},"TRANSNOA_INDISPONIBILIDADES_SALIDAS_EDESA.XLS",3,5,4,6,7,8,10,11,14,15,21,0,0,0,0,0,30,10,44,22,21,22,14]
["MODELO VST",19,24,4,{"$f":"\"CAUSAS-VST-\" & $G$14","v":"CAUSAS-VST-03"},"TRANSNOA_CAUSAS_VST.XLS",3,4,5,6,7,0,0,0,0,0,0,0,0,0,0,0,999,999,0,0,0,0,0]