{"text_format":"1","workbook":"xlsx","n_sheets":11,"sheets":["TOT-0216","LI-02 (1)","LI-02 (2)","LI-02 (3)","LI-EDESA-02 (1)","T-02 (1)","T-02 (2)","T-EDESA-02 (1)","SUP-EDESA","Tasa de Falla","DATO"],"not_rendered":{"charts":0,"images":3,"macros":1,"external_links":2,"defined_names":1,"comments":0,"pivot_tables":0},"unopened":[],"bounds":{"document_bytes":16777216,"sheet_cells":100000,"rows_first":2000,"rows_last":500,"rows_between":2000,"halvings":0,"cell_chars":16384,"cell_head_chars":4096},"cells_cut":0,"cells_raw":0,"read":"whole","date_system":"1900"}

{"sheet":"TOT-0216","index":0,"n_rows":33,"n_cols":10,"rows_kept":33,"cut":false,"hidden":false,"merged":[]}
[]
[null,"ANEXO V al  Memorandum  D.T.E.E. N°        356    / 2016"]
[]
["ENTE NACIONAL REGULADOR "]
["DE LA ELECTRICIDAD"]
[]
[null,"SISTEMA DE TRANSPORTE DE ENERGÍA ELÉCTRICA POR DISTRIBUCIÓN TRONCAL"]
[]
[null,"TRANSNOA S.A."]
[]
[null,"TOTAL DE PENALIZACIONES"]
[]
[null,1]
[null,"Desde el 01 al 29 de Febrero de 2016"]
[]
[null,"Sanciones duplicadas por tasa de falla > 4 Sal. x año/100km."]
[]
[null,null,"1.-","LÍNEAS"]
[null,null,null,"1.1.-","Equipamiento propio",null,null,null,null,{"$f":"'LI-02 (3)'!AA40","v":400414.81}]
[null,null,null,"1.2.-","Equipamiento del T.I. EDESA S.A.",null,null,null,null,{"$f":"'LI-EDESA-02 (1)'!AA42","v":5355.89}]
[]
[null,null,"2.-","CONEXIÓN"]
[null,null,null,"2.1.-","Transformación"]
[null,null,null,null,"2.1.1.-","Equipamiento propio",null,null,null,{"$f":"'T-02 (2)'!AC50","v":167962.71}]
[null,null,null,null,"2.1.2.-","Equipamiento del T.I. EDESA S.A.",null,null,null,{"$f":"'T-EDESA-02 (1)'!AC46","v":131.13}]
[]
[]
[null,null,"3.1.-","SUPERVISIÓN del T.I. EDESA S.A.",null,null,null,null,null,{"$f":"'SUP-EDESA'!I54","v":1591.6518013059906}]
[]
[]
[null,null,null,null,null,null,"TOTAL ",{"$f":"SUM(J18:J29)","v":575456.19180130598}]
[]
[null,null,"Valores remuneratorios según Acuerdo SE - ENRE -TRANSNOA 2016-2017"]

{"sheet":"LI-02 (1)","index":1,"n_rows":39,"n_cols":27,"rows_kept":39,"cut":false,"hidden":false,"merged":[]}
[]
[null,{"$f":"+'TOT-0216'!B2","v":"ANEXO V al  Memorandum  D.T.E.E. N°        356    / 2016"}]
[]
[" ENTE NACIONAL REGULADOR "]
["       DE LA ELECTRICIDAD"]
[]
[]
[null,null,null,null,null,"SISTEMA DE TRANSPORTE DE ENERGÍA ELÉCTRICA POR DISTRIBUCIÓN TRONCAL - TRANSNOA S.A."]
[]
[null,null,null,null,null,"1.- LÍNEAS"]
[]
[null,null,null,null,null,"1.1.- Equipamiento propio"]
[]
[null,{"$f":"'TOT-0216'!B14","v":"Desde el 01 al 29 de Febrero de 2016"}]
[]
[null,null,null,null,null,"$/100 km-h : LINEAS 132 kV ",514.20399999999995,null,null,null,"FACTOR DE PENALIZACION  K =",{"$f":"30*'TOT-0216'!B13","v":30},{"$f":"IF(L16=30,\" \",IF(L16=60,\"Coeficiente duplicado por tasa de falla >4 Sal. x año/100 km.\",\"REVISAR COEFICIENTE\"))","v":" "}]
[null,null,3,4,5,6,7,8,9,10,11,12,13,14,15,16,17,18,19,20,21,22,23,24,25,26,27]
[null,null,"N°","INDISP","ID EQUIPO","LÍNEAS","U\n[kV]","Long.\n[km]","$/h","Salida","Entrada","Hs. \nIndisp","Minutos\nIndisp.","Tipo \nSal.(²)","C.R.\n%","PENALIZ.\nPROGRAM.","REDUCC.\nPROGRAM.","PENALIZACION FORZADA\nPor Salida    1ras. 3 hs.   hs. Restantes",null,null,"REDUCC. FORZADA\nPor Salida     1ras. 3 hs.     hs. Restantes",null,null,"RESTANTE\nFORZADA","REDUCC.\nRESTANTE","Informó\nen Térm.","TOTAL\nPENALIZAC."]
[]
[]
[null,null,1,298522,5689,"C. CORRAL - GUACHIPAS - PAMPA GRANDE",132,71.2,{"$f":"$G$16/100*IF(H21>25,H21,25)","v":366.113248},"2016-02-01T01:41:00","2016-02-01T01:46:00",{"$f":"IF(F21=\"\",\"\",(K21-J21)*24)","v":8.3333333255723119E-2},{"$f":"IF(F21=\"\",\"\",ROUND((K21-J21)*24*60,0))","v":5},"F",{"$f":"IF(F21=\"\",\"\",\"--\")","v":"--"},{"$f":"IF(N21=\"P\",ROUND(M21/60,2)*I21*$L$16*0.01,\"--\")","v":"--"},{"$f":"IF(N21=\"RP\",I21*O21*ROUND(L21/60,2)*0.01*M21/100,\"--\")","v":"--"},{"$f":"IF(N21=\"F\",I21*$L$16,\"--\")","v":10983.397440000001},{"$f":"IF(AND(M21>10,N21=\"F\"),I21*$L$16*IF(M21>180,3,ROUND((M21)/60,2)),\"--\")","v":"--"},{"$f":"IF(AND(M21>180,N21=\"F\"),(ROUND(M21/60,2)-3)*I21*$L$16*0.1,\"--\")","v":"--"},{"$f":"IF(N21=\"R\",I21*$L$16*O21/100,\"--\")","v":"--"},{"$f":"IF(AND(M21>10,N21=\"R\"),I21*$L$16*O21/100*IF(M21>180,3,ROUND(M21/60,2)),\"--\")","v":"--"},{"$f":"IF(AND(M21>180,N21=\"R\"),(ROUND(M21/60,2)-3)*I21*$L$16*0.1*O21/100,\"--\")","v":"--"},{"$f":"IF(N21=\"RF\",ROUND(M21/60,2)*I21*$L$16*0.1,\"--\")","v":"--"},{"$f":"IF(N21=\"RR\",ROUND(M21/60,2)*I21*$L$16*0.1*O21/100,\"--\")","v":"--"},"SI",{"$f":"IF(F21=\"\",\"\",SUM(P21:Y21)*IF(Z21=\"SI\",1,2))","v":10983.397440000001}]
[null,null,2,298526,5689,"C. CORRAL - GUACHIPAS - PAMPA GRANDE",132,71.2,366.113248,"2016-02-01T11:44:00","2016-02-01T11:47:00",4.9999999988358468E-2,3,"F","--","--","--",10983.397440000001,"--","--","--","--","--","--","--","SI",10983.397440000001]
[null,null,3,298527,3565,"CABRA CORRAL - SALTA ESTE",132,55,282.81219999999996,"2016-02-01T20:48:00","2016-02-01T20:56:00",0.13333333324408159,8,"F","--","--","--",8484.3659999999982,"--","--","--","--","--","--","--","SI",8484.3659999999982]
[null,null,4,298528,5564,"LA BANDA - SANTIAGO ESTE",132,4.92,128.55099999999999,"2016-02-02T07:35:00","2016-02-02T15:27:00",7.8666666668141261,472,"P","--",303.50891099999996,"--","--","--","--","--","--","--","--","--","SI",303.50891099999996]
[null,null,5,298530,290,"LA RIOJA - RECREO 1",132,221,1136.39084,"2016-02-02T22:23:00","2016-02-02T23:05:00",0.70000000001164153,42,"F","--","--","--",34091.725200000001,23864.207640000001,"--","--","--","--","--","--","SI",57955.932840000001]
[null,null,6,298533,5564,"LA BANDA - SANTIAGO ESTE",132,4.92,128.55099999999999,"2016-02-03T07:39:00","2016-02-03T16:28:00",8.8166666667675599,529,"P","--",340.14594599999998,"--","--","--","--","--","--","--","--","--","SI",340.14594599999998]
[null,null,7,298534,5565,"SANTIAGO CENTRO - SANTIAGO ESTE",132,10.66,128.55099999999999,"2016-02-04T07:34:00","2016-02-04T15:20:00",7.7666666666627862,466,"P","--",299.65238099999993,"--","--","--","--","--","--","--","--","--","SI",299.65238099999993]
[null,null,8,298540,5565,"SANTIAGO CENTRO - SANTIAGO ESTE",132,10.66,128.55099999999999,"2016-02-05T07:33:00","2016-02-05T15:09:00",7.5999999999767169,456,"P","--",293.09627999999992,"--","--","--","--","--","--","--","--","--","SI",293.09627999999992]
[null,null,9,298544,290,"LA RIOJA - RECREO 1",132,221,1136.39084,"2016-02-07T07:21:00","2016-02-07T07:26:00",8.3333333255723119E-2,5,"F","--","--","--",34091.725200000001,"--","--","--","--","--","--","--","SI",34091.725200000001]
[null,null,10,298953,5608,"COBOS - SALTA ESTE",132,45.6,234.477024,"2016-02-08T13:55:00","2016-02-08T13:58:00",{"$f":"IF(F30=\"\",\"\",(K30-J30)*24)","v":4.9999999988358468E-2},{"$f":"IF(F30=\"\",\"\",ROUND((K30-J30)*24*60,0))","v":3},"F","--","--","--",7034.3107200000004,"--","--","--","--","--","--","--","SI",7034.3107200000004]
[null,null,11,298964,299,"SAN JUANCITO - PALPALA",132,23.9,128.55099999999999,"2016-02-09T01:07:00","2016-02-09T16:52:00",15.75,945,"F","--","--","--",3856.5299999999997,11569.59,4917.07575,"--","--","--","--","--","SI",20343.195749999999]
[null,null,12,298982,2691,"LOS PIZARROS - ESCABA",132,21.399999618530273,128.55099999999999,"2016-02-13T06:54:00","2016-02-13T06:57:00",4.9999999988358468E-2,3,"F","--","--","--",3856.5299999999997,"--","--","--","--","--","--","--","SI",3856.5299999999997]
[null,null,13,298986,5443,"NONOGASTA - VILLA UNIÓN",132,82.1,422.16148399999997,"2016-02-13T12:07:00","2016-02-13T12:12:00",8.3333333255723119E-2,5,"F","--","--","--",12664.844519999999,"--","--","--","--","--","--","--","SI",12664.844519999999]
[null,null,14,298987,312,"C.H. PUEBLO VIEJO - VILLA QUINTEROS",132,24.5,128.55099999999999,"2016-02-13T13:12:00","2016-02-13T19:19:00",{"$f":"IF(F34=\"\",\"\",(K34-J34)*24)","v":6.1166666665230878},{"$f":"IF(F34=\"\",\"\",ROUND((K34-J34)*24*60,0))","v":367},"F",{"$f":"IF(F34=\"\",\"\",\"--\")","v":"--"},{"$f":"IF(N34=\"P\",ROUND(M34/60,2)*I34*$L$16*0.01,\"--\")","v":"--"},{"$f":"IF(N34=\"RP\",I34*O34*ROUND(L34/60,2)*0.01*M34/100,\"--\")","v":"--"},{"$f":"IF(N34=\"F\",I34*$L$16,\"--\")","v":3856.5299999999997},{"$f":"IF(AND(M34>10,N34=\"F\"),I34*$L$16*IF(M34>180,3,ROUND((M34)/60,2)),\"--\")","v":11569.59},{"$f":"IF(AND(M34>180,N34=\"F\"),(ROUND(M34/60,2)-3)*I34*$L$16*0.1,\"--\")","v":1203.2373599999999},{"$f":"IF(N34=\"R\",I34*$L$16*O34/100,\"--\")","v":"--"},{"$f":"IF(AND(M34>10,N34=\"R\"),I34*$L$16*O34/100*IF(M34>180,3,ROUND(M34/60,2)),\"--\")","v":"--"},{"$f":"IF(AND(M34>180,N34=\"R\"),(ROUND(M34/60,2)-3)*I34*$L$16*0.1*O34/100,\"--\")","v":"--"},{"$f":"IF(N34=\"RF\",ROUND(M34/60,2)*I34*$L$16*0.1,\"--\")","v":"--"},{"$f":"IF(N34=\"RR\",ROUND(M34/60,2)*I34*$L$16*0.1*O34/100,\"--\")","v":"--"},"SI",{"$f":"IF(F34=\"\",\"\",SUM(P34:Y34)*IF(Z34=\"SI\",1,2))","v":16629.357359999998}]
[null,null,15,298997,4811,"ROSARIO DE LA FRONTERA - COBOS",132,130.4,670.52201600000001,"2016-02-14T07:24:00","2016-02-14T07:31:00",{"$f":"IF(F35=\"\",\"\",(K35-J35)*24)","v":0.11666666669771075},{"$f":"IF(F35=\"\",\"\",ROUND((K35-J35)*24*60,0))","v":7},"F",{"$f":"IF(F35=\"\",\"\",\"--\")","v":"--"},{"$f":"IF(N35=\"P\",ROUND(M35/60,2)*I35*$L$16*0.01,\"--\")","v":"--"},{"$f":"IF(N35=\"RP\",I35*O35*ROUND(L35/60,2)*0.01*M35/100,\"--\")","v":"--"},{"$f":"IF(N35=\"F\",I35*$L$16,\"--\")","v":20115.660479999999},{"$f":"IF(AND(M35>10,N35=\"F\"),I35*$L$16*IF(M35>180,3,ROUND((M35)/60,2)),\"--\")","v":"--"},{"$f":"IF(AND(M35>180,N35=\"F\"),(ROUND(M35/60,2)-3)*I35*$L$16*0.1,\"--\")","v":"--"},{"$f":"IF(N35=\"R\",I35*$L$16*O35/100,\"--\")","v":"--"},{"$f":"IF(AND(M35>10,N35=\"R\"),I35*$L$16*O35/100*IF(M35>180,3,ROUND(M35/60,2)),\"--\")","v":"--"},{"$f":"IF(AND(M35>180,N35=\"R\"),(ROUND(M35/60,2)-3)*I35*$L$16*0.1*O35/100,\"--\")","v":"--"},{"$f":"IF(N35=\"RF\",ROUND(M35/60,2)*I35*$L$16*0.1,\"--\")","v":"--"},{"$f":"IF(N35=\"RR\",ROUND(M35/60,2)*I35*$L$16*0.1*O35/100,\"--\")","v":"--"},"SI",{"$f":"IF(F35=\"\",\"\",SUM(P35:Y35)*IF(Z35=\"SI\",1,2))","v":20115.660479999999}]
[null,null,16,299053,4250,"TRANCAS - PAMPA GRANDE",132,55,282.81219999999996,"2016-02-15T14:12:00","2016-02-15T14:15:00",{"$f":"IF(F36=\"\",\"\",(K36-J36)*24)","v":4.9999999988358468E-2},{"$f":"IF(F36=\"\",\"\",ROUND((K36-J36)*24*60,0))","v":3},"F",{"$f":"IF(F36=\"\",\"\",\"--\")","v":"--"},{"$f":"IF(N36=\"P\",ROUND(M36/60,2)*I36*$L$16*0.01,\"--\")","v":"--"},{"$f":"IF(N36=\"RP\",I36*O36*ROUND(L36/60,2)*0.01*M36/100,\"--\")","v":"--"},{"$f":"IF(N36=\"F\",I36*$L$16,\"--\")","v":8484.3659999999982},{"$f":"IF(AND(M36>10,N36=\"F\"),I36*$L$16*IF(M36>180,3,ROUND((M36)/60,2)),\"--\")","v":"--"},{"$f":"IF(AND(M36>180,N36=\"F\"),(ROUND(M36/60,2)-3)*I36*$L$16*0.1,\"--\")","v":"--"},{"$f":"IF(N36=\"R\",I36*$L$16*O36/100,\"--\")","v":"--"},{"$f":"IF(AND(M36>10,N36=\"R\"),I36*$L$16*O36/100*IF(M36>180,3,ROUND(M36/60,2)),\"--\")","v":"--"},{"$f":"IF(AND(M36>180,N36=\"R\"),(ROUND(M36/60,2)-3)*I36*$L$16*0.1*O36/100,\"--\")","v":"--"},{"$f":"IF(N36=\"RF\",ROUND(M36/60,2)*I36*$L$16*0.1,\"--\")","v":"--"},{"$f":"IF(N36=\"RR\",ROUND(M36/60,2)*I36*$L$16*0.1*O36/100,\"--\")","v":"--"},"SI",{"$f":"IF(F36=\"\",\"\",SUM(P36:Y36)*IF(Z36=\"SI\",1,2))","v":8484.3659999999982}]
[]
[]
[null,null,"(²)","P - PROGRAMADA  ; F - FORZADA",null,null,null,null,null,null,null,null,null,null,null,{"$f":"SUM(P19:P38)","v":1236.4035179999998},0,158503.383,47003.387640000001,6120.3131100000001,0,0,0,0,0,null,{"$f":"ROUND(SUM(AA19:AA38),2)","v":212863.49}]

{"sheet":"LI-02 (2)","index":2,"n_rows":41,"n_cols":27,"rows_kept":41,"cut":false,"hidden":false,"merged":[]}
[]
[null,{"$f":"+'TOT-0216'!B2","v":"ANEXO V al  Memorandum  D.T.E.E. N°        356    / 2016"}]
[]
[" ENTE NACIONAL REGULADOR "]
["       DE LA ELECTRICIDAD"]
[]
[]
[null,null,null,null,null,"SISTEMA DE TRANSPORTE DE ENERGÍA ELÉCTRICA POR DISTRIBUCIÓN TRONCAL - TRANSNOA S.A."]
[]
[null,null,null,null,null,"1.- LÍNEAS"]
[]
[null,null,null,null,null,"1.1.- Equipamiento propio"]
[]
[null,{"$f":"'TOT-0216'!B14","v":"Desde el 01 al 29 de Febrero de 2016"}]
[]
[null,null,null,null,null,"$/100 km-h : LINEAS 132 kV ",514.20399999999995,null,null,null,"FACTOR DE PENALIZACION  K =",{"$f":"30*'TOT-0216'!B13","v":30},{"$f":"IF(L16=30,\" \",IF(L16=60,\"Coeficiente duplicado por tasa de falla >4 Sal. x año/100 km.\",\"REVISAR COEFICIENTE\"))","v":" "}]
[null,null,3,4,5,6,7,8,9,10,11,12,13,14,15,16,17,18,19,20,21,22,23,24,25,26,27]
[null,null,"N°","INDISP","ID EQUIPO","LÍNEAS","U\n[kV]","Long.\n[km]","$/h","Salida","Entrada","Hs. \nIndisp","Minutos\nIndisp.","Tipo \nSal.(²)","C.R.\n%","PENALIZ.\nPROGRAM.","REDUCC.\nPROGRAM.","PENALIZACION FORZADA\nPor Salida    1ras. 3 hs.   hs. Restantes",null,null,"REDUCC. FORZADA\nPor Salida     1ras. 3 hs.     hs. Restantes",null,null,"RESTANTE\nFORZADA","REDUCC.\nRESTANTE","Informó\nen Térm.","TOTAL\nPENALIZAC."]
[null,null,null,null,null,null,null,null,null,null,null,null,null,null,null,null,null,null,null,null,null,null,null,null,null,null,{"$f":"'LI-02 (1)'!AA39","v":212863.49}]
[]
[null,null,17,299059,5672,"GUEMES - CAMPO SANTO - MINETTI",132,41.8,{"$f":"$G$16/100*IF(H21>25,H21,25)","v":214.93727199999998},"2016-02-16T00:52:00","2016-02-16T00:59:00",{"$f":"IF(F21=\"\",\"\",(K21-J21)*24)","v":0.11666666669771075},{"$f":"IF(F21=\"\",\"\",ROUND((K21-J21)*24*60,0))","v":7},"F",{"$f":"IF(F21=\"\",\"\",\"--\")","v":"--"},{"$f":"IF(N21=\"P\",ROUND(M21/60,2)*I21*$L$16*0.01,\"--\")","v":"--"},{"$f":"IF(N21=\"RP\",I21*O21*ROUND(L21/60,2)*0.01*M21/100,\"--\")","v":"--"},{"$f":"IF(N21=\"F\",I21*$L$16,\"--\")","v":6448.1181599999991},{"$f":"IF(AND(M21>10,N21=\"F\"),I21*$L$16*IF(M21>180,3,ROUND((M21)/60,2)),\"--\")","v":"--"},{"$f":"IF(AND(M21>180,N21=\"F\"),(ROUND(M21/60,2)-3)*I21*$L$16*0.1,\"--\")","v":"--"},{"$f":"IF(N21=\"R\",I21*$L$16*O21/100,\"--\")","v":"--"},{"$f":"IF(AND(M21>10,N21=\"R\"),I21*$L$16*O21/100*IF(M21>180,3,ROUND(M21/60,2)),\"--\")","v":"--"},{"$f":"IF(AND(M21>180,N21=\"R\"),(ROUND(M21/60,2)-3)*I21*$L$16*0.1*O21/100,\"--\")","v":"--"},{"$f":"IF(N21=\"RF\",ROUND(M21/60,2)*I21*$L$16*0.1,\"--\")","v":"--"},{"$f":"IF(N21=\"RR\",ROUND(M21/60,2)*I21*$L$16*0.1*O21/100,\"--\")","v":"--"},"SI",{"$f":"IF(F21=\"\",\"\",SUM(P21:Y21)*IF(Z21=\"SI\",1,2))","v":6448.1181599999991}]
[null,null,18,299060,281,"GÜEMES - SAN JUANCITO 1",132,36.240001678466797,{"$f":"$G$16/100*IF(H22>25,H22,25)","v":186.3475382307434},"2016-02-16T00:52:00","2016-02-16T01:01:00",{"$f":"IF(F22=\"\",\"\",(K22-J22)*24)","v":0.1499999999650754},{"$f":"IF(F22=\"\",\"\",ROUND((K22-J22)*24*60,0))","v":9},"F",{"$f":"IF(F22=\"\",\"\",\"--\")","v":"--"},{"$f":"IF(N22=\"P\",ROUND(M22/60,2)*I22*$L$16*0.01,\"--\")","v":"--"},{"$f":"IF(N22=\"RP\",I22*O22*ROUND(L22/60,2)*0.01*M22/100,\"--\")","v":"--"},{"$f":"IF(N22=\"F\",I22*$L$16,\"--\")","v":5590.426146922302},{"$f":"IF(AND(M22>10,N22=\"F\"),I22*$L$16*IF(M22>180,3,ROUND((M22)/60,2)),\"--\")","v":"--"},{"$f":"IF(AND(M22>180,N22=\"F\"),(ROUND(M22/60,2)-3)*I22*$L$16*0.1,\"--\")","v":"--"},{"$f":"IF(N22=\"R\",I22*$L$16*O22/100,\"--\")","v":"--"},{"$f":"IF(AND(M22>10,N22=\"R\"),I22*$L$16*O22/100*IF(M22>180,3,ROUND(M22/60,2)),\"--\")","v":"--"},{"$f":"IF(AND(M22>180,N22=\"R\"),(ROUND(M22/60,2)-3)*I22*$L$16*0.1*O22/100,\"--\")","v":"--"},{"$f":"IF(N22=\"RF\",ROUND(M22/60,2)*I22*$L$16*0.1,\"--\")","v":"--"},{"$f":"IF(N22=\"RR\",ROUND(M22/60,2)*I22*$L$16*0.1*O22/100,\"--\")","v":"--"},"SI",{"$f":"IF(F22=\"\",\"\",SUM(P22:Y22)*IF(Z22=\"SI\",1,2))","v":5590.426146922302}]
[null,null,19,299061,2691,"LOS PIZARROS - ESCABA",132,21.399999618530273,128.55099999999999,"2016-02-16T08:13:00","2016-02-16T15:20:00",7.1166666666395031,427,"P","--",274.58493599999997,"--","--","--","--","--","--","--","--","--","SI",274.58493599999997]
[null,null,20,299072,5878,"EL TABACAL - ORAN",132,12.04,128.55099999999999,"2016-02-17T02:02:00","2016-02-17T02:20:00",0.29999999993015081,18,"F","--","--","--",3856.5299999999997,1156.9589999999998,"--","--","--","--","--","--","SI",5013.4889999999996]
[null,null,21,299075,2691,"LOS PIZARROS - ESCABA",132,21.399999618530273,128.55099999999999,"2016-02-17T07:58:00","2016-02-17T16:11:00",8.2166666667326353,493,"P","--",317.00676599999997,"--","--","--","--","--","--","--","--","--","SI",317.00676599999997]
[null,null,22,299089,311,"AGUILARES - VILLA QUINTEROS",132,21,128.55099999999999,"2016-02-17T23:50:00","2016-02-17T23:54:00",6.6666666709352285E-2,4,"F","--","--","--",3856.5299999999997,"--","--","--","--","--","--","--","SI",3856.5299999999997]
[null,null,23,299100,2691,"LOS PIZARROS - ESCABA",132,21.399999618530273,128.55099999999999,"2016-02-18T07:38:00","2016-02-18T16:17:00",8.6499999999068677,519,"P","--",333.58984499999997,"--","--","--","--","--","--","--","--","--","SI",333.58984499999997]
[null,null,24,299514,4250,"PAMPA GRANDE - TRANCAS",132,55,282.81219999999996,"2016-02-23T09:12:00","2016-02-23T16:08:00",6.933333333407063,416,"P","--",587.9665637999999,"--","--","--","--","--","--","--","--","--","SI",587.9665637999999]
[null,null,25,299515,281,"GÜEMES - SAN JUANCITO 1",132,36.240001678466797,186.3475382307434,"2016-02-23T22:43:00","2016-02-24T17:25:00",18.700000000011642,1122,"F","--","--","--",5590.426146922302,16771.278440766906,8776.9690506680145,"--","--","--","--","--","SI",31138.673638357221]
[null,null,26,299516,5672,"GUEMES - CAMPO SANTO - MINETTI",132,41.8,214.93727199999998,"2016-02-24T01:22:00","2016-02-24T14:24:00",13.03333333338378,782,"F","--","--","--",6448.1181599999991,19344.354479999998,6467.4625144800002,"--","--","--","--","--","SI",32259.935154479997]
[null,null,27,299518,2905,"LOS PIZARROS - HUACRA",132,28.5,146.54813999999999,"2016-02-24T07:46:00","2016-02-24T15:11:00",7.4166666667442769,445,"P","--",326.21615964,"--","--","--","--","--","--","--","--","--","SI",326.21615964]
[null,null,28,299520,3565,"CABRA CORRAL - SALTA ESTE",132,55,282.81219999999996,"2016-02-25T00:16:00","2016-02-25T00:28:00",0.19999999995343387,12,"F","--","--","--",8484.3659999999982,1696.8731999999998,"--","--","--","--","--","--","SI",10181.239199999998]
[null,null,29,299521,2905,"LOS PIZARROS - HUACRA",132,28.5,146.54813999999999,"2016-02-25T07:34:00","2016-02-25T16:31:00",8.9500000000116415,537,"P","--",393.48175589999994,"--","--","--","--","--","--","--","--","--","SI",393.48175589999994]
[null,null,30,299522,2905,"LOS PIZARROS - HUACRA",132,28.5,146.54813999999999,"2016-02-26T08:11:00","2016-02-26T15:03:00",6.8666666666977108,412,"P","--",302.03571654000001,"--","--","--","--","--","--","--","--","--","SI",302.03571654000001]
[null,null,31,299541,311,"AGUILARES - VILLA QUINTEROS",132,21,128.55099999999999,"2016-02-26T19:31:00","2016-02-26T19:34:00",4.9999999988358468E-2,3,"F","--","--","--",3856.5299999999997,"--","--","--","--","--","--","--","SI",3856.5299999999997]
[null,null,32,299546,287,"AGUA BLANCA - INDEPENDENCIA TUC",132,34.139999389648438,175.54924246154783,"2016-02-26T19:42:00","2016-02-26T19:44:00",3.3333333441987634E-2,2,"F","--","--","--",5266.4772738464353,"--","--","--","--","--","--","--","SI",5266.4772738464353]
[null,null,33,299552,5522,"SENDA HACHADA - TARTAGAL",132,58.5,300.80933999999996,"2016-02-27T23:51:00","2016-02-27T23:58:00",{"$f":"IF(F37=\"\",\"\",(K37-J37)*24)","v":0.11666666669771075},{"$f":"IF(F37=\"\",\"\",ROUND((K37-J37)*24*60,0))","v":7},"F",{"$f":"IF(F37=\"\",\"\",\"--\")","v":"--"},{"$f":"IF(N37=\"P\",ROUND(M37/60,2)*I37*$L$16*0.01,\"--\")","v":"--"},{"$f":"IF(N37=\"RP\",I37*O37*ROUND(L37/60,2)*0.01*M37/100,\"--\")","v":"--"},{"$f":"IF(N37=\"F\",I37*$L$16,\"--\")","v":9024.2801999999992},{"$f":"IF(AND(M37>10,N37=\"F\"),I37*$L$16*IF(M37>180,3,ROUND((M37)/60,2)),\"--\")","v":"--"},{"$f":"IF(AND(M37>180,N37=\"F\"),(ROUND(M37/60,2)-3)*I37*$L$16*0.1,\"--\")","v":"--"},{"$f":"IF(N37=\"R\",I37*$L$16*O37/100,\"--\")","v":"--"},{"$f":"IF(AND(M37>10,N37=\"R\"),I37*$L$16*O37/100*IF(M37>180,3,ROUND(M37/60,2)),\"--\")","v":"--"},{"$f":"IF(AND(M37>180,N37=\"R\"),(ROUND(M37/60,2)-3)*I37*$L$16*0.1*O37/100,\"--\")","v":"--"},{"$f":"IF(N37=\"RF\",ROUND(M37/60,2)*I37*$L$16*0.1,\"--\")","v":"--"},{"$f":"IF(N37=\"RR\",ROUND(M37/60,2)*I37*$L$16*0.1*O37/100,\"--\")","v":"--"},"SI",{"$f":"IF(F37=\"\",\"\",SUM(P37:Y37)*IF(Z37=\"SI\",1,2))","v":9024.2801999999992}]
[null,null,34,299566,5522,"SENDA HACHADA - TARTAGAL",132,58.5,300.80933999999996,"2016-02-28T23:29:00","2016-02-28T23:35:00",{"$f":"IF(F38=\"\",\"\",(K38-J38)*24)","v":9.9999999976716936E-2},{"$f":"IF(F38=\"\",\"\",ROUND((K38-J38)*24*60,0))","v":6},"F",{"$f":"IF(F38=\"\",\"\",\"--\")","v":"--"},{"$f":"IF(N38=\"P\",ROUND(M38/60,2)*I38*$L$16*0.01,\"--\")","v":"--"},{"$f":"IF(N38=\"RP\",I38*O38*ROUND(L38/60,2)*0.01*M38/100,\"--\")","v":"--"},{"$f":"IF(N38=\"F\",I38*$L$16,\"--\")","v":9024.2801999999992},{"$f":"IF(AND(M38>10,N38=\"F\"),I38*$L$16*IF(M38>180,3,ROUND((M38)/60,2)),\"--\")","v":"--"},{"$f":"IF(AND(M38>180,N38=\"F\"),(ROUND(M38/60,2)-3)*I38*$L$16*0.1,\"--\")","v":"--"},{"$f":"IF(N38=\"R\",I38*$L$16*O38/100,\"--\")","v":"--"},{"$f":"IF(AND(M38>10,N38=\"R\"),I38*$L$16*O38/100*IF(M38>180,3,ROUND(M38/60,2)),\"--\")","v":"--"},{"$f":"IF(AND(M38>180,N38=\"R\"),(ROUND(M38/60,2)-3)*I38*$L$16*0.1*O38/100,\"--\")","v":"--"},{"$f":"IF(N38=\"RF\",ROUND(M38/60,2)*I38*$L$16*0.1,\"--\")","v":"--"},{"$f":"IF(N38=\"RR\",ROUND(M38/60,2)*I38*$L$16*0.1*O38/100,\"--\")","v":"--"},"SI",{"$f":"IF(F38=\"\",\"\",SUM(P38:Y38)*IF(Z38=\"SI\",1,2))","v":9024.2801999999992}]
[null,null,null,null,null,null,132,null,128.55099999999999,null,null,{"$f":"IF(F39=\"\",\"\",(K39-J39)*24)","v":""},{"$f":"IF(F39=\"\",\"\",ROUND((K39-J39)*24*60,0))","v":""},null,{"$f":"IF(F39=\"\",\"\",\"--\")","v":""},{"$f":"IF(N39=\"P\",ROUND(M39/60,2)*I39*$L$16*0.01,\"--\")","v":"--"},{"$f":"IF(N39=\"RP\",I39*O39*ROUND(L39/60,2)*0.01*M39/100,\"--\")","v":"--"},{"$f":"IF(N39=\"F\",I39*$L$16,\"--\")","v":"--"},{"$f":"IF(AND(M39>10,N39=\"F\"),I39*$L$16*IF(M39>180,3,ROUND((M39)/60,2)),\"--\")","v":"--"},{"$f":"IF(AND(M39>180,N39=\"F\"),(ROUND(M39/60,2)-3)*I39*$L$16*0.1,\"--\")","v":"--"},{"$f":"IF(N39=\"R\",I39*$L$16*O39/100,\"--\")","v":"--"},{"$f":"IF(AND(M39>10,N39=\"R\"),I39*$L$16*O39/100*IF(M39>180,3,ROUND(M39/60,2)),\"--\")","v":"--"},{"$f":"IF(AND(M39>180,N39=\"R\"),(ROUND(M39/60,2)-3)*I39*$L$16*0.1*O39/100,\"--\")","v":"--"},{"$f":"IF(N39=\"RF\",ROUND(M39/60,2)*I39*$L$16*0.1,\"--\")","v":"--"},{"$f":"IF(N39=\"RR\",ROUND(M39/60,2)*I39*$L$16*0.1*O39/100,\"--\")","v":"--"},null,{"$f":"IF(F39=\"\",\"\",SUM(P39:Y39)*IF(Z39=\"SI\",1,2))","v":""}]
[]
[null,null,"(²)","P - PROGRAMADA  ; F - FORZADA",null,null,null,null,null,null,null,null,null,null,null,{"$f":"SUM(P19:P40)","v":2534.8817428799998},0,67446.082287691039,38969.465120766909,15244.431565148014,0,0,0,0,0,null,{"$f":"ROUND(SUM(AA19:AA40),2)","v":337058.35}]

{"sheet":"LI-02 (3)","index":3,"n_rows":40,"n_cols":27,"rows_kept":40,"cut":false,"hidden":false,"merged":[]}
[]
[null,{"$f":"+'TOT-0216'!B2","v":"ANEXO V al  Memorandum  D.T.E.E. N°        356    / 2016"}]
[]
[" ENTE NACIONAL REGULADOR "]
["       DE LA ELECTRICIDAD"]
[]
[]
[null,null,null,null,null,"SISTEMA DE TRANSPORTE DE ENERGÍA ELÉCTRICA POR DISTRIBUCIÓN TRONCAL - TRANSNOA S.A."]
[]
[null,null,null,null,null,"1.- LÍNEAS"]
[]
[null,null,null,null,null,"1.1.- Equipamiento propio"]
[]
[null,{"$f":"'TOT-0216'!B14","v":"Desde el 01 al 29 de Febrero de 2016"}]
[]
[null,null,null,null,null,"$/100 km-h : LINEAS 132 kV ",514.20399999999995,null,null,null,"FACTOR DE PENALIZACION  K =",{"$f":"30*'TOT-0216'!B13","v":30},{"$f":"IF(L16=30,\" \",IF(L16=60,\"Coeficiente duplicado por tasa de falla >4 Sal. x año/100 km.\",\"REVISAR COEFICIENTE\"))","v":" "}]
[null,null,3,4,5,6,7,8,9,10,11,12,13,14,15,16,17,18,19,20,21,22,23,24,25,26,27]
[null,null,"N°","INDISP","ID EQUIPO","LÍNEAS","U\n[kV]","Long.\n[km]","$/h","Salida","Entrada","Hs. \nIndisp","Minutos\nIndisp.","Tipo \nSal.(²)","C.R.\n%","PENALIZ.\nPROGRAM.","REDUCC.\nPROGRAM.","PENALIZACION FORZADA\nPor Salida    1ras. 3 hs.   hs. Restantes",null,null,"REDUCC. FORZADA\nPor Salida     1ras. 3 hs.     hs. Restantes",null,null,"RESTANTE\nFORZADA","REDUCC.\nRESTANTE","Informó\nen Térm.","TOTAL\nPENALIZAC."]
[null,null,null,null,null,null,null,null,null,null,null,null,null,null,null,null,null,null,null,null,null,null,null,null,null,null,{"$f":"'LI-02 (2)'!AA41","v":337058.35}]
[]
[null,null,35,299753,5522,"SENDA HACHADA - TARTAGAL",132,58.5,{"$f":"$G$16/100*IF(H21>25,H21,25)","v":300.80933999999996},"2016-02-29T02:53:00","2016-02-29T02:56:00",{"$f":"IF(F21=\"\",\"\",(K21-J21)*24)","v":4.9999999988358468E-2},{"$f":"IF(F21=\"\",\"\",ROUND((K21-J21)*24*60,0))","v":3},"F",{"$f":"IF(F21=\"\",\"\",\"--\")","v":"--"},{"$f":"IF(N21=\"P\",ROUND(M21/60,2)*I21*$L$16*0.01,\"--\")","v":"--"},{"$f":"IF(N21=\"RP\",I21*O21*ROUND(L21/60,2)*0.01*M21/100,\"--\")","v":"--"},{"$f":"IF(N21=\"F\",I21*$L$16,\"--\")","v":9024.2801999999992},{"$f":"IF(AND(M21>10,N21=\"F\"),I21*$L$16*IF(M21>180,3,ROUND((M21)/60,2)),\"--\")","v":"--"},{"$f":"IF(AND(M21>180,N21=\"F\"),(ROUND(M21/60,2)-3)*I21*$L$16*0.1,\"--\")","v":"--"},{"$f":"IF(N21=\"R\",I21*$L$16*O21/100,\"--\")","v":"--"},{"$f":"IF(AND(M21>10,N21=\"R\"),I21*$L$16*O21/100*IF(M21>180,3,ROUND(M21/60,2)),\"--\")","v":"--"},{"$f":"IF(AND(M21>180,N21=\"R\"),(ROUND(M21/60,2)-3)*I21*$L$16*0.1*O21/100,\"--\")","v":"--"},{"$f":"IF(N21=\"RF\",ROUND(M21/60,2)*I21*$L$16*0.1,\"--\")","v":"--"},{"$f":"IF(N21=\"RR\",ROUND(M21/60,2)*I21*$L$16*0.1*O21/100,\"--\")","v":"--"},"SI",{"$f":"IF(F21=\"\",\"\",SUM(P21:Y21)*IF(Z21=\"SI\",1,2))","v":9024.2801999999992}]
[null,null,36,299759,5443,"NONOGASTA - VILLA UNIÓN",132,82.1,{"$f":"$G$16/100*IF(H22>25,H22,25)","v":422.16148399999997},"2016-02-29T08:47:00","2016-02-29T14:41:00",{"$f":"IF(F22=\"\",\"\",(K22-J22)*24)","v":5.9000000000232831},{"$f":"IF(F22=\"\",\"\",ROUND((K22-J22)*24*60,0))","v":354},"F",{"$f":"IF(F22=\"\",\"\",\"--\")","v":"--"},{"$f":"IF(N22=\"P\",ROUND(M22/60,2)*I22*$L$16*0.01,\"--\")","v":"--"},{"$f":"IF(N22=\"RP\",I22*O22*ROUND(L22/60,2)*0.01*M22/100,\"--\")","v":"--"},{"$f":"IF(N22=\"F\",I22*$L$16,\"--\")","v":12664.844519999999},{"$f":"IF(AND(M22>10,N22=\"F\"),I22*$L$16*IF(M22>180,3,ROUND((M22)/60,2)),\"--\")","v":37994.533559999996},{"$f":"IF(AND(M22>180,N22=\"F\"),(ROUND(M22/60,2)-3)*I22*$L$16*0.1,\"--\")","v":3672.8049108},{"$f":"IF(N22=\"R\",I22*$L$16*O22/100,\"--\")","v":"--"},{"$f":"IF(AND(M22>10,N22=\"R\"),I22*$L$16*O22/100*IF(M22>180,3,ROUND(M22/60,2)),\"--\")","v":"--"},{"$f":"IF(AND(M22>180,N22=\"R\"),(ROUND(M22/60,2)-3)*I22*$L$16*0.1*O22/100,\"--\")","v":"--"},{"$f":"IF(N22=\"RF\",ROUND(M22/60,2)*I22*$L$16*0.1,\"--\")","v":"--"},{"$f":"IF(N22=\"RR\",ROUND(M22/60,2)*I22*$L$16*0.1*O22/100,\"--\")","v":"--"},"SI",{"$f":"IF(F22=\"\",\"\",SUM(P22:Y22)*IF(Z22=\"SI\",1,2))","v":54332.182990799993}]
[null,null,null,null,null,null,null,null,128.55099999999999,null,null,"","",null,{"$f":"IF(F23=\"\",\"\",\"--\")","v":""},{"$f":"IF(N23=\"P\",ROUND(M23/60,2)*I23*$L$16*0.01,\"--\")","v":"--"},{"$f":"IF(N23=\"RP\",I23*O23*ROUND(L23/60,2)*0.01*M23/100,\"--\")","v":"--"},{"$f":"IF(N23=\"F\",I23*$L$16,\"--\")","v":"--"},{"$f":"IF(AND(M23>10,N23=\"F\"),I23*$L$16*IF(M23>180,3,ROUND((M23)/60,2)),\"--\")","v":"--"},{"$f":"IF(AND(M23>180,N23=\"F\"),(ROUND(M23/60,2)-3)*I23*$L$16*0.1,\"--\")","v":"--"},{"$f":"IF(N23=\"R\",I23*$L$16*O23/100,\"--\")","v":"--"},{"$f":"IF(AND(M23>10,N23=\"R\"),I23*$L$16*O23/100*IF(M23>180,3,ROUND(M23/60,2)),\"--\")","v":"--"},{"$f":"IF(AND(M23>180,N23=\"R\"),(ROUND(M23/60,2)-3)*I23*$L$16*0.1*O23/100,\"--\")","v":"--"},{"$f":"IF(N23=\"RF\",ROUND(M23/60,2)*I23*$L$16*0.1,\"--\")","v":"--"},{"$f":"IF(N23=\"RR\",ROUND(M23/60,2)*I23*$L$16*0.1*O23/100,\"--\")","v":"--"},{"$f":"IF(F23=\"\",\"\",\"SI\")","v":""},""]
[null,null,null,null,null,null,null,null,128.55099999999999,null,null,"","",null,"","--","--","--","--","--","--","--","--","--","--",{"$f":"IF(F24=\"\",\"\",\"SI\")","v":""},""]
[null,null,null,null,null,null,null,null,128.55099999999999,null,null,"","",null,"","--","--","--","--","--","--","--","--","--","--","",""]
[null,null,null,null,null,null,null,null,128.55099999999999,null,null,"","",null,"","--","--","--","--","--","--","--","--","--","--","",""]
[null,null,null,null,null,null,null,null,128.55099999999999,null,null,"","",null,"","--","--","--","--","--","--","--","--","--","--","",""]
[null,null,null,null,null,null,null,null,128.55099999999999,null,null,"","",null,"","--","--","--","--","--","--","--","--","--","--","",""]
[null,null,null,null,null,null,null,null,128.55099999999999,null,null,"","",null,"","--","--","--","--","--","--","--","--","--","--","",""]
[null,null,null,null,null,null,null,null,128.55099999999999,null,null,"","",null,"","--","--","--","--","--","--","--","--","--","--","",""]
[null,null,null,null,null,null,null,null,128.55099999999999,null,null,"","",null,"","--","--","--","--","--","--","--","--","--","--","",""]
[null,null,null,null,null,null,null,null,128.55099999999999,null,null,"","",null,"","--","--","--","--","--","--","--","--","--","--","",""]
[null,null,null,null,null,null,null,null,128.55099999999999,null,null,"","",null,"","--","--","--","--","--","--","--","--","--","--","",""]
[null,null,null,null,null,null,null,null,128.55099999999999,null,null,"","",null,"","--","--","--","--","--","--","--","--","--","--","",""]
[null,null,null,null,null,null,null,null,128.55099999999999,null,null,"","",null,"","--","--","--","--","--","--","--","--","--","--","",""]
[null,null,null,null,null,null,null,null,128.55099999999999,null,null,"","",null,"","--","--","--","--","--","--","--","--","--","--","",""]
[null,null,null,null,null,null,null,null,128.55099999999999,null,null,"","",null,"","--","--","--","--","--","--","--","--","--","--","",""]
[null,null,null,null,null,null,null,null,128.55099999999999,null,null,{"$f":"IF(F38=\"\",\"\",(K38-J38)*24)","v":""},{"$f":"IF(F38=\"\",\"\",ROUND((K38-J38)*24*60,0))","v":""},null,{"$f":"IF(F38=\"\",\"\",\"--\")","v":""},{"$f":"IF(N38=\"P\",ROUND(M38/60,2)*I38*$L$16*0.01,\"--\")","v":"--"},{"$f":"IF(N38=\"RP\",I38*O38*ROUND(L38/60,2)*0.01*M38/100,\"--\")","v":"--"},{"$f":"IF(N38=\"F\",I38*$L$16,\"--\")","v":"--"},{"$f":"IF(AND(M38>10,N38=\"F\"),I38*$L$16*IF(M38>180,3,ROUND((M38)/60,2)),\"--\")","v":"--"},{"$f":"IF(AND(M38>180,N38=\"F\"),(ROUND(M38/60,2)-3)*I38*$L$16*0.1,\"--\")","v":"--"},{"$f":"IF(N38=\"R\",I38*$L$16*O38/100,\"--\")","v":"--"},{"$f":"IF(AND(M38>10,N38=\"R\"),I38*$L$16*O38/100*IF(M38>180,3,ROUND(M38/60,2)),\"--\")","v":"--"},{"$f":"IF(AND(M38>180,N38=\"R\"),(ROUND(M38/60,2)-3)*I38*$L$16*0.1*O38/100,\"--\")","v":"--"},{"$f":"IF(N38=\"RF\",ROUND(M38/60,2)*I38*$L$16*0.1,\"--\")","v":"--"},{"$f":"IF(N38=\"RR\",ROUND(M38/60,2)*I38*$L$16*0.1*O38/100,\"--\")","v":"--"},{"$f":"IF(F38=\"\",\"\",\"SI\")","v":""},{"$f":"IF(F38=\"\",\"\",SUM(P38:Y38)*IF(Z38=\"SI\",1,2))","v":""}]
[]
[null,null,"(²)","F - FORZADA",null,null,null,null,null,null,null,null,null,null,null,{"$f":"SUM(P19:P39)","v":0},0,21689.12472,37994.533559999996,3672.8049108,0,0,0,0,0,null,{"$f":"ROUND(SUM(AA19:AA39),2)","v":400414.81}]

{"sheet":"LI-EDESA-02 (1)","index":4,"n_rows":42,"n_cols":27,"rows_kept":42,"cut":false,"hidden":false,"merged":[]}
[]
[null,{"$f":"'TOT-0216'!B2","v":"ANEXO V al  Memorandum  D.T.E.E. N°        356    / 2016"}]
[]
[" ENTE NACIONAL REGULADOR "]
["       DE LA ELECTRICIDAD"]
[]
[]
[null,null,null,null,null,"SISTEMA DE TRANSPORTE DE ENERGÍA ELÉCTRICA POR DISTRIBUCIÓN TRONCAL - TRANSNOA S.A."]
[]
[null,null,null,null,null,"1.- LÍNEAS"]
[]
[null,null,null,null,null,"1.2.- Transportista Independiente EDESA S.A."]
[]
[null,{"$f":"'TOT-0216'!B14","v":"Desde el 01 al 29 de Febrero de 2016"}]
[]
[null,null,null,null,null,"$/100 km-h : LINEAS 132 kV ",51.923999999999999,null,null,null,"FACTOR DE PENALIZACION  K =",{"$f":"30*'TOT-0216'!B13","v":30},{"$f":"IF(L16=30,\" \",IF(L16=60,\"Coeficiente duplicado por tasa de falla >4 Sal. x año/100 km.\",\"REVISAR COEFICIENTE\"))","v":" "}]
[null,null,3,4,5,6,7,8,9,10,11,12,13,14,15,16,17,18,19,20,21,22,23,24,25,26,27]
[null,null,"N°","INDISP","ID EQUIPO","LÍNEAS","U\n[kV]","Long.\n[km]","$/h","Salida","Entrada","Hs. \nIndisp","Minutos\nIndisp.","Tipo \nSal.(²)","C.R.\n%","PENALIZ.\nPROGRAM.","REDUCC.\nPROGRAM.","PENALIZACION FORZADA\nPor Salida    1ras. 3 hs.   hs. Restantes",null,null,"REDUCC. FORZADA\nPor Salida     1ras. 3 hs.     hs. Restantes",null,null,"RESTANTE\nFORZADA","REDUCC.\nRESTANTE","Informó\nen Térm.","TOTAL\nPENALIZAC."]
[]
[]
[null,null,37,299502,2686,"METAN - EL TUNAL",132,75.599998474121094,{"$f":"$G$16/100*IF(H21>25,H21,25)","v":39.254543207702639},"2016-02-22T11:43:00","2016-02-22T20:12:00",{"$f":"IF(F21=\"\",\"\",(K21-J21)*24)","v":8.4833333333954215},{"$f":"IF(F21=\"\",\"\",ROUND((K21-J21)*24*60,0))","v":509},"F",{"$f":"IF(F21=\"\",\"\",\"--\")","v":"--"},{"$f":"IF(N21=\"P\",ROUND(M21/60,2)*I21*$L$16*0.01,\"--\")","v":"--"},{"$f":"IF(N21=\"RP\",I21*O21*ROUND(L21/60,2)*0.01*M21/100,\"--\")","v":"--"},{"$f":"IF(N21=\"F\",I21*$L$16,\"--\")","v":1177.6362962310791},{"$f":"IF(AND(M21>10,N21=\"F\"),I21*$L$16*IF(M21>180,3,ROUND((M21)/60,2)),\"--\")","v":3532.9088886932373},{"$f":"IF(AND(M21>180,N21=\"F\"),(ROUND(M21/60,2)-3)*I21*$L$16*0.1,\"--\")","v":645.34469033463142},{"$f":"IF(N21=\"R\",I21*$L$16*O21/100,\"--\")","v":"--"},{"$f":"IF(AND(M21>10,N21=\"R\"),I21*$L$16*O21/100*IF(M21>180,3,ROUND(M21/60,2)),\"--\")","v":"--"},{"$f":"IF(AND(M21>180,N21=\"R\"),(ROUND(M21/60,2)-3)*I21*$L$16*0.1*O21/100,\"--\")","v":"--"},{"$f":"IF(N21=\"RF\",ROUND(M21/60,2)*I21*$L$16*0.1,\"--\")","v":"--"},{"$f":"IF(N21=\"RR\",ROUND(M21/60,2)*I21*$L$16*0.1*O21/100,\"--\")","v":"--"},"SI",{"$f":"IF(F21=\"\",\"\",SUM(P21:Y21)*IF(Z21=\"SI\",1,2))","v":5355.8898752589475}]
[null,null,null,null,null,null,null,null,{"$f":"$G$16/100*IF(H22>25,H22,25)","v":12.981000000000002},null,null,"","",null,"","--","--","--","--","--","--","--","--","--","--",{"$f":"IF(F22=\"\",\"\",\"SI\")","v":""},""]
[null,null,null,null,null,null,null,null,12.981000000000002,null,null,"","",null,"","--","--","--","--","--","--","--","--","--","--","",""]
[null,null,null,null,null,null,null,null,12.981000000000002,null,null,"","",null,"","--","--","--","--","--","--","--","--","--","--","",""]
[null,null,null,null,null,null,null,null,12.981000000000002,null,null,"","",null,"","--","--","--","--","--","--","--","--","--","--","",""]
[null,null,null,null,null,null,null,null,12.981000000000002,null,null,"","",null,"","--","--","--","--","--","--","--","--","--","--","",""]
[null,null,null,null,null,null,null,null,12.981000000000002,null,null,"","",null,"","--","--","--","--","--","--","--","--","--","--","",""]
[null,null,null,null,null,null,null,null,12.981000000000002,null,null,"","",null,"","--","--","--","--","--","--","--","--","--","--","",""]
[null,null,null,null,null,null,null,null,12.981000000000002,null,null,"","",null,"","--","--","--","--","--","--","--","--","--","--","",""]
[null,null,null,null,null,null,null,null,12.981000000000002,null,null,"","",null,"","--","--","--","--","--","--","--","--","--","--","",""]
[null,null,null,null,null,null,null,null,12.981000000000002,null,null,"","",null,"","--","--","--","--","--","--","--","--","--","--","",""]
[null,null,null,null,null,null,null,null,12.981000000000002,null,null,"","",null,"","--","--","--","--","--","--","--","--","--","--","",""]
[null,null,null,null,null,null,null,null,12.981000000000002,null,null,"","",null,"","--","--","--","--","--","--","--","--","--","--","",""]
[null,null,null,null,null,null,null,null,12.981000000000002,null,null,"","",null,"","--","--","--","--","--","--","--","--","--","--","",""]
[null,null,null,null,null,null,null,null,12.981000000000002,null,null,"","",null,"","--","--","--","--","--","--","--","--","--","--","",""]
[null,null,null,null,null,null,null,null,12.981000000000002,null,null,"","",null,"","--","--","--","--","--","--","--","--","--","--","",""]
[null,null,null,null,null,null,null,null,12.981000000000002,null,null,"","",null,"","--","--","--","--","--","--","--","--","--","--","",""]
[null,null,null,null,null,null,null,null,12.981000000000002,null,null,"","",null,"","--","--","--","--","--","--","--","--","--","--","",""]
[null,null,null,null,null,null,null,null,12.981000000000002,null,null,"","",null,"","--","--","--","--","--","--","--","--","--","--","",""]
[null,null,null,null,null,null,null,null,12.981000000000002,null,null,"","",null,"","--","--","--","--","--","--","--","--","--","--","",""]
[]
[null,null,"(²)","F - FORZADA",null,null,null,null,null,null,null,null,null,null,null,{"$f":"SUM(P19:P41)","v":0},0,1177.6362962310791,3532.9088886932373,645.34469033463142,0,0,0,0,0,null,{"$f":"ROUND(SUM(AA19:AA41),2)","v":5355.89}]

{"sheet":"T-02 (1)","index":5,"n_rows":49,"n_cols":29,"rows_kept":49,"cut":false,"hidden":false,"merged":[]}
[]
[null,{"$f":"+'TOT-0216'!B2","v":"ANEXO V al  Memorandum  D.T.E.E. N°        356    / 2016"}]
[]
[" ENTE NACIONAL REGULADOR "]
["       DE LA ELECTRICIDAD"]
[]
[]
[null,null,null,null,null,"SISTEMA DE TRANSPORTE DE ENERGÍA ELÉCTRICA POR DISTRIBUCIÓN TRONCAL - TRANSNOA S.A."]
[]
[null,null,null,null,null,"2.- CONEXIÓN"]
[]
[null,null,null,null,null,"2.1.- Transformación"]
[]
[null,null,null,null,null,"2.1.1.- Equipamiento propio"]
[]
[null,{"$f":"'TOT-0216'!B14","v":"Desde el 01 al 29 de Febrero de 2016"}]
[]
[null,null,null,null,null,"Por Transformador por MVA    $ =",null,null,1.79,null,0.67469999999999997,"Res. SE 1/03"]
[null,null,null,null,null,"Coeficiente de penalización por salida forzada   =",null,null,{"$f":"30*'TOT-0216'!B13","v":30},null,{"$f":"IF(I19=30,\" \",IF(I19=60,\"  Coeficiente duplicado por tasa de falla >4 Sal. x año/100 km.\",\"REVISAR COEFICIENTE\"))","v":" "}]
[null,null,3,4,5,6,7,8,9,10,11,12,13,14,15,16,17,18,19,20,21,22,23,24,25,26,27,28,29]
[null,null,"N°","INDISP","ID EQUIPO","ESTACIÓN\nTRANSFORMADORA","EQUIPO","POT.\n[MVA]","U\n[kV]","$/h","Salida","Entrada","Hs\nIndisp.","Mtos.\nIndisp.","Tipo \nSal.(²)","AUT.","C.R.\n%","E.N.S.","K (P;ENS)","PENALIZ.\nPROGRAM.","REDUCC.\nPROGRAM.","PENALIZAC. FORZADA\nPor Salida       hs. Restantes",null,"REDUCC. FORZADA\nPor Salida       hs. Restantes",null,"RESTANTE\nFORZADA","REDUCC.\nRESTANTE","Informó\nen Térm.","TOTAL\nPENALIZAC."]
[]
[]
[null,null,38,297468,5063,"QUIMILI","TRAFO 2",15,"132/33/13,2",{"$f":"H24*$I$18","v":26.85},"2016-02-01","2016-02-29T23:59:59",{"$f":"IF(F24=\"\",\"\",(L24-K24)*24)","v":695.99972222215729},{"$f":"IF(F24=\"\",\"\",ROUND((L24-K24)*24*60,0))","v":41760},"P",{"$f":"IF(F24=\"\",\"\",IF(OR(O24=\"P\",O24=\"RP\"),\"--\",\"NO\"))","v":"--"},"0,000","NO",{"$f":"$I$19*IF(R24=\"SI\",1,0.1)*IF(OR(O24=\"P\",O24=\"RP\"),0.1,1)","v":0.30000000000000004},{"$f":"IF(O24=\"P\",J24*S24*ROUND(N24/60,2),\"--\")","v":5606.2800000000007},{"$f":"IF(O24=\"RP\",J24*S24*Q24/100*ROUND(N24/60,2),\"--\")","v":"--"},{"$f":"IF(AND(O24=\"F\",P24=\"NO\"),J24*S24,\"--\")","v":"--"},{"$f":"IF(O24=\"F\",J24*S24*ROUND(N24/60,2),\"--\")","v":"--"},{"$f":"IF(AND(O24=\"R\",P24=\"NO\"),J24*S24*Q24/100,\"--\")","v":"--"},{"$f":"IF(O24=\"R\",J24*S24*ROUND(N24/60,2)*Q24/100,\"--\")","v":"--"},{"$f":"IF(O24=\"RF\",J24*S24*ROUND(N24/60,2),\"--\")","v":"--"},{"$f":"IF(O24=\"RR\",J24*S24*ROUND(N24/60,2)*Q24/100,\"--\")","v":"--"},"SI",{"$f":"IF(F24=\"\",\"\",SUM(T24:AA24)*IF(AB24=\"SI\",1,2))","v":5606.2800000000007}]
[null,null,39,298245,3105,"SANTIAGO CENTRO","TRAFO 2",30,"132/33/13,2",53.7,"2016-02-01","2016-02-29T23:59:59",{"$f":"IF(F25=\"\",\"\",(L25-K25)*24)","v":695.99972222215729},{"$f":"IF(F25=\"\",\"\",ROUND((L25-K25)*24*60,0))","v":41760},"RP",{"$f":"IF(F25=\"\",\"\",IF(OR(O25=\"P\",O25=\"RP\"),\"--\",\"NO\"))","v":"--"},40,"NO",{"$f":"$I$19*IF(R25=\"SI\",1,0.1)*IF(OR(O25=\"P\",O25=\"RP\"),0.1,1)","v":0.30000000000000004},{"$f":"IF(O25=\"P\",J25*S25*ROUND(N25/60,2),\"--\")","v":"--"},{"$f":"IF(O25=\"RP\",J25*S25*Q25/100*ROUND(N25/60,2),\"--\")","v":4485.0240000000003},{"$f":"IF(AND(O25=\"F\",P25=\"NO\"),J25*S25,\"--\")","v":"--"},{"$f":"IF(O25=\"F\",J25*S25*ROUND(N25/60,2),\"--\")","v":"--"},{"$f":"IF(AND(O25=\"R\",P25=\"NO\"),J25*S25*Q25/100,\"--\")","v":"--"},{"$f":"IF(O25=\"R\",J25*S25*ROUND(N25/60,2)*Q25/100,\"--\")","v":"--"},{"$f":"IF(O25=\"RF\",J25*S25*ROUND(N25/60,2),\"--\")","v":"--"},{"$f":"IF(O25=\"RR\",J25*S25*ROUND(N25/60,2)*Q25/100,\"--\")","v":"--"},"SI",4485.0240000000003]
[null,null,40,298529,5568,"INDEPENDENCIA","TRAFO 2",30,"132/33/13,2",53.7,"2016-02-02T08:47:00","2016-02-02T16:52:00",{"$f":"IF(F26=\"\",\"\",(L26-K26)*24)","v":8.0833333333139308},{"$f":"IF(F26=\"\",\"\",ROUND((L26-K26)*24*60,0))","v":485},"F",{"$f":"IF(F26=\"\",\"\",IF(OR(O26=\"P\",O26=\"RP\"),\"--\",\"NO\"))","v":"NO"},"0,000","NO",{"$f":"$I$19*IF(R26=\"SI\",1,0.1)*IF(OR(O26=\"P\",O26=\"RP\"),0.1,1)","v":3},{"$f":"IF(O26=\"P\",J26*S26*ROUND(N26/60,2),\"--\")","v":"--"},{"$f":"IF(O26=\"RP\",J26*S26*Q26/100*ROUND(N26/60,2),\"--\")","v":"--"},{"$f":"IF(AND(O26=\"F\",P26=\"NO\"),J26*S26,\"--\")","v":161.10000000000002},{"$f":"IF(O26=\"F\",J26*S26*ROUND(N26/60,2),\"--\")","v":1301.6880000000001},{"$f":"IF(AND(O26=\"R\",P26=\"NO\"),J26*S26*Q26/100,\"--\")","v":"--"},{"$f":"IF(O26=\"R\",J26*S26*ROUND(N26/60,2)*Q26/100,\"--\")","v":"--"},{"$f":"IF(O26=\"RF\",J26*S26*ROUND(N26/60,2),\"--\")","v":"--"},{"$f":"IF(O26=\"RR\",J26*S26*ROUND(N26/60,2)*Q26/100,\"--\")","v":"--"},"SI",1462.788]
[null,null,41,298532,5453,"CIRCUNVALACION","TRAFO 1",30,"132/33/13,2",53.7,"2016-02-03T00:59:00","2016-02-03T01:46:00",{"$f":"IF(F27=\"\",\"\",(L27-K27)*24)","v":0.78333333326736465},{"$f":"IF(F27=\"\",\"\",ROUND((L27-K27)*24*60,0))","v":47},"R",{"$f":"IF(F27=\"\",\"\",IF(OR(O27=\"P\",O27=\"RP\"),\"--\",\"NO\"))","v":"NO"},60,"SI",{"$f":"$I$19*IF(R27=\"SI\",1,0.1)*IF(OR(O27=\"P\",O27=\"RP\"),0.1,1)","v":30},{"$f":"IF(O27=\"P\",J27*S27*ROUND(N27/60,2),\"--\")","v":"--"},{"$f":"IF(O27=\"RP\",J27*S27*Q27/100*ROUND(N27/60,2),\"--\")","v":"--"},{"$f":"IF(AND(O27=\"F\",P27=\"NO\"),J27*S27,\"--\")","v":"--"},{"$f":"IF(O27=\"F\",J27*S27*ROUND(N27/60,2),\"--\")","v":"--"},{"$f":"IF(AND(O27=\"R\",P27=\"NO\"),J27*S27*Q27/100,\"--\")","v":966.6},{"$f":"IF(O27=\"R\",J27*S27*ROUND(N27/60,2)*Q27/100,\"--\")","v":753.94799999999998},{"$f":"IF(O27=\"RF\",J27*S27*ROUND(N27/60,2),\"--\")","v":"--"},{"$f":"IF(O27=\"RR\",J27*S27*ROUND(N27/60,2)*Q27/100,\"--\")","v":"--"},"SI",1720.548]
[null,null,42,298538,3623,"BURRUYACU","TRAFO 1",15,"132/33/13,2",26.85,"2016-02-04T23:58:00","2016-02-05T02:36:00",{"$f":"IF(F28=\"\",\"\",(L28-K28)*24)","v":2.6333333331858739},{"$f":"IF(F28=\"\",\"\",ROUND((L28-K28)*24*60,0))","v":158},"R",{"$f":"IF(F28=\"\",\"\",IF(OR(O28=\"P\",O28=\"RP\"),\"--\",\"NO\"))","v":"NO"},40,"SI",{"$f":"$I$19*IF(R28=\"SI\",1,0.1)*IF(OR(O28=\"P\",O28=\"RP\"),0.1,1)","v":30},{"$f":"IF(O28=\"P\",J28*S28*ROUND(N28/60,2),\"--\")","v":"--"},{"$f":"IF(O28=\"RP\",J28*S28*Q28/100*ROUND(N28/60,2),\"--\")","v":"--"},{"$f":"IF(AND(O28=\"F\",P28=\"NO\"),J28*S28,\"--\")","v":"--"},{"$f":"IF(O28=\"F\",J28*S28*ROUND(N28/60,2),\"--\")","v":"--"},{"$f":"IF(AND(O28=\"R\",P28=\"NO\"),J28*S28*Q28/100,\"--\")","v":322.2},{"$f":"IF(O28=\"R\",J28*S28*ROUND(N28/60,2)*Q28/100,\"--\")","v":847.38599999999997},{"$f":"IF(O28=\"RF\",J28*S28*ROUND(N28/60,2),\"--\")","v":"--"},{"$f":"IF(O28=\"RR\",J28*S28*ROUND(N28/60,2)*Q28/100,\"--\")","v":"--"},"SI",1169.586]
[null,null,43,298539,3623,"BURRUYACU","TRAFO 1",15,"132/33/13,2",26.85,"2016-02-05T02:37:00","2016-02-10T20:20:00",{"$f":"IF(F29=\"\",\"\",(L29-K29)*24)","v":137.71666666661622},{"$f":"IF(F29=\"\",\"\",ROUND((L29-K29)*24*60,0))","v":8263},"F",{"$f":"IF(F29=\"\",\"\",IF(OR(O29=\"P\",O29=\"RP\"),\"--\",\"NO\"))","v":"NO"},"0,000","SI",{"$f":"$I$19*IF(R29=\"SI\",1,0.1)*IF(OR(O29=\"P\",O29=\"RP\"),0.1,1)","v":30},{"$f":"IF(O29=\"P\",J29*S29*ROUND(N29/60,2),\"--\")","v":"--"},{"$f":"IF(O29=\"RP\",J29*S29*Q29/100*ROUND(N29/60,2),\"--\")","v":"--"},{"$f":"IF(AND(O29=\"F\",P29=\"NO\"),J29*S29,\"--\")","v":805.5},{"$f":"IF(O29=\"F\",J29*S29*ROUND(N29/60,2),\"--\")","v":110933.45999999999},{"$f":"IF(AND(O29=\"R\",P29=\"NO\"),J29*S29*Q29/100,\"--\")","v":"--"},{"$f":"IF(O29=\"R\",J29*S29*ROUND(N29/60,2)*Q29/100,\"--\")","v":"--"},{"$f":"IF(O29=\"RF\",J29*S29*ROUND(N29/60,2),\"--\")","v":"--"},{"$f":"IF(O29=\"RR\",J29*S29*ROUND(N29/60,2)*Q29/100,\"--\")","v":"--"},"SI",111738.95999999999]
[null,null,44,298543,4309,"SAN PEDRO JUJUY","TRAFO 1",30,"132/33/13,2",{"$f":"H30*$I$18","v":53.7},"2016-02-07T03:20:00","2016-02-07T03:54:00",0.56666666659293696,34,"R","NO",40,"SI",30,"--","--","--","--",644.4,367.30799999999994,"--","--","SI",{"$f":"IF(F30=\"\",\"\",SUM(T30:AA30)*IF(AB30=\"SI\",1,2))","v":1011.7079999999999}]
[null,null,45,298944,561,"LIBERTADOR JUJUY","TRAFO 1",15,"132/33/13,2",{"$f":"H31*$I$18","v":26.85},"2016-02-08T09:45:00","2016-02-08T13:01:00",3.2666666666627862,196,"P","--","0,000","NO",0.30000000000000004,26.339850000000006,"--","--","--","--","--","--","--","SI",26.339850000000006]
[null,null,46,298945,5452,"PARQUE ARAUCO","TRAFO 2",30,"132/33/13,2",53.7,"2016-02-08T10:32:00","2016-02-08T10:59:00",0.45000000006984919,27,"R","NO",40,"NO",3,"--","--","--","--",64.440000000000012,28.998000000000005,"--","--","SI",93.438000000000017]
[null,null,47,298949,3830,"LIBERTADOR JUJUY","TRAFO 2",15,"132/33/13,2",26.85,"2016-02-08T12:58:00","2016-02-08T13:00:00",3.3333333267364651E-2,2,"R","NO",60,"SI",30,"--","--","--","--",483.3,14.498999999999999,"--","--","SI",497.79900000000004]
[null,null,48,298956,565,"PALPALA","TRAFO 1",30,"132/33/13,2",53.7,"2016-02-08T18:20:00","2016-02-08T18:22:00",3.3333333267364651E-2,2,"R","NO",40,"SI",30,"--","--","--","--",644.4,19.331999999999997,"--","--","SI",663.73199999999997]
[null,null,49,298958,562,"METAN","TRAFO 1",7.5,"132/33/13,2",13.425000000000001,"2016-02-08T22:37:00","2016-02-08T23:00:59",0.39972222223877907,24,"F","NO","0,000","SI",30,"--","--",402.75,161.10000000000002,"--","--","--","--","SI",563.85]
[null,null,50,298963,562,"METAN","TRAFO 1",7.5,"132/33/13,2",13.425000000000001,"2016-02-08T23:01:00","2016-02-08T23:37:00",0.6000000000349246,36,"RF","NO","0,000","NO",3,"--","--","--","--","--","--",24.165000000000003,"--","SI",24.165000000000003]
[null,null,51,298967,2668,"JUJUY ESTE","TRAFO 1",15,"132/33/13,2",26.85,"2016-02-09T05:02:00","2016-02-09T06:05:00",1.0499999999301508,63,"F","NO","0,000","SI",30,"--","--",805.5,845.77500000000009,"--","--","--","--","SI",1651.2750000000001]
[null,null,52,298968,5691,"JUJUY ESTE","TRAFO 3",30,"132/33/13,2",53.7,"2016-02-09T05:02:00","2016-02-09T06:05:00",1.0499999999301508,63,"F","NO","0,000","SI",30,"--","--",1611,1691.5500000000002,"--","--","--","--","SI",3302.55]
[null,null,53,298971,4228,"SUNCHO CORRAL","TRAFO 2",15,"132/33/13,2",26.85,"2016-02-09T05:12:00","2016-02-09T05:51:00",0.65000000002328306,39,"R","NO",40,"SI",30,"--","--","--","--",322.2,209.43,"--","--","SI",531.63]
[null,null,54,298974,3580,"ANDALGALA","TRAFO 1",15,"132/33/13,2",26.85,"2016-02-12T13:24:00","2016-02-12T13:35:00",0.18333333323244005,11,"R","NO",60,"SI",30,"--","--","--","--",483.3,86.994,"--","--","SI",570.29399999999998]
[null,null,55,298988,4228,"SUNCHO CORRAL","TRAFO 2",15,"132/33/13,2",26.85,"2016-02-13T14:26:00","2016-02-13T14:30:00",6.6666666534729302E-2,4,"R","NO",40,"SI",30,"--","--","--","--",322.2,22.554000000000002,"--","--","SI",344.75400000000002]
[null,null,56,298991,565,"PALPALA","TRAFO 1",30,"132/33/13,2",53.7,"2016-02-13T20:08:00","2016-02-13T22:02:00",1.9000000000814907,114,"R","NO",40,"SI",30,"--","--","--","--",644.4,1224.3599999999999,"--","--","SI",1868.7599999999998]
[null,null,57,298996,4689,"ACONQUIJA","TRAFO 1",7.5,"132/33/13,2",13.425000000000001,"2016-02-14T02:33:00","2016-02-14T03:54:00",1.3500000000349246,81,"F","NO","0,000","SI",30,"--","--",402.75,543.71250000000009,"--","--","--","--","SI",946.46250000000009]
[null,null,58,299050,5062,"QUIMILI","TRAFO 1",15,"132/33/13,2",26.85,"2016-02-15T02:46:00","2016-02-15T02:50:00",6.6666666709352285E-2,4,"R","NO",40,"SI",30,"--","--","--","--",322.2,22.554000000000002,"--","--","SI",344.75400000000002]
[null,null,59,299054,3946,"CATAMARCA II","TRAFO 1",30,"132/33/13,2",53.7,"2016-02-15T15:01:00","2016-02-15T15:19:00",{"$f":"IF(F45=\"\",\"\",(L45-K45)*24)","v":0.29999999993015081},{"$f":"IF(F45=\"\",\"\",ROUND((L45-K45)*24*60,0))","v":18},"F","NO","0,000","SI",{"$f":"$I$19*IF(R45=\"SI\",1,0.1)*IF(OR(O45=\"P\",O45=\"RP\"),0.1,1)","v":30},{"$f":"IF(O45=\"P\",J45*S45*ROUND(N45/60,2),\"--\")","v":"--"},{"$f":"IF(O45=\"RP\",J45*S45*Q45/100*ROUND(N45/60,2),\"--\")","v":"--"},{"$f":"IF(AND(O45=\"F\",P45=\"NO\"),J45*S45,\"--\")","v":1611},{"$f":"IF(O45=\"F\",J45*S45*ROUND(N45/60,2),\"--\")","v":483.29999999999995},{"$f":"IF(AND(O45=\"R\",P45=\"NO\"),J45*S45*Q45/100,\"--\")","v":"--"},{"$f":"IF(O45=\"R\",J45*S45*ROUND(N45/60,2)*Q45/100,\"--\")","v":"--"},{"$f":"IF(O45=\"RF\",J45*S45*ROUND(N45/60,2),\"--\")","v":"--"},{"$f":"IF(O45=\"RR\",J45*S45*ROUND(N45/60,2)*Q45/100,\"--\")","v":"--"},"SI",{"$f":"IF(F45=\"\",\"\",SUM(T45:AA45)*IF(AB45=\"SI\",1,2))","v":2094.3000000000002}]
[null,null,60,299056,4517,"CATAMARCA II","TRAFO 2 (Res. SE 1/03)",30,"132/33/13,2",{"$f":"H46*$K$18","v":20.241},"2016-02-15T15:01:00","2016-02-15T15:19:00",{"$f":"IF(F46=\"\",\"\",(L46-K46)*24)","v":0.29999999993015081},{"$f":"IF(F46=\"\",\"\",ROUND((L46-K46)*24*60,0))","v":18},"F","NO","0,000","SI",{"$f":"$I$19*IF(R46=\"SI\",1,0.1)*IF(OR(O46=\"P\",O46=\"RP\"),0.1,1)","v":30},{"$f":"IF(O46=\"P\",J46*S46*ROUND(N46/60,2),\"--\")","v":"--"},{"$f":"IF(O46=\"RP\",J46*S46*Q46/100*ROUND(N46/60,2),\"--\")","v":"--"},{"$f":"IF(AND(O46=\"F\",P46=\"NO\"),J46*S46,\"--\")","v":607.23},{"$f":"IF(O46=\"F\",J46*S46*ROUND(N46/60,2),\"--\")","v":182.16900000000001},{"$f":"IF(AND(O46=\"R\",P46=\"NO\"),J46*S46*Q46/100,\"--\")","v":"--"},{"$f":"IF(O46=\"R\",J46*S46*ROUND(N46/60,2)*Q46/100,\"--\")","v":"--"},{"$f":"IF(O46=\"RF\",J46*S46*ROUND(N46/60,2),\"--\")","v":"--"},{"$f":"IF(O46=\"RR\",J46*S46*ROUND(N46/60,2)*Q46/100,\"--\")","v":"--"},"SI",{"$f":"IF(F46=\"\",\"\",SUM(T46:AA46)*IF(AB46=\"SI\",1,2))","v":789.399}]
[null,null,61,299058,548,"GUEMES","TRAFO 5",15,"132/13,2",26.85,"2016-02-16","2016-02-16T03:50:00",{"$f":"IF(F47=\"\",\"\",(L47-K47)*24)","v":3.8333333332557231},{"$f":"IF(F47=\"\",\"\",ROUND((L47-K47)*24*60,0))","v":230},"P","--","0,000","NO",{"$f":"$I$19*IF(R47=\"SI\",1,0.1)*IF(OR(O47=\"P\",O47=\"RP\"),0.1,1)","v":0.30000000000000004},{"$f":"IF(O47=\"P\",J47*S47*ROUND(N47/60,2),\"--\")","v":30.850650000000005},{"$f":"IF(O47=\"RP\",J47*S47*Q47/100*ROUND(N47/60,2),\"--\")","v":"--"},{"$f":"IF(AND(O47=\"F\",P47=\"NO\"),J47*S47,\"--\")","v":"--"},{"$f":"IF(O47=\"F\",J47*S47*ROUND(N47/60,2),\"--\")","v":"--"},{"$f":"IF(AND(O47=\"R\",P47=\"NO\"),J47*S47*Q47/100,\"--\")","v":"--"},{"$f":"IF(O47=\"R\",J47*S47*ROUND(N47/60,2)*Q47/100,\"--\")","v":"--"},{"$f":"IF(O47=\"RF\",J47*S47*ROUND(N47/60,2),\"--\")","v":"--"},{"$f":"IF(O47=\"RR\",J47*S47*ROUND(N47/60,2)*Q47/100,\"--\")","v":"--"},"SI",{"$f":"IF(F47=\"\",\"\",SUM(T47:AA47)*IF(AB47=\"SI\",1,2))","v":30.850650000000005}]
[]
[null,null,"(²)","P - PROGRAMADA  ; F - FORZADA  ; RP - REDUCCIÓN PROGRAMADA  ; R - REDUCCIÓN FORZADA",null,null,null,null,null,null,null,null,null,null,null,null,null,null,null,{"$f":"SUM(T22:T48)","v":5663.4705000000013},4485.0240000000003,6406.83,116142.75449999998,5219.6399999999994,3597.3630000000003,24.165000000000003,0,null,{"$f":"ROUND(SUM(AC22:AC48),2)","v":141539.25}]

{"sheet":"T-02 (2)","index":6,"n_rows":50,"n_cols":29,"rows_kept":50,"cut":false,"hidden":false,"merged":[]}
[]
[null,{"$f":"+'TOT-0216'!B2","v":"ANEXO V al  Memorandum  D.T.E.E. N°        356    / 2016"}]
[]
[" ENTE NACIONAL REGULADOR "]
["       DE LA ELECTRICIDAD"]
[]
[]
[null,null,null,null,null,"SISTEMA DE TRANSPORTE DE ENERGÍA ELÉCTRICA POR DISTRIBUCIÓN TRONCAL - TRANSNOA S.A."]
[]
[null,null,null,null,null,"2.- CONEXIÓN"]
[]
[null,null,null,null,null,"2.1.- Transformación"]
[]
[null,null,null,null,null,"2.1.1.- Equipamiento propio"]
[]
[null,{"$f":"'TOT-0216'!B14","v":"Desde el 01 al 29 de Febrero de 2016"}]
[]
[null,null,null,null,null,"Por Transformador por MVA    $ =",null,null,1.79]
[null,null,null,null,null,"Coeficiente de penalización por salida forzada   =",null,null,{"$f":"30*'TOT-0216'!B13","v":30},null,{"$f":"IF(I19=30,\" \",IF(I19=60,\"  Coeficiente duplicado por tasa de falla >4 Sal. x año/100 km.\",\"REVISAR COEFICIENTE\"))","v":" "}]
[null,null,3,4,5,6,7,8,9,10,11,12,13,14,15,16,17,18,19,20,21,22,23,24,25,26,27,28,29]
[null,null,"N°","INDISP","ID EQUIPO","ESTACIÓN\nTRANSFORMADORA","EQUIPO","POT.\n[MVA]","U\n[kV]","$/h","Salida","Entrada","Hs\nIndisp.","Mtos.\nIndisp.","Tipo \nSal.(²)","AUT.","C.R.\n%","E.N.S.","K (P;ENS)","PENALIZ.\nPROGRAM.","REDUCC.\nPROGRAM.","PENALIZAC. FORZADA\nPor Salida       hs. Restantes",null,"REDUCC. FORZADA\nPor Salida       hs. Restantes",null,"RESTANTE\nFORZADA","REDUCC.\nRESTANTE","Informó\nen Térm.","TOTAL\nPENALIZAC."]
[null,null,null,null,null,null,null,null,null,null,null,null,null,null,null,null,null,null,null,null,null,null,null,null,null,null,null,null,{"$f":"'T-02 (1)'!AC49","v":141539.25}]
[]
[null,null,62,299062,544,"ESTATICA","TRAFO 2",30,"132/13,2",{"$f":"H24*$I$18","v":53.7},"2016-02-16T11:10:00","2016-02-16T11:16:00",{"$f":"IF(F24=\"\",\"\",(L24-K24)*24)","v":9.9999999976716936E-2},{"$f":"IF(F24=\"\",\"\",ROUND((L24-K24)*24*60,0))","v":6},"R",{"$f":"IF(F24=\"\",\"\",IF(OR(O24=\"P\",O24=\"RP\"),\"--\",\"NO\"))","v":"NO"},60,"SI",{"$f":"$I$19*IF(R24=\"SI\",1,0.1)*IF(OR(O24=\"P\",O24=\"RP\"),0.1,1)","v":30},{"$f":"IF(O24=\"P\",J24*S24*ROUND(N24/60,2),\"--\")","v":"--"},{"$f":"IF(O24=\"RP\",J24*S24*Q24/100*ROUND(N24/60,2),\"--\")","v":"--"},{"$f":"IF(AND(O24=\"F\",P24=\"NO\"),J24*S24,\"--\")","v":"--"},{"$f":"IF(O24=\"F\",J24*S24*ROUND(N24/60,2),\"--\")","v":"--"},{"$f":"IF(AND(O24=\"R\",P24=\"NO\"),J24*S24*Q24/100,\"--\")","v":966.6},{"$f":"IF(O24=\"R\",J24*S24*ROUND(N24/60,2)*Q24/100,\"--\")","v":96.660000000000025},{"$f":"IF(O24=\"RF\",J24*S24*ROUND(N24/60,2),\"--\")","v":"--"},{"$f":"IF(O24=\"RR\",J24*S24*ROUND(N24/60,2)*Q24/100,\"--\")","v":"--"},"SI",{"$f":"IF(F24=\"\",\"\",SUM(T24:AA24)*IF(AB24=\"SI\",1,2))","v":1063.26}]
[null,null,63,299076,579,"SARMIENTO","TRAFO 2",30,"132/13,2",{"$f":"H25*$I$18","v":53.7},"2016-02-17T12:23:00","2016-02-17T13:31:00",{"$f":"IF(F25=\"\",\"\",(L25-K25)*24)","v":1.1333333333604969},{"$f":"IF(F25=\"\",\"\",ROUND((L25-K25)*24*60,0))","v":68},"R",{"$f":"IF(F25=\"\",\"\",IF(OR(O25=\"P\",O25=\"RP\"),\"--\",\"NO\"))","v":"NO"},60,"SI",{"$f":"$I$19*IF(R25=\"SI\",1,0.1)*IF(OR(O25=\"P\",O25=\"RP\"),0.1,1)","v":30},{"$f":"IF(O25=\"P\",J25*S25*ROUND(N25/60,2),\"--\")","v":"--"},{"$f":"IF(O25=\"RP\",J25*S25*Q25/100*ROUND(N25/60,2),\"--\")","v":"--"},{"$f":"IF(AND(O25=\"F\",P25=\"NO\"),J25*S25,\"--\")","v":"--"},{"$f":"IF(O25=\"F\",J25*S25*ROUND(N25/60,2),\"--\")","v":"--"},{"$f":"IF(AND(O25=\"R\",P25=\"NO\"),J25*S25*Q25/100,\"--\")","v":966.6},{"$f":"IF(O25=\"R\",J25*S25*ROUND(N25/60,2)*Q25/100,\"--\")","v":1092.2579999999998},{"$f":"IF(O25=\"RF\",J25*S25*ROUND(N25/60,2),\"--\")","v":"--"},{"$f":"IF(O25=\"RR\",J25*S25*ROUND(N25/60,2)*Q25/100,\"--\")","v":"--"},"SI",{"$f":"IF(F25=\"\",\"\",SUM(T25:AA25)*IF(AB25=\"SI\",1,2))","v":2058.8579999999997}]
[null,null,64,299077,5264,"SARMIENTO","TRP3",30,"132/33/13,2",53.7,"2016-02-17T12:23:00","2016-02-17T13:29:00",1.0999999999185093,66,"R","NO",60,"SI",30,"--","--","--","--",966.6,1063.2600000000002,"--","--","SI",2029.8600000000001]
[null,null,65,299096,4962,"TUCUMAN NORTE","TRP3",30,"132/33/13,2",53.7,"2016-02-18T00:17:00","2016-02-18T00:21:00",6.6666666534729302E-2,4,"R","NO",40,"SI",30,"--","--","--","--",644.4,45.108000000000004,"--","--","SI",689.50800000000004]
[null,null,66,299101,548,"GUEMES","TRAFO 5",15,"132/13,2",26.85,"2016-02-19T01:00:00","2016-02-19T04:02:00",3.0333333334419876,182,"P","--","0,000","NO",0.30000000000000004,24.406650000000003,"--","--","--","--","--","--","--","SI",24.406650000000003]
[null,null,67,299102,4228,"SUNCHO CORRAL","TRAFO 2",15,"132/33/13,2",26.85,"2016-02-19T11:36:00","2016-02-19T12:10:00",0.56666666676755995,34,"R","NO",40,"SI",30,"--","--","--","--",322.2,183.65399999999997,"--","--","SI",505.85399999999993]
[null,null,68,299107,3819,"BELEN","TRAFO 2",7.5,"132/33/13,2",13.425000000000001,"2016-02-20T00:06:00","2016-02-20T00:24:00",0.30000000010477379,18,"R","NO",60,"SI",30,"--","--","--","--",241.65,72.49499999999999,"--","--","SI",314.14499999999998]
[null,null,69,299110,4812,"R. DE LA FRONTERA","TRAFO 1",30,"132/33/13,2",53.7,"2016-02-20T12:06:00","2016-02-20T13:54:00",1.8000000001047738,108,"F","NO","0,000","SI",30,"--","--",1611,2899.8,"--","--","--","--","SI",4510.8]
[null,null,70,299116,4689,"ACONQUIJA","TRAFO 1",7.5,"132/33/13,2",13.425000000000001,"2016-02-21T08:10:00","2016-02-21T10:57:00",2.7833333333255723,167,"P","--","0,000","SI",3,111.9645,"--","--","--","--","--","--","--","SI",111.9645]
[null,null,71,299117,565,"PALPALA","TRAFO 1",30,"132/33/13,2",{"$f":"H33*$I$18","v":53.7},"2016-02-21T08:29:00","2016-02-21T13:39:00",5.1666666665696539,310,"P","--","0,000","NO",0.30000000000000004,83.28870000000002,"--","--","--","--","--","--","--","SI",83.28870000000002]
[null,null,72,299118,2668,"JUJUY ESTE","TRAFO 1",15,"132/33/13,2",26.85,"2016-02-21T18:23:00","2016-02-21T19:45:00",1.3666666665812954,82,"F","NO","0,000","SI",30,"--","--",805.5,1103.5350000000001,"--","--","--","--","SI",1909.0350000000001]
[null,null,73,299121,5691,"JUJUY ESTE","TRAFO 3",30,"132/33/13,2",53.7,"2016-02-21T18:23:00","2016-02-21T19:45:00",1.3666666665812954,82,"F","NO","0,000","SI",30,"--","--",1611,2207.0700000000002,"--","--","--","--","SI",3818.07]
[null,null,74,299493,5495,"CATAMARCA","TRAFO 3",30,"132/33/13,2",53.7,"2016-02-22T03:38:00","2016-02-22T04:01:00",0.38333333336049691,23,"R","NO",60,"SI",30,"--","--","--","--",966.6,367.30800000000005,"--","--","SI",1333.9080000000001]
[null,null,75,299499,5568,"INDEPENDENCIA","TRAFO 2",30,"132/33/13,2",53.7,"2016-02-23T08:11:00","2016-02-23T11:35:00",3.4000000000814907,204,"P","--","0,000","NO",{"$f":"$I$19*IF(R37=\"SI\",1,0.1)*IF(OR(O37=\"P\",O37=\"RP\"),0.1,1)","v":0.30000000000000004},{"$f":"IF(O37=\"P\",J37*S37*ROUND(N37/60,2),\"--\")","v":54.774000000000008},{"$f":"IF(O37=\"RP\",J37*S37*Q37/100*ROUND(N37/60,2),\"--\")","v":"--"},{"$f":"IF(AND(O37=\"F\",P37=\"NO\"),J37*S37,\"--\")","v":"--"},{"$f":"IF(O37=\"F\",J37*S37*ROUND(N37/60,2),\"--\")","v":"--"},{"$f":"IF(AND(O37=\"R\",P37=\"NO\"),J37*S37*Q37/100,\"--\")","v":"--"},{"$f":"IF(O37=\"R\",J37*S37*ROUND(N37/60,2)*Q37/100,\"--\")","v":"--"},{"$f":"IF(O37=\"RF\",J37*S37*ROUND(N37/60,2),\"--\")","v":"--"},{"$f":"IF(O37=\"RR\",J37*S37*ROUND(N37/60,2)*Q37/100,\"--\")","v":"--"},"NO",109.54800000000002]
[null,null,76,299519,4555,"ANATUYA","TRAFO 1",20,"132/33/13,2",35.799999999999997,"2016-02-24T10:48:00","2016-02-24T11:01:00",0.21666666667442769,13,"R","NO",60,"NO",3,"--","--","--","--",64.44,14.176799999999998,"--","--","SI",78.616799999999998]
[null,null,77,299523,570,"SALTA SUR","TRAFO 3",30,"132/33/13,2",53.7,"2016-02-26T13:34:00","2016-02-26T13:42:00",0.13333333324408159,8,"R","NO",60,"SI",30,"--","--","--","--",966.6,125.65800000000002,"--","--","SI",1092.258]
[null,null,78,299524,568,"SALTA SUR","TRAFO 1",30,"132/13,2",53.7,"2016-02-26T13:34:00","2016-02-26T13:42:00",0.13333333324408159,8,"R","NO",60,"SI",{"$f":"$I$19*IF(R40=\"SI\",1,0.1)*IF(OR(O40=\"P\",O40=\"RP\"),0.1,1)","v":30},{"$f":"IF(O40=\"P\",J40*S40*ROUND(N40/60,2),\"--\")","v":"--"},{"$f":"IF(O40=\"RP\",J40*S40*Q40/100*ROUND(N40/60,2),\"--\")","v":"--"},{"$f":"IF(AND(O40=\"F\",P40=\"NO\"),J40*S40,\"--\")","v":"--"},{"$f":"IF(O40=\"F\",J40*S40*ROUND(N40/60,2),\"--\")","v":"--"},{"$f":"IF(AND(O40=\"R\",P40=\"NO\"),J40*S40*Q40/100,\"--\")","v":966.6},{"$f":"IF(O40=\"R\",J40*S40*ROUND(N40/60,2)*Q40/100,\"--\")","v":125.65800000000002},{"$f":"IF(O40=\"RF\",J40*S40*ROUND(N40/60,2),\"--\")","v":"--"},{"$f":"IF(O40=\"RR\",J40*S40*ROUND(N40/60,2)*Q40/100,\"--\")","v":"--"},"SI",1092.258]
[null,null,79,299547,556,"LA BANDA","TRAFO 1",30,"132/33/13,2",53.7,"2016-02-26T22:06:00","2016-02-26T22:55:00",0.81666666670935228,49,"R","NO",60,"SI",{"$f":"$I$19*IF(R41=\"SI\",1,0.1)*IF(OR(O41=\"P\",O41=\"RP\"),0.1,1)","v":30},{"$f":"IF(O41=\"P\",J41*S41*ROUND(N41/60,2),\"--\")","v":"--"},{"$f":"IF(O41=\"RP\",J41*S41*Q41/100*ROUND(N41/60,2),\"--\")","v":"--"},{"$f":"IF(AND(O41=\"F\",P41=\"NO\"),J41*S41,\"--\")","v":"--"},{"$f":"IF(O41=\"F\",J41*S41*ROUND(N41/60,2),\"--\")","v":"--"},{"$f":"IF(AND(O41=\"R\",P41=\"NO\"),J41*S41*Q41/100,\"--\")","v":966.6},{"$f":"IF(O41=\"R\",J41*S41*ROUND(N41/60,2)*Q41/100,\"--\")","v":792.61199999999997},{"$f":"IF(O41=\"RF\",J41*S41*ROUND(N41/60,2),\"--\")","v":"--"},{"$f":"IF(O41=\"RR\",J41*S41*ROUND(N41/60,2)*Q41/100,\"--\")","v":"--"},"SI",1759.212]
[null,null,80,299755,5770,"SANTIAGO ESTE","TRAFO 2",30,"132/13,2",{"$f":"H42*$I$18","v":53.7},"2016-02-29T07:26:00","2016-02-29T09:50:00",{"$f":"IF(F42=\"\",\"\",(L42-K42)*24)","v":2.3999999999650754},{"$f":"IF(F42=\"\",\"\",ROUND((L42-K42)*24*60,0))","v":144},"P",{"$f":"IF(F42=\"\",\"\",IF(OR(O42=\"P\",O42=\"RP\"),\"--\",\"NO\"))","v":"--"},"0,000","NO",{"$f":"$I$19*IF(R42=\"SI\",1,0.1)*IF(OR(O42=\"P\",O42=\"RP\"),0.1,1)","v":0.30000000000000004},{"$f":"IF(O42=\"P\",J42*S42*ROUND(N42/60,2),\"--\")","v":38.664000000000009},{"$f":"IF(O42=\"RP\",J42*S42*Q42/100*ROUND(N42/60,2),\"--\")","v":"--"},{"$f":"IF(AND(O42=\"F\",P42=\"NO\"),J42*S42,\"--\")","v":"--"},{"$f":"IF(O42=\"F\",J42*S42*ROUND(N42/60,2),\"--\")","v":"--"},{"$f":"IF(AND(O42=\"R\",P42=\"NO\"),J42*S42*Q42/100,\"--\")","v":"--"},{"$f":"IF(O42=\"R\",J42*S42*ROUND(N42/60,2)*Q42/100,\"--\")","v":"--"},{"$f":"IF(O42=\"RF\",J42*S42*ROUND(N42/60,2),\"--\")","v":"--"},{"$f":"IF(O42=\"RR\",J42*S42*ROUND(N42/60,2)*Q42/100,\"--\")","v":"--"},"SI",{"$f":"IF(F42=\"\",\"\",SUM(T42:AA42)*IF(AB42=\"SI\",1,2))","v":38.664000000000009}]
[null,null,81,299556,2668,"JUJUY ESTE","TRAFO 1",15,"132/33/13,2",26.85,"2016-02-28T08:00:00","2016-02-28T15:15:00",7.2499999998835847,435,"P","--","0,000","NO",0.30000000000000004,58.398750000000014,"--","--","--","--","--","--","--","SI",58.398750000000014]
[null,null,82,299557,5691,"JUJUY ESTE","TRAFO 3",30,"132/33/13,2",53.7,"2016-02-28T08:00:00","2016-02-28T15:15:00",7.2499999998835847,435,"P","--","0,000","NO",0.30000000000000004,116.79750000000003,"--","--","--","--","--","--","--","SI",116.79750000000003]
[null,null,83,299558,557,"LA BANDA","TRAFO 2",30,"132/33/13,2",53.7,"2016-02-28T20:34:00","2016-02-28T21:05:00",0.5166666666045785,31,"R","NO",60,"SI",30,"--","--","--","--",966.6,502.63200000000006,"--","--","SI",{"$f":"IF(F45=\"\",\"\",SUM(T45:AA45)*IF(AB45=\"SI\",1,2))","v":1469.232}]
[null,null,84,299565,557,"LA BANDA","TRAFO 2",30,"132/33/13,2",53.7,"2016-02-28T21:06:00","2016-02-28T21:24:00",0.30000000010477379,18,"RR",{"$f":"IF(F46=\"\",\"\",IF(OR(O46=\"P\",O46=\"RP\"),\"--\",\"NO\"))","v":"NO"},60,"NO",{"$f":"$I$19*IF(R46=\"SI\",1,0.1)*IF(OR(O46=\"P\",O46=\"RP\"),0.1,1)","v":3},{"$f":"IF(O46=\"P\",J46*S46*ROUND(N46/60,2),\"--\")","v":"--"},{"$f":"IF(O46=\"RP\",J46*S46*Q46/100*ROUND(N46/60,2),\"--\")","v":"--"},{"$f":"IF(AND(O46=\"F\",P46=\"NO\"),J46*S46,\"--\")","v":"--"},{"$f":"IF(O46=\"F\",J46*S46*ROUND(N46/60,2),\"--\")","v":"--"},{"$f":"IF(AND(O46=\"R\",P46=\"NO\"),J46*S46*Q46/100,\"--\")","v":"--"},{"$f":"IF(O46=\"R\",J46*S46*ROUND(N46/60,2)*Q46/100,\"--\")","v":"--"},{"$f":"IF(O46=\"RF\",J46*S46*ROUND(N46/60,2),\"--\")","v":"--"},{"$f":"IF(O46=\"RR\",J46*S46*ROUND(N46/60,2)*Q46/100,\"--\")","v":28.998000000000001},"SI",{"$f":"IF(F46=\"\",\"\",SUM(T46:AA46)*IF(AB46=\"SI\",1,2))","v":28.998000000000001}]
[null,null,85,299760,4484,"AGUA BLANCA","TRAFO 1",30,"132/33/13,2",53.7,"2016-02-29T17:33:00","2016-02-29T17:39:00",0.10000000015133992,6,"R","NO",60,"SI",30,"--","--","--","--",966.6,96.660000000000025,"--","--","SI",1063.26]
[null,null,86,299767,3628,"AGUA BLANCA","TRAFO 2",30,"132/33/13,2",53.7,"2016-02-29T17:33:00","2016-02-29T17:39:00",{"$f":"IF(F48=\"\",\"\",(L48-K48)*24)","v":0.10000000015133992},{"$f":"IF(F48=\"\",\"\",ROUND((L48-K48)*24*60,0))","v":6},"R","NO",60,"SI",30,"--","--","--","--",966.6,96.660000000000025,"--","--","SI",1063.26]
[null,null,null,null,null,null,null,null,null,0,null,null,{"$f":"IF(F49=\"\",\"\",(L49-K49)*24)","v":""},{"$f":"IF(F49=\"\",\"\",ROUND((L49-K49)*24*60,0))","v":""},null,"",null,null,3,"--","--","--","--","--","--","--","--",null,""]
[null,null,"(²)","P - PROGRAMADA  ; F - FORZADA   ; R - REDUCCIÓN FORZADA  ",null,null,null,null,null,null,null,null,null,null,null,null,null,null,null,{"$f":"SUM(T22:T49)","v":488.29410000000001},0,4027.5,6210.4050000000007,10938.690000000002,4674.7997999999998,0,28.998000000000001,null,{"$f":"ROUND(SUM(AC22:AC49),2)","v":167962.71}]

{"sheet":"T-EDESA-02 (1)","index":7,"n_rows":46,"n_cols":29,"rows_kept":46,"cut":false,"hidden":false,"merged":[]}
[]
[null,{"$f":"+'TOT-0216'!B2","v":"ANEXO V al  Memorandum  D.T.E.E. N°        356    / 2016"}]
[]
[" ENTE NACIONAL REGULADOR "]
["       DE LA ELECTRICIDAD"]
[]
[]
[null,null,null,null,null,"SISTEMA DE TRANSPORTE DE ENERGÍA ELÉCTRICA POR DISTRIBUCIÓN TRONCAL - TRANSNOA S.A."]
[]
[null,null,null,null,null,"2.- CONEXIÓN"]
[]
[null,null,null,null,null,"2.1.- Transformación"]
[]
[null,null,null,null,null,"2.1.2.- Transportista Independiente EDESA S.A."]
[]
[null,{"$f":"'TOT-0216'!B14","v":"Desde el 01 al 29 de Febrero de 2016"}]
[]
[null,null,null,null,null,"Por Transformador por MVA    $ =",null,null,0.18099999999999999]
[null,null,null,null,null,"Coeficiente de penalización por salida forzada   =",null,null,{"$f":"30*'TOT-0216'!B13","v":30},null,{"$f":"IF(I19=30,\" \",IF(I19=60,\"  Coeficiente duplicado por tasa de falla >4 Sal. x año/100 km.\",\"REVISAR COEFICIENTE\"))","v":" "}]
[null,null,3,4,5,6,7,8,9,10,11,12,13,14,15,16,17,18,19,20,21,22,23,24,25,26,27,28,29]
[null,null,"N°","INDISP","ID EQUIPO","ESTACIÓN\nTRANSFORMADORA","EQUIPO","POT.\n[MVA]","U\n[kV]","$/h","Salida","Entrada","Hs\nIndisp.","Mtos.\nIndisp.","Tipo \nSal.(²)","AUT.","C.R.\n%","E.N.S.","K (P;ENS)","PENALIZ.\nPROGRAM.","REDUCC.\nPROGRAM.","PENALIZAC. FORZADA\nPor Salida       hs. Restantes",null,"REDUCC. FORZADA\nPor Salida       hs. Restantes",null,"RESTANTE\nFORZADA","REDUCC.\nRESTANTE","Informó\nen Térm.","TOTAL\nPENALIZAC."]
[]
[]
[null,null,87,298975,2718,"J. V. GONZALEZ","TRAFO 1",7.5,"132/33/13,2",{"$f":"H24*$I$18","v":1.3574999999999999},"2016-02-12T20:09:00","2016-02-12T21:07:00",{"$f":"IF(F24=\"\",\"\",(L24-K24)*24)","v":0.96666666667442769},{"$f":"IF(F24=\"\",\"\",ROUND((L24-K24)*24*60,0))","v":58},"F",{"$f":"IF(F24=\"\",\"\",IF(OR(O24=\"P\",O24=\"RP\"),\"--\",\"NO\"))","v":"NO"},"0,000","SI",{"$f":"$I$19*IF(R24=\"SI\",1,0.1)*IF(OR(O24=\"P\",O24=\"RP\"),0.1,1)","v":30},{"$f":"IF(O24=\"P\",J24*S24*ROUND(N24/60,2),\"--\")","v":"--"},{"$f":"IF(O24=\"RP\",J24*S24*Q24/100*ROUND(N24/60,2),\"--\")","v":"--"},{"$f":"IF(AND(O24=\"F\",P24=\"NO\"),J24*S24,\"--\")","v":40.724999999999994},{"$f":"IF(O24=\"F\",J24*S24*ROUND(N24/60,2),\"--\")","v":39.503249999999994},{"$f":"IF(AND(O24=\"R\",P24=\"NO\"),J24*S24*Q24/100,\"--\")","v":"--"},{"$f":"IF(O24=\"R\",J24*S24*ROUND(N24/60,2)*Q24/100,\"--\")","v":"--"},{"$f":"IF(O24=\"RF\",J24*S24*ROUND(N24/60,2),\"--\")","v":"--"},{"$f":"IF(O24=\"RR\",J24*S24*ROUND(N24/60,2)*Q24/100,\"--\")","v":"--"},"SI",{"$f":"IF(F24=\"\",\"\",SUM(T24:AA24)*IF(AB24=\"SI\",1,2))","v":80.228249999999989}]
[null,null,88,298981,3758,"J. V. GONZALEZ","TRAFO 2",7.5,"132/33/13,2",{"$f":"H25*$I$18","v":1.3574999999999999},"2016-02-12T20:20:00","2016-02-12T20:35:00",{"$f":"IF(F25=\"\",\"\",(L25-K25)*24)","v":0.25000000011641532},{"$f":"IF(F25=\"\",\"\",ROUND((L25-K25)*24*60,0))","v":15},"F",{"$f":"IF(F25=\"\",\"\",IF(OR(O25=\"P\",O25=\"RP\"),\"--\",\"NO\"))","v":"NO"},"0,000","SI",{"$f":"$I$19*IF(R25=\"SI\",1,0.1)*IF(OR(O25=\"P\",O25=\"RP\"),0.1,1)","v":30},{"$f":"IF(O25=\"P\",J25*S25*ROUND(N25/60,2),\"--\")","v":"--"},{"$f":"IF(O25=\"RP\",J25*S25*Q25/100*ROUND(N25/60,2),\"--\")","v":"--"},{"$f":"IF(AND(O25=\"F\",P25=\"NO\"),J25*S25,\"--\")","v":40.724999999999994},{"$f":"IF(O25=\"F\",J25*S25*ROUND(N25/60,2),\"--\")","v":10.181249999999999},{"$f":"IF(AND(O25=\"R\",P25=\"NO\"),J25*S25*Q25/100,\"--\")","v":"--"},{"$f":"IF(O25=\"R\",J25*S25*ROUND(N25/60,2)*Q25/100,\"--\")","v":"--"},{"$f":"IF(O25=\"RF\",J25*S25*ROUND(N25/60,2),\"--\")","v":"--"},{"$f":"IF(O25=\"RR\",J25*S25*ROUND(N25/60,2)*Q25/100,\"--\")","v":"--"},"SI",{"$f":"IF(F25=\"\",\"\",SUM(T25:AA25)*IF(AB25=\"SI\",1,2))","v":50.906249999999993}]
[null,null,null,null,null,null,null,null,null,{"$f":"H26*$I$18","v":0},null,null,"","",null,{"$f":"IF(F26=\"\",\"\",IF(OR(O26=\"P\",O26=\"RP\"),\"--\",\"NO\"))","v":""},{"$f":"IF(F26=\"\",\"\",\"--\")","v":""},null,3,"--","--","--","--","--","--","--","--",{"$f":"IF(F26=\"\",\"\",\"SI\")","v":""},""]
[null,null,null,null,null,null,null,null,null,0,null,null,"","",null,"","",null,3,"--","--","--","--","--","--","--","--","",""]
[null,null,null,null,null,null,null,null,null,0,null,null,"","",null,"","",null,3,"--","--","--","--","--","--","--","--","",""]
[null,null,null,null,null,null,null,null,null,0,null,null,"","",null,"","",null,3,"--","--","--","--","--","--","--","--","",""]
[null,null,null,null,null,null,null,null,null,0,null,null,"","",null,"","",null,3,"--","--","--","--","--","--","--","--","",""]
[null,null,null,null,null,null,null,null,null,0,null,null,"","",null,"","",null,3,"--","--","--","--","--","--","--","--","",""]
[null,null,null,null,null,null,null,null,null,0,null,null,"","",null,"","",null,3,"--","--","--","--","--","--","--","--","",""]
[null,null,null,null,null,null,null,null,null,0,null,null,"","",null,"","",null,3,"--","--","--","--","--","--","--","--","",""]
[null,null,null,null,null,null,null,null,null,0,null,null,"","",null,"","",null,3,"--","--","--","--","--","--","--","--","",""]
[null,null,null,null,null,null,null,null,null,0,null,null,"","",null,"","",null,3,"--","--","--","--","--","--","--","--","",""]
[null,null,null,null,null,null,null,null,null,0,null,null,"","",null,"","",null,3,"--","--","--","--","--","--","--","--","",""]
[null,null,null,null,null,null,null,null,null,0,null,null,"","",null,"","",null,3,"--","--","--","--","--","--","--","--","",""]
[null,null,null,null,null,null,null,null,null,0,null,null,"","",null,"","",null,3,"--","--","--","--","--","--","--","--","",""]
[null,null,null,null,null,null,null,null,null,0,null,null,"","",null,"","",null,3,"--","--","--","--","--","--","--","--","",""]
[null,null,null,null,null,null,null,null,null,0,null,null,"","",null,"","",null,3,"--","--","--","--","--","--","--","--","",""]
[null,null,null,null,null,null,null,null,null,0,null,null,"","",null,"","",null,3,"--","--","--","--","--","--","--","--","",""]
[null,null,null,null,null,null,null,null,null,0,null,null,"","",null,"","",null,3,"--","--","--","--","--","--","--","--","",""]
[null,null,null,null,null,null,null,null,null,0,null,null,"","",null,"","",null,3,"--","--","--","--","--","--","--","--","",""]
[null,null,null,null,null,null,null,null,null,0,null,null,"","",null,"","",null,3,"--","--","--","--","--","--","--","--","",""]
[]
[null,null,"(²)","F - FORZADA",null,null,null,null,null,null,null,null,null,null,null,null,null,null,null,{"$f":"SUM(T22:T45)","v":0},0,81.449999999999989,49.684499999999993,0,0,0,0,null,{"$f":"ROUND(SUM(AC22:AC45),2)","v":131.13}]

{"sheet":"SUP-EDESA","index":8,"n_rows":54,"n_cols":14,"rows_kept":54,"cut":false,"hidden":false,"merged":[]}
[]
[null,{"$f":"+'TOT-0216'!B2","v":"ANEXO V al  Memorandum  D.T.E.E. N°        356    / 2016"}]
["ENTE NACIONAL REGULADOR "]
["DE LA ELECTRICIDAD"]
[]
[]
[null,null,null,"SISTEMA DE TRANSPORTE DE ENERGÍA ELÉCTRICA POR DISTRIBUCIÓN TRONCAL - TRANSNOA S.A."]
[]
[null,null,null,"3.1- SUPERVISIÓN - Transportista Independiente EDESA S.A."]
[]
[null,{"$f":"'TOT-0216'!B14","v":"Desde el 01 al 29 de Febrero de 2016"}]
[]
[]
[]
[null,null,"a) Datos"]
[null,null,null,null,null,null,null,null,"$/100 km-h : LÍNEAS 132 kV ",514.20399999999995,null,"Salida en 132 kV o 66 kV = "," - "]
[null,null,null,"Tiempo de servicio =",{"$f":"MID(B11,16,2)*24","v":696},"hs",null,null,"Cargo por Transformador por MVA = ",1.79,null,"Salida en 33 kV ",17.934999999999999]
[null,null,null,"Porcentaje por Supervisión  =",2.5000000000000001E-2,null,null,null,null,null,null,"Salida en 13,2 kV =",17.934999999999999]
[]
[null,null,"b) SM:  es la suma de las sanciones a que en cada mes se hiciere pasible el Transportista Independiente, valorizadas con idénticos criterios que los que se aplican a la Concesionaria."]
[]
[null,null,null,"SANCIÓN al T.I.",null,"LÍNEAS",null,null,47931.519999999997,null,null,"SEGÚN 1.2."]
[null,null,null,null,null,"TRANSFORMACIÓN",null,null,1171.52,null,null,"SEGÚN 2.1.2."]
[null,null,null,null,null,"SALIDAS",null,null,0]
[]
[null,null,null,null,null,null,null,"SM =",{"$f":"SUM(I22:I25)","v":49103.039999999994}]
[]
[null,null,"c) RM : es la remuneración que mensualmente recibiría el Transportista Independiente, si su servicio fuera valorizado conforme al régimen remuneratorio que se aplica a la Concesionaria."]
[]
[null,null,null,"Cargo por Capacidad de Transporte","U [kV]","Long [km]",null,"Cargo por C. T.",{"$f":"\"Cargo por E.E.T.\"","v":"Cargo por E.E.T."},null,null,"TOTAL"]
[null,null,null,"METAN - EL TUNAL",132,75.599999999999994,null,{"$f":"F31*$J$16*$E$17/100","v":270561.80390399991},5787,{"$f":"\"(DTE \"&DATO!$G$14&DATO!$H$14&\")\"","v":"(DTE 0216)"},null,{"$f":"SUM(H31:K31)","v":276348.80390399991}]
[null,null,null,"EL TUNAL - J.V.GONZALEZ",132,41.4,null,{"$f":"F32*$J$16*$E$17/100","v":148164.79737599997},11293,{"$f":"\"(DTE \"&DATO!$G$14&DATO!$H$14&\")\"","v":"(DTE 0216)"},null,{"$f":"SUM(H32:K32)","v":159457.79737599997}]
[null,null,null,null,null,null,null,null,null,null,null,{"$f":"SUM(L31:L32)","v":435806.60127999989}]
[]
[null,null,null,"Cargo por Capacidad de Transformación","Equipo","Pot [MVA]",null,"Cargo por C. T.",null,"E.T",null,"Salida","U [kV]","Cargo"]
[null,null,null,"J.V. GONZALEZ","T1",7.5,null,{"$f":"+F36*$J$17*$E$17","v":9343.8000000000011},null,"J.V. GONZALEZ",null,"Alimentador Tolloche",33,{"$f":"$M$17*$E$17","v":12482.759999999998}]
[null,null,null,"J.V. GONZALEZ","T2",7.5,null,{"$f":"+F37*$J$17*$E$17","v":9343.8000000000011},null,"J.V. GONZALEZ",null,"Alimentador Lajitas",33,{"$f":"$M$17*$E$17","v":12482.759999999998}]
[null,null,null,"EL TUNAL","T1",7.5,null,{"$f":"+F38*$J$17*$E$17","v":9343.8000000000011},null,"J.V. GONZALEZ",null,"Alimentador J. V. Gonzalez",13.2,{"$f":"$M$17*$E$17","v":12482.759999999998}]
[null,null,null,"EL TUNAL","T2",7.5,null,{"$f":"+F39*$J$17*$E$17","v":9343.8000000000011},null,"J.V. GONZALEZ",null,"Alimentador El Tunal",13.2,{"$f":"$M$17*$E$17","v":12482.759999999998}]
[null,null,null,null,null,null,null,{"$f":"SUM(H36:H39)","v":37375.200000000004},null,"J.V. GONZALEZ",null,"Alimentador Quebrachal",13.2,{"$f":"$M$17*$E$17","v":12482.759999999998}]
[null,null,null,null,null,null,null,null,null,null,null,null,null,{"$f":"SUM(N36:N40)","v":62413.799999999988}]
[]
[null,null,null,null,null,null,null,"RM =",{"$f":"+H40+N41+L33","v":535595.60127999983},null,"RM * =",69444.311680000013]
[]
[null,null,"d) CS: Es el cargo por Supervisión de la Operación que la Transportista percibe por supervisar la operación y mantenimiento del Transportista Independiente."]
[]
[null,null,null,"Cargo por Supervisión afectado a la sanción ",null,null,null,"CS =",{"$f":"E18*L43","v":1736.1077920000005},null,"RM * = SE EMPLEA PARA EL CALCULO DE CS"]
[]
[null,null,"e) SANCIÓN"]
[null,null,null,"Sanción Calculada",{"$f":"10*I26*I47/I43","v":1591.6518013059906}]
[]
[null,null,null,"TOTAL A PENALIZAR A TRANSNOA S.A. POR SUPERVISIÓN A  EDESA S.A."]
[]
[null,null,null,null,null,null,null,"SANCIÓN  =",{"$f":"IF($E$50>3*I47,3*I47,$E$50)","v":1591.6518013059906}]

{"sheet":"Tasa de Falla","index":9,"n_rows":153,"n_cols":19,"rows_kept":153,"cut":false,"hidden":false,"merged":[[2,0,2,2],[3,0,3,2],[152,11,152,12]]}
[]
[null,{"$f":"'TOT-0216'!B2","v":"ANEXO V al  Memorandum  D.T.E.E. N°        356    / 2016"}]
["ENTE NACIONAL REGULADOR "]
["DE LA ELECTRICIDAD"]
[]
[null,"SISTEMA DE TRANSPORTE DE ENERGÍA ELÉCTRICA POR DISTRIBUCIÓN TRONCAL "]
[]
[null,"TRANSNOA S.A."]
[]
[null,"INDISPONIBILIDADES FORZADAS DE LÍNEAS - TASA DE FALLA"]
[]
[]
[null,"y",null,{"$f":"'TOT-0216'!B14","v":"Desde el 01 al 29 de Febrero de 2016"}]
[]
[null,null,"N°","LÍNEAS","U\n[kV]","Long.\n[km]","2015-02-01","2015-03-01","2015-04-01","2015-05-01","2015-06-01","2015-07-01","2015-08-01","2015-09-01","2015-10-01","2015-11-01","2015-12-01","2016-01-01","2016-02-01"]
[]
[null,null,{"$f":"'[2]Tasa de Falla'!C17","v":1},{"$f":"'[2]Tasa de Falla'!D17","v":"AGUA BLANCA - VILLA QUINTEROS"},{"$f":"'[2]Tasa de Falla'!E17","v":132},{"$f":"'[2]Tasa de Falla'!F17","v":23.8},{"$f":"IF('[2]Tasa de Falla'!IU17=0,\"\",'[2]Tasa de Falla'!IU17)","v":""},{"$f":"IF('[2]Tasa de Falla'!IV17=0,\"\",'[2]Tasa de Falla'!IV17)","v":""},{"$f":"IF('[2]Tasa de Falla'!IW17=0,\"\",'[2]Tasa de Falla'!IW17)","v":""},{"$f":"IF('[2]Tasa de Falla'!IX17=0,\"\",'[2]Tasa de Falla'!IX17)","v":""},{"$f":"IF('[2]Tasa de Falla'!IY17=0,\"\",'[2]Tasa de Falla'!IY17)","v":""},{"$f":"IF('[2]Tasa de Falla'!IZ17=0,\"\",'[2]Tasa de Falla'!IZ17)","v":""},{"$f":"IF('[2]Tasa de Falla'!JA17=0,\"\",'[2]Tasa de Falla'!JA17)","v":""},{"$f":"IF('[2]Tasa de Falla'!JB17=0,\"\",'[2]Tasa de Falla'!JB17)","v":""},{"$f":"IF('[2]Tasa de Falla'!JC17=0,\"\",'[2]Tasa de Falla'!JC17)","v":""},{"$f":"IF('[2]Tasa de Falla'!JD17=0,\"\",'[2]Tasa de Falla'!JD17)","v":""},{"$f":"IF('[2]Tasa de Falla'!JE17=0,\"\",'[2]Tasa de Falla'!JE17)","v":""},{"$f":"IF('[2]Tasa de Falla'!JF17=0,\"\",'[2]Tasa de Falla'!JF17)","v":""}]
[null,null,{"$f":"'[2]Tasa de Falla'!C18","v":2},{"$f":"'[2]Tasa de Falla'!D18","v":"AGUILARES - ESCABA"},{"$f":"'[2]Tasa de Falla'!E18","v":132},{"$f":"'[2]Tasa de Falla'!F18","v":27},{"$f":"IF('[2]Tasa de Falla'!IU18=0,\"\",'[2]Tasa de Falla'!IU18)","v":""},{"$f":"IF('[2]Tasa de Falla'!IV18=0,\"\",'[2]Tasa de Falla'!IV18)","v":""},{"$f":"IF('[2]Tasa de Falla'!IW18=0,\"\",'[2]Tasa de Falla'!IW18)","v":""},{"$f":"IF('[2]Tasa de Falla'!IX18=0,\"\",'[2]Tasa de Falla'!IX18)","v":""},{"$f":"IF('[2]Tasa de Falla'!IY18=0,\"\",'[2]Tasa de Falla'!IY18)","v":""},{"$f":"IF('[2]Tasa de Falla'!IZ18=0,\"\",'[2]Tasa de Falla'!IZ18)","v":""},{"$f":"IF('[2]Tasa de Falla'!JA18=0,\"\",'[2]Tasa de Falla'!JA18)","v":2},{"$f":"IF('[2]Tasa de Falla'!JB18=0,\"\",'[2]Tasa de Falla'!JB18)","v":""},{"$f":"IF('[2]Tasa de Falla'!JC18=0,\"\",'[2]Tasa de Falla'!JC18)","v":""},{"$f":"IF('[2]Tasa de Falla'!JD18=0,\"\",'[2]Tasa de Falla'!JD18)","v":""},{"$f":"IF('[2]Tasa de Falla'!JE18=0,\"\",'[2]Tasa de Falla'!JE18)","v":""},{"$f":"IF('[2]Tasa de Falla'!JF18=0,\"\",'[2]Tasa de Falla'!JF18)","v":""}]
[null,null,{"$f":"'[2]Tasa de Falla'!C19","v":3},{"$f":"'[2]Tasa de Falla'!D19","v":"CABRA CORRAL - SALTA SUR"},{"$f":"'[2]Tasa de Falla'!E19","v":132},{"$f":"'[2]Tasa de Falla'!F19","v":62},{"$f":"IF('[2]Tasa de Falla'!IU19=0,\"\",'[2]Tasa de Falla'!IU19)","v":"XXXX"},{"$f":"IF('[2]Tasa de Falla'!IV19=0,\"\",'[2]Tasa de Falla'!IV19)","v":"XXXX"},{"$f":"IF('[2]Tasa de Falla'!IW19=0,\"\",'[2]Tasa de Falla'!IW19)","v":"XXXX"},{"$f":"IF('[2]Tasa de Falla'!IX19=0,\"\",'[2]Tasa de Falla'!IX19)","v":"XXXX"},{"$f":"IF('[2]Tasa de Falla'!IY19=0,\"\",'[2]Tasa de Falla'!IY19)","v":"XXXX"},{"$f":"IF('[2]Tasa de Falla'!IZ19=0,\"\",'[2]Tasa de Falla'!IZ19)","v":"XXXX"},{"$f":"IF('[2]Tasa de Falla'!JA19=0,\"\",'[2]Tasa de Falla'!JA19)","v":"XXXX"},{"$f":"IF('[2]Tasa de Falla'!JB19=0,\"\",'[2]Tasa de Falla'!JB19)","v":"XXXX"},{"$f":"IF('[2]Tasa de Falla'!JC19=0,\"\",'[2]Tasa de Falla'!JC19)","v":"XXXX"},{"$f":"IF('[2]Tasa de Falla'!JD19=0,\"\",'[2]Tasa de Falla'!JD19)","v":"XXXX"},{"$f":"IF('[2]Tasa de Falla'!JE19=0,\"\",'[2]Tasa de Falla'!JE19)","v":"XXXX"},{"$f":"IF('[2]Tasa de Falla'!JF19=0,\"\",'[2]Tasa de Falla'!JF19)","v":"XXXX"}]
[null,null,{"$f":"'[2]Tasa de Falla'!C20","v":4},{"$f":"'[2]Tasa de Falla'!D20","v":"CEVIL POZO - TUCUMAN NORTE"},{"$f":"'[2]Tasa de Falla'!E20","v":132},{"$f":"'[2]Tasa de Falla'!F20","v":14.5},{"$f":"IF('[2]Tasa de Falla'!IU20=0,\"\",'[2]Tasa de Falla'!IU20)","v":""},{"$f":"IF('[2]Tasa de Falla'!IV20=0,\"\",'[2]Tasa de Falla'!IV20)","v":""},{"$f":"IF('[2]Tasa de Falla'!IW20=0,\"\",'[2]Tasa de Falla'!IW20)","v":""},{"$f":"IF('[2]Tasa de Falla'!IX20=0,\"\",'[2]Tasa de Falla'!IX20)","v":""},{"$f":"IF('[2]Tasa de Falla'!IY20=0,\"\",'[2]Tasa de Falla'!IY20)","v":""},{"$f":"IF('[2]Tasa de Falla'!IZ20=0,\"\",'[2]Tasa de Falla'!IZ20)","v":""},{"$f":"IF('[2]Tasa de Falla'!JA20=0,\"\",'[2]Tasa de Falla'!JA20)","v":""},{"$f":"IF('[2]Tasa de Falla'!JB20=0,\"\",'[2]Tasa de Falla'!JB20)","v":""},{"$f":"IF('[2]Tasa de Falla'!JC20=0,\"\",'[2]Tasa de Falla'!JC20)","v":""},{"$f":"IF('[2]Tasa de Falla'!JD20=0,\"\",'[2]Tasa de Falla'!JD20)","v":""},{"$f":"IF('[2]Tasa de Falla'!JE20=0,\"\",'[2]Tasa de Falla'!JE20)","v":""},{"$f":"IF('[2]Tasa de Falla'!JF20=0,\"\",'[2]Tasa de Falla'!JF20)","v":""}]
[null,null,{"$f":"'[2]Tasa de Falla'!C21","v":5},{"$f":"'[2]Tasa de Falla'!D21","v":"CAMPO SANTO - MINETTI"},{"$f":"'[2]Tasa de Falla'!E21","v":132},{"$f":"'[2]Tasa de Falla'!F21","v":29.9},{"$f":"IF('[2]Tasa de Falla'!IU21=0,\"\",'[2]Tasa de Falla'!IU21)","v":"XXXX"},{"$f":"IF('[2]Tasa de Falla'!IV21=0,\"\",'[2]Tasa de Falla'!IV21)","v":"XXXX"},{"$f":"IF('[2]Tasa de Falla'!IW21=0,\"\",'[2]Tasa de Falla'!IW21)","v":"XXXX"},{"$f":"IF('[2]Tasa de Falla'!IX21=0,\"\",'[2]Tasa de Falla'!IX21)","v":"XXXX"},{"$f":"IF('[2]Tasa de Falla'!IY21=0,\"\",'[2]Tasa de Falla'!IY21)","v":"XXXX"},{"$f":"IF('[2]Tasa de Falla'!IZ21=0,\"\",'[2]Tasa de Falla'!IZ21)","v":"XXXX"},{"$f":"IF('[2]Tasa de Falla'!JA21=0,\"\",'[2]Tasa de Falla'!JA21)","v":"XXXX"},{"$f":"IF('[2]Tasa de Falla'!JB21=0,\"\",'[2]Tasa de Falla'!JB21)","v":"XXXX"},{"$f":"IF('[2]Tasa de Falla'!JC21=0,\"\",'[2]Tasa de Falla'!JC21)","v":"XXXX"},{"$f":"IF('[2]Tasa de Falla'!JD21=0,\"\",'[2]Tasa de Falla'!JD21)","v":"XXXX"},{"$f":"IF('[2]Tasa de Falla'!JE21=0,\"\",'[2]Tasa de Falla'!JE21)","v":"XXXX"},{"$f":"IF('[2]Tasa de Falla'!JF21=0,\"\",'[2]Tasa de Falla'!JF21)","v":"XXXX"}]
[null,null,{"$f":"'[2]Tasa de Falla'!C22","v":6},{"$f":"'[2]Tasa de Falla'!D22","v":"ESCABA - HUACRA"},{"$f":"'[2]Tasa de Falla'!E22","v":132},{"$f":"'[2]Tasa de Falla'!F22","v":49.9},{"$f":"IF('[2]Tasa de Falla'!IU22=0,\"\",'[2]Tasa de Falla'!IU22)","v":"XXXX"},{"$f":"IF('[2]Tasa de Falla'!IV22=0,\"\",'[2]Tasa de Falla'!IV22)","v":"XXXX"},{"$f":"IF('[2]Tasa de Falla'!IW22=0,\"\",'[2]Tasa de Falla'!IW22)","v":"XXXX"},{"$f":"IF('[2]Tasa de Falla'!IX22=0,\"\",'[2]Tasa de Falla'!IX22)","v":"XXXX"},{"$f":"IF('[2]Tasa de Falla'!IY22=0,\"\",'[2]Tasa de Falla'!IY22)","v":"XXXX"},{"$f":"IF('[2]Tasa de Falla'!IZ22=0,\"\",'[2]Tasa de Falla'!IZ22)","v":"XXXX"},{"$f":"IF('[2]Tasa de Falla'!JA22=0,\"\",'[2]Tasa de Falla'!JA22)","v":"XXXX"},{"$f":"IF('[2]Tasa de Falla'!JB22=0,\"\",'[2]Tasa de Falla'!JB22)","v":"XXXX"},{"$f":"IF('[2]Tasa de Falla'!JC22=0,\"\",'[2]Tasa de Falla'!JC22)","v":"XXXX"},{"$f":"IF('[2]Tasa de Falla'!JD22=0,\"\",'[2]Tasa de Falla'!JD22)","v":"XXXX"},{"$f":"IF('[2]Tasa de Falla'!JE22=0,\"\",'[2]Tasa de Falla'!JE22)","v":"XXXX"},{"$f":"IF('[2]Tasa de Falla'!JF22=0,\"\",'[2]Tasa de Falla'!JF22)","v":"XXXX"}]
[null,null,{"$f":"'[2]Tasa de Falla'!C23","v":7},{"$f":"'[2]Tasa de Falla'!D23","v":"ESTATICA SUR - EL BRACHO"},{"$f":"'[2]Tasa de Falla'!E23","v":132},{"$f":"'[2]Tasa de Falla'!F23","v":19.600000000000001},{"$f":"IF('[2]Tasa de Falla'!IU23=0,\"\",'[2]Tasa de Falla'!IU23)","v":""},{"$f":"IF('[2]Tasa de Falla'!IV23=0,\"\",'[2]Tasa de Falla'!IV23)","v":"XXXX"},{"$f":"IF('[2]Tasa de Falla'!IW23=0,\"\",'[2]Tasa de Falla'!IW23)","v":"XXXX"},{"$f":"IF('[2]Tasa de Falla'!IX23=0,\"\",'[2]Tasa de Falla'!IX23)","v":"XXXX"},{"$f":"IF('[2]Tasa de Falla'!IY23=0,\"\",'[2]Tasa de Falla'!IY23)","v":"XXXX"},{"$f":"IF('[2]Tasa de Falla'!IZ23=0,\"\",'[2]Tasa de Falla'!IZ23)","v":"XXXX"},{"$f":"IF('[2]Tasa de Falla'!JA23=0,\"\",'[2]Tasa de Falla'!JA23)","v":"XXXX"},{"$f":"IF('[2]Tasa de Falla'!JB23=0,\"\",'[2]Tasa de Falla'!JB23)","v":"XXXX"},{"$f":"IF('[2]Tasa de Falla'!JC23=0,\"\",'[2]Tasa de Falla'!JC23)","v":"XXXX"},{"$f":"IF('[2]Tasa de Falla'!JD23=0,\"\",'[2]Tasa de Falla'!JD23)","v":"XXXX"},{"$f":"IF('[2]Tasa de Falla'!JE23=0,\"\",'[2]Tasa de Falla'!JE23)","v":"XXXX"},{"$f":"IF('[2]Tasa de Falla'!JF23=0,\"\",'[2]Tasa de Falla'!JF23)","v":"XXXX"}]
[null,null,{"$f":"'[2]Tasa de Falla'!C24","v":8},{"$f":"'[2]Tasa de Falla'!D24","v":"ESTATICA SUR - INDEPENDENCIA 1 (O.F.)"},{"$f":"'[2]Tasa de Falla'!E24","v":132},{"$f":"'[2]Tasa de Falla'!F24","v":2.6},{"$f":"IF('[2]Tasa de Falla'!IU24=0,\"\",'[2]Tasa de Falla'!IU24)","v":""},{"$f":"IF('[2]Tasa de Falla'!IV24=0,\"\",'[2]Tasa de Falla'!IV24)","v":""},{"$f":"IF('[2]Tasa de Falla'!IW24=0,\"\",'[2]Tasa de Falla'!IW24)","v":""},{"$f":"IF('[2]Tasa de Falla'!IX24=0,\"\",'[2]Tasa de Falla'!IX24)","v":""},{"$f":"IF('[2]Tasa de Falla'!IY24=0,\"\",'[2]Tasa de Falla'!IY24)","v":""},{"$f":"IF('[2]Tasa de Falla'!IZ24=0,\"\",'[2]Tasa de Falla'!IZ24)","v":1},{"$f":"IF('[2]Tasa de Falla'!JA24=0,\"\",'[2]Tasa de Falla'!JA24)","v":""},{"$f":"IF('[2]Tasa de Falla'!JB24=0,\"\",'[2]Tasa de Falla'!JB24)","v":""},{"$f":"IF('[2]Tasa de Falla'!JC24=0,\"\",'[2]Tasa de Falla'!JC24)","v":""},{"$f":"IF('[2]Tasa de Falla'!JD24=0,\"\",'[2]Tasa de Falla'!JD24)","v":""},{"$f":"IF('[2]Tasa de Falla'!JE24=0,\"\",'[2]Tasa de Falla'!JE24)","v":""},{"$f":"IF('[2]Tasa de Falla'!JF24=0,\"\",'[2]Tasa de Falla'!JF24)","v":""}]
[null,null,{"$f":"'[2]Tasa de Falla'!C25","v":9},{"$f":"'[2]Tasa de Falla'!D25","v":"ESTATICA SUR - SARMIENTO \"TRANSNOA S.A.\""},{"$f":"'[2]Tasa de Falla'!E25","v":132},{"$f":"'[2]Tasa de Falla'!F25","v":4.4000000000000004},{"$f":"IF('[2]Tasa de Falla'!IU25=0,\"\",'[2]Tasa de Falla'!IU25)","v":""},{"$f":"IF('[2]Tasa de Falla'!IV25=0,\"\",'[2]Tasa de Falla'!IV25)","v":""},{"$f":"IF('[2]Tasa de Falla'!IW25=0,\"\",'[2]Tasa de Falla'!IW25)","v":""},{"$f":"IF('[2]Tasa de Falla'!IX25=0,\"\",'[2]Tasa de Falla'!IX25)","v":""},{"$f":"IF('[2]Tasa de Falla'!IY25=0,\"\",'[2]Tasa de Falla'!IY25)","v":""},{"$f":"IF('[2]Tasa de Falla'!IZ25=0,\"\",'[2]Tasa de Falla'!IZ25)","v":""},{"$f":"IF('[2]Tasa de Falla'!JA25=0,\"\",'[2]Tasa de Falla'!JA25)","v":""},{"$f":"IF('[2]Tasa de Falla'!JB25=0,\"\",'[2]Tasa de Falla'!JB25)","v":""},{"$f":"IF('[2]Tasa de Falla'!JC25=0,\"\",'[2]Tasa de Falla'!JC25)","v":""},{"$f":"IF('[2]Tasa de Falla'!JD25=0,\"\",'[2]Tasa de Falla'!JD25)","v":""},{"$f":"IF('[2]Tasa de Falla'!JE25=0,\"\",'[2]Tasa de Falla'!JE25)","v":""},{"$f":"IF('[2]Tasa de Falla'!JF25=0,\"\",'[2]Tasa de Falla'!JF25)","v":""}]
[null,null,{"$f":"'[2]Tasa de Falla'!C26","v":10},{"$f":"'[2]Tasa de Falla'!D26","v":"GÜEMES - EL BRACHO"},{"$f":"'[2]Tasa de Falla'!E26","v":132},{"$f":"'[2]Tasa de Falla'!F26","v":308},{"$f":"IF('[2]Tasa de Falla'!IU26=0,\"\",'[2]Tasa de Falla'!IU26)","v":"XXXX"},{"$f":"IF('[2]Tasa de Falla'!IV26=0,\"\",'[2]Tasa de Falla'!IV26)","v":"XXXX"},{"$f":"IF('[2]Tasa de Falla'!IW26=0,\"\",'[2]Tasa de Falla'!IW26)","v":"XXXX"},{"$f":"IF('[2]Tasa de Falla'!IX26=0,\"\",'[2]Tasa de Falla'!IX26)","v":"XXXX"},{"$f":"IF('[2]Tasa de Falla'!IY26=0,\"\",'[2]Tasa de Falla'!IY26)","v":"XXXX"},{"$f":"IF('[2]Tasa de Falla'!IZ26=0,\"\",'[2]Tasa de Falla'!IZ26)","v":"XXXX"},{"$f":"IF('[2]Tasa de Falla'!JA26=0,\"\",'[2]Tasa de Falla'!JA26)","v":"XXXX"},{"$f":"IF('[2]Tasa de Falla'!JB26=0,\"\",'[2]Tasa de Falla'!JB26)","v":"XXXX"},{"$f":"IF('[2]Tasa de Falla'!JC26=0,\"\",'[2]Tasa de Falla'!JC26)","v":"XXXX"},{"$f":"IF('[2]Tasa de Falla'!JD26=0,\"\",'[2]Tasa de Falla'!JD26)","v":"XXXX"},{"$f":"IF('[2]Tasa de Falla'!JE26=0,\"\",'[2]Tasa de Falla'!JE26)","v":"XXXX"},{"$f":"IF('[2]Tasa de Falla'!JF26=0,\"\",'[2]Tasa de Falla'!JF26)","v":"XXXX"}]
[null,null,{"$f":"'[2]Tasa de Falla'!C27","v":11},{"$f":"'[2]Tasa de Falla'!D27","v":"CAMPO SANTO - GÜEMES"},{"$f":"'[2]Tasa de Falla'!E27","v":132},{"$f":"'[2]Tasa de Falla'!F27","v":6.2},{"$f":"IF('[2]Tasa de Falla'!IU27=0,\"\",'[2]Tasa de Falla'!IU27)","v":"XXXX"},{"$f":"IF('[2]Tasa de Falla'!IV27=0,\"\",'[2]Tasa de Falla'!IV27)","v":"XXXX"},{"$f":"IF('[2]Tasa de Falla'!IW27=0,\"\",'[2]Tasa de Falla'!IW27)","v":"XXXX"},{"$f":"IF('[2]Tasa de Falla'!IX27=0,\"\",'[2]Tasa de Falla'!IX27)","v":"XXXX"},{"$f":"IF('[2]Tasa de Falla'!IY27=0,\"\",'[2]Tasa de Falla'!IY27)","v":"XXXX"},{"$f":"IF('[2]Tasa de Falla'!IZ27=0,\"\",'[2]Tasa de Falla'!IZ27)","v":"XXXX"},{"$f":"IF('[2]Tasa de Falla'!JA27=0,\"\",'[2]Tasa de Falla'!JA27)","v":"XXXX"},{"$f":"IF('[2]Tasa de Falla'!JB27=0,\"\",'[2]Tasa de Falla'!JB27)","v":"XXXX"},{"$f":"IF('[2]Tasa de Falla'!JC27=0,\"\",'[2]Tasa de Falla'!JC27)","v":"XXXX"},{"$f":"IF('[2]Tasa de Falla'!JD27=0,\"\",'[2]Tasa de Falla'!JD27)","v":"XXXX"},{"$f":"IF('[2]Tasa de Falla'!JE27=0,\"\",'[2]Tasa de Falla'!JE27)","v":"XXXX"},{"$f":"IF('[2]Tasa de Falla'!JF27=0,\"\",'[2]Tasa de Falla'!JF27)","v":"XXXX"}]
[null,null,{"$f":"'[2]Tasa de Falla'!C28","v":12},{"$f":"'[2]Tasa de Falla'!D28","v":"GÜEMES - SAN JUANCITO"},{"$f":"'[2]Tasa de Falla'!E28","v":132},{"$f":"'[2]Tasa de Falla'!F28","v":36.24},{"$f":"IF('[2]Tasa de Falla'!IU28=0,\"\",'[2]Tasa de Falla'!IU28)","v":""},{"$f":"IF('[2]Tasa de Falla'!IV28=0,\"\",'[2]Tasa de Falla'!IV28)","v":""},{"$f":"IF('[2]Tasa de Falla'!IW28=0,\"\",'[2]Tasa de Falla'!IW28)","v":3},{"$f":"IF('[2]Tasa de Falla'!IX28=0,\"\",'[2]Tasa de Falla'!IX28)","v":1},{"$f":"IF('[2]Tasa de Falla'!IY28=0,\"\",'[2]Tasa de Falla'!IY28)","v":""},{"$f":"IF('[2]Tasa de Falla'!IZ28=0,\"\",'[2]Tasa de Falla'!IZ28)","v":""},{"$f":"IF('[2]Tasa de Falla'!JA28=0,\"\",'[2]Tasa de Falla'!JA28)","v":""},{"$f":"IF('[2]Tasa de Falla'!JB28=0,\"\",'[2]Tasa de Falla'!JB28)","v":""},{"$f":"IF('[2]Tasa de Falla'!JC28=0,\"\",'[2]Tasa de Falla'!JC28)","v":""},{"$f":"IF('[2]Tasa de Falla'!JD28=0,\"\",'[2]Tasa de Falla'!JD28)","v":""},{"$f":"IF('[2]Tasa de Falla'!JE28=0,\"\",'[2]Tasa de Falla'!JE28)","v":2},{"$f":"IF('[2]Tasa de Falla'!JF28=0,\"\",'[2]Tasa de Falla'!JF28)","v":2}]
[null,null,{"$f":"'[2]Tasa de Falla'!C29","v":13},{"$f":"'[2]Tasa de Falla'!D29","v":"CATAMARCA - HUACRA"},{"$f":"'[2]Tasa de Falla'!E29","v":132},{"$f":"'[2]Tasa de Falla'!F29","v":67.3},{"$f":"IF('[2]Tasa de Falla'!IU29=0,\"\",'[2]Tasa de Falla'!IU29)","v":""},{"$f":"IF('[2]Tasa de Falla'!IV29=0,\"\",'[2]Tasa de Falla'!IV29)","v":""},{"$f":"IF('[2]Tasa de Falla'!IW29=0,\"\",'[2]Tasa de Falla'!IW29)","v":1},{"$f":"IF('[2]Tasa de Falla'!IX29=0,\"\",'[2]Tasa de Falla'!IX29)","v":""},{"$f":"IF('[2]Tasa de Falla'!IY29=0,\"\",'[2]Tasa de Falla'!IY29)","v":""},{"$f":"IF('[2]Tasa de Falla'!IZ29=0,\"\",'[2]Tasa de Falla'!IZ29)","v":""},{"$f":"IF('[2]Tasa de Falla'!JA29=0,\"\",'[2]Tasa de Falla'!JA29)","v":""},{"$f":"IF('[2]Tasa de Falla'!JB29=0,\"\",'[2]Tasa de Falla'!JB29)","v":""},{"$f":"IF('[2]Tasa de Falla'!JC29=0,\"\",'[2]Tasa de Falla'!JC29)","v":""},{"$f":"IF('[2]Tasa de Falla'!JD29=0,\"\",'[2]Tasa de Falla'!JD29)","v":""},{"$f":"IF('[2]Tasa de Falla'!JE29=0,\"\",'[2]Tasa de Falla'!JE29)","v":2},{"$f":"IF('[2]Tasa de Falla'!JF29=0,\"\",'[2]Tasa de Falla'!JF29)","v":""}]
[null,null,{"$f":"'[2]Tasa de Falla'!C30","v":14},{"$f":"'[2]Tasa de Falla'!D30","v":"HUACRA - LA CALERA"},{"$f":"'[2]Tasa de Falla'!E30","v":132},{"$f":"'[2]Tasa de Falla'!F30","v":91.2},{"$f":"IF('[2]Tasa de Falla'!IU30=0,\"\",'[2]Tasa de Falla'!IU30)","v":""},{"$f":"IF('[2]Tasa de Falla'!IV30=0,\"\",'[2]Tasa de Falla'!IV30)","v":""},{"$f":"IF('[2]Tasa de Falla'!IW30=0,\"\",'[2]Tasa de Falla'!IW30)","v":""},{"$f":"IF('[2]Tasa de Falla'!IX30=0,\"\",'[2]Tasa de Falla'!IX30)","v":1},{"$f":"IF('[2]Tasa de Falla'!IY30=0,\"\",'[2]Tasa de Falla'!IY30)","v":""},{"$f":"IF('[2]Tasa de Falla'!IZ30=0,\"\",'[2]Tasa de Falla'!IZ30)","v":""},{"$f":"IF('[2]Tasa de Falla'!JA30=0,\"\",'[2]Tasa de Falla'!JA30)","v":""},{"$f":"IF('[2]Tasa de Falla'!JB30=0,\"\",'[2]Tasa de Falla'!JB30)","v":""},{"$f":"IF('[2]Tasa de Falla'!JC30=0,\"\",'[2]Tasa de Falla'!JC30)","v":""},{"$f":"IF('[2]Tasa de Falla'!JD30=0,\"\",'[2]Tasa de Falla'!JD30)","v":""},{"$f":"IF('[2]Tasa de Falla'!JE30=0,\"\",'[2]Tasa de Falla'!JE30)","v":""},{"$f":"IF('[2]Tasa de Falla'!JF30=0,\"\",'[2]Tasa de Falla'!JF30)","v":""}]
[null,null,{"$f":"'[2]Tasa de Falla'!C31","v":15},{"$f":"'[2]Tasa de Falla'!D31","v":"AGUA BLANCA - INDEPENDENCIA"},{"$f":"'[2]Tasa de Falla'!E31","v":132},{"$f":"'[2]Tasa de Falla'!F31","v":34.14},{"$f":"IF('[2]Tasa de Falla'!IU31=0,\"\",'[2]Tasa de Falla'!IU31)","v":""},{"$f":"IF('[2]Tasa de Falla'!IV31=0,\"\",'[2]Tasa de Falla'!IV31)","v":""},{"$f":"IF('[2]Tasa de Falla'!IW31=0,\"\",'[2]Tasa de Falla'!IW31)","v":""},{"$f":"IF('[2]Tasa de Falla'!IX31=0,\"\",'[2]Tasa de Falla'!IX31)","v":""},{"$f":"IF('[2]Tasa de Falla'!IY31=0,\"\",'[2]Tasa de Falla'!IY31)","v":""},{"$f":"IF('[2]Tasa de Falla'!IZ31=0,\"\",'[2]Tasa de Falla'!IZ31)","v":""},{"$f":"IF('[2]Tasa de Falla'!JA31=0,\"\",'[2]Tasa de Falla'!JA31)","v":""},{"$f":"IF('[2]Tasa de Falla'!JB31=0,\"\",'[2]Tasa de Falla'!JB31)","v":1},{"$f":"IF('[2]Tasa de Falla'!JC31=0,\"\",'[2]Tasa de Falla'!JC31)","v":""},{"$f":"IF('[2]Tasa de Falla'!JD31=0,\"\",'[2]Tasa de Falla'!JD31)","v":""},{"$f":"IF('[2]Tasa de Falla'!JE31=0,\"\",'[2]Tasa de Falla'!JE31)","v":""},{"$f":"IF('[2]Tasa de Falla'!JF31=0,\"\",'[2]Tasa de Falla'!JF31)","v":""}]
[null,null,{"$f":"'[2]Tasa de Falla'!C32","v":16},{"$f":"'[2]Tasa de Falla'!D32","v":"INDEPENDENCIA - EL BRACHO 1"},{"$f":"'[2]Tasa de Falla'!E32","v":132},{"$f":"'[2]Tasa de Falla'!F32","v":17.100000000000001},{"$f":"IF('[2]Tasa de Falla'!IU32=0,\"\",'[2]Tasa de Falla'!IU32)","v":""},{"$f":"IF('[2]Tasa de Falla'!IV32=0,\"\",'[2]Tasa de Falla'!IV32)","v":""},{"$f":"IF('[2]Tasa de Falla'!IW32=0,\"\",'[2]Tasa de Falla'!IW32)","v":""},{"$f":"IF('[2]Tasa de Falla'!IX32=0,\"\",'[2]Tasa de Falla'!IX32)","v":""},{"$f":"IF('[2]Tasa de Falla'!IY32=0,\"\",'[2]Tasa de Falla'!IY32)","v":""},{"$f":"IF('[2]Tasa de Falla'!IZ32=0,\"\",'[2]Tasa de Falla'!IZ32)","v":""},{"$f":"IF('[2]Tasa de Falla'!JA32=0,\"\",'[2]Tasa de Falla'!JA32)","v":1},{"$f":"IF('[2]Tasa de Falla'!JB32=0,\"\",'[2]Tasa de Falla'!JB32)","v":""},{"$f":"IF('[2]Tasa de Falla'!JC32=0,\"\",'[2]Tasa de Falla'!JC32)","v":""},{"$f":"IF('[2]Tasa de Falla'!JD32=0,\"\",'[2]Tasa de Falla'!JD32)","v":""},{"$f":"IF('[2]Tasa de Falla'!JE32=0,\"\",'[2]Tasa de Falla'!JE32)","v":""},{"$f":"IF('[2]Tasa de Falla'!JF32=0,\"\",'[2]Tasa de Falla'!JF32)","v":""}]
[null,null,{"$f":"'[2]Tasa de Falla'!C33","v":17},{"$f":"'[2]Tasa de Falla'!D33","v":"INDEPENDENCIA - LULES - PAPEL TUCUMAN"},{"$f":"'[2]Tasa de Falla'!E33","v":132},{"$f":"'[2]Tasa de Falla'!F33","v":19.3},{"$f":"IF('[2]Tasa de Falla'!IU33=0,\"\",'[2]Tasa de Falla'!IU33)","v":""},{"$f":"IF('[2]Tasa de Falla'!IV33=0,\"\",'[2]Tasa de Falla'!IV33)","v":""},{"$f":"IF('[2]Tasa de Falla'!IW33=0,\"\",'[2]Tasa de Falla'!IW33)","v":""},{"$f":"IF('[2]Tasa de Falla'!IX33=0,\"\",'[2]Tasa de Falla'!IX33)","v":""},{"$f":"IF('[2]Tasa de Falla'!IY33=0,\"\",'[2]Tasa de Falla'!IY33)","v":""},{"$f":"IF('[2]Tasa de Falla'!IZ33=0,\"\",'[2]Tasa de Falla'!IZ33)","v":""},{"$f":"IF('[2]Tasa de Falla'!JA33=0,\"\",'[2]Tasa de Falla'!JA33)","v":""},{"$f":"IF('[2]Tasa de Falla'!JB33=0,\"\",'[2]Tasa de Falla'!JB33)","v":""},{"$f":"IF('[2]Tasa de Falla'!JC33=0,\"\",'[2]Tasa de Falla'!JC33)","v":""},{"$f":"IF('[2]Tasa de Falla'!JD33=0,\"\",'[2]Tasa de Falla'!JD33)","v":""},{"$f":"IF('[2]Tasa de Falla'!JE33=0,\"\",'[2]Tasa de Falla'!JE33)","v":""},{"$f":"IF('[2]Tasa de Falla'!JF33=0,\"\",'[2]Tasa de Falla'!JF33)","v":""}]
[null,null,{"$f":"'[2]Tasa de Falla'!C34","v":18},{"$f":"'[2]Tasa de Falla'!D34","v":"FRIAS - LA CALERA NOA."},{"$f":"'[2]Tasa de Falla'!E34","v":132},{"$f":"'[2]Tasa de Falla'!F34","v":27.3},{"$f":"IF('[2]Tasa de Falla'!IU34=0,\"\",'[2]Tasa de Falla'!IU34)","v":""},{"$f":"IF('[2]Tasa de Falla'!IV34=0,\"\",'[2]Tasa de Falla'!IV34)","v":""},{"$f":"IF('[2]Tasa de Falla'!IW34=0,\"\",'[2]Tasa de Falla'!IW34)","v":""},{"$f":"IF('[2]Tasa de Falla'!IX34=0,\"\",'[2]Tasa de Falla'!IX34)","v":""},{"$f":"IF('[2]Tasa de Falla'!IY34=0,\"\",'[2]Tasa de Falla'!IY34)","v":""},{"$f":"IF('[2]Tasa de Falla'!IZ34=0,\"\",'[2]Tasa de Falla'!IZ34)","v":""},{"$f":"IF('[2]Tasa de Falla'!JA34=0,\"\",'[2]Tasa de Falla'!JA34)","v":""},{"$f":"IF('[2]Tasa de Falla'!JB34=0,\"\",'[2]Tasa de Falla'!JB34)","v":""},{"$f":"IF('[2]Tasa de Falla'!JC34=0,\"\",'[2]Tasa de Falla'!JC34)","v":""},{"$f":"IF('[2]Tasa de Falla'!JD34=0,\"\",'[2]Tasa de Falla'!JD34)","v":""},{"$f":"IF('[2]Tasa de Falla'!JE34=0,\"\",'[2]Tasa de Falla'!JE34)","v":""},{"$f":"IF('[2]Tasa de Falla'!JF34=0,\"\",'[2]Tasa de Falla'!JF34)","v":""}]
[null,null,{"$f":"'[2]Tasa de Falla'!C35","v":19},{"$f":"'[2]Tasa de Falla'!D35","v":"LA BANDA - SANTIAGO CENTRO"},{"$f":"'[2]Tasa de Falla'!E35","v":132},{"$f":"'[2]Tasa de Falla'!F35","v":10.91},{"$f":"IF('[2]Tasa de Falla'!IU35=0,\"\",'[2]Tasa de Falla'!IU35)","v":""},{"$f":"IF('[2]Tasa de Falla'!IV35=0,\"\",'[2]Tasa de Falla'!IV35)","v":1},{"$f":"IF('[2]Tasa de Falla'!IW35=0,\"\",'[2]Tasa de Falla'!IW35)","v":""},{"$f":"IF('[2]Tasa de Falla'!IX35=0,\"\",'[2]Tasa de Falla'!IX35)","v":""},{"$f":"IF('[2]Tasa de Falla'!IY35=0,\"\",'[2]Tasa de Falla'!IY35)","v":"XXXX"},{"$f":"IF('[2]Tasa de Falla'!IZ35=0,\"\",'[2]Tasa de Falla'!IZ35)","v":"XXXX"},{"$f":"IF('[2]Tasa de Falla'!JA35=0,\"\",'[2]Tasa de Falla'!JA35)","v":"XXXX"},{"$f":"IF('[2]Tasa de Falla'!JB35=0,\"\",'[2]Tasa de Falla'!JB35)","v":"XXXX"},{"$f":"IF('[2]Tasa de Falla'!JC35=0,\"\",'[2]Tasa de Falla'!JC35)","v":"XXXX"},{"$f":"IF('[2]Tasa de Falla'!JD35=0,\"\",'[2]Tasa de Falla'!JD35)","v":"XXXX"},{"$f":"IF('[2]Tasa de Falla'!JE35=0,\"\",'[2]Tasa de Falla'!JE35)","v":"XXXX"},{"$f":"IF('[2]Tasa de Falla'!JF35=0,\"\",'[2]Tasa de Falla'!JF35)","v":"XXXX"}]
[null,null,{"$f":"'[2]Tasa de Falla'!C36","v":20},{"$f":"'[2]Tasa de Falla'!D36","v":"LIBERTADOR NOA. - PICHANAL"},{"$f":"'[2]Tasa de Falla'!E36","v":132},{"$f":"'[2]Tasa de Falla'!F36","v":76},{"$f":"IF('[2]Tasa de Falla'!IU36=0,\"\",'[2]Tasa de Falla'!IU36)","v":1},{"$f":"IF('[2]Tasa de Falla'!IV36=0,\"\",'[2]Tasa de Falla'!IV36)","v":4},{"$f":"IF('[2]Tasa de Falla'!IW36=0,\"\",'[2]Tasa de Falla'!IW36)","v":""},{"$f":"IF('[2]Tasa de Falla'!IX36=0,\"\",'[2]Tasa de Falla'!IX36)","v":""},{"$f":"IF('[2]Tasa de Falla'!IY36=0,\"\",'[2]Tasa de Falla'!IY36)","v":""},{"$f":"IF('[2]Tasa de Falla'!IZ36=0,\"\",'[2]Tasa de Falla'!IZ36)","v":""},{"$f":"IF('[2]Tasa de Falla'!JA36=0,\"\",'[2]Tasa de Falla'!JA36)","v":""},{"$f":"IF('[2]Tasa de Falla'!JB36=0,\"\",'[2]Tasa de Falla'!JB36)","v":""},{"$f":"IF('[2]Tasa de Falla'!JC36=0,\"\",'[2]Tasa de Falla'!JC36)","v":""},{"$f":"IF('[2]Tasa de Falla'!JD36=0,\"\",'[2]Tasa de Falla'!JD36)","v":1},{"$f":"IF('[2]Tasa de Falla'!JE36=0,\"\",'[2]Tasa de Falla'!JE36)","v":1},{"$f":"IF('[2]Tasa de Falla'!JF36=0,\"\",'[2]Tasa de Falla'!JF36)","v":1}]
[null,null,{"$f":"'[2]Tasa de Falla'!C37","v":21},{"$f":"'[2]Tasa de Falla'!D37","v":"GÜEMES - METAN"},{"$f":"'[2]Tasa de Falla'!E37","v":132},{"$f":"'[2]Tasa de Falla'!F37","v":97.13},{"$f":"IF('[2]Tasa de Falla'!IU37=0,\"\",'[2]Tasa de Falla'!IU37)","v":"XXXX"},{"$f":"IF('[2]Tasa de Falla'!IV37=0,\"\",'[2]Tasa de Falla'!IV37)","v":"XXXX"},{"$f":"IF('[2]Tasa de Falla'!IW37=0,\"\",'[2]Tasa de Falla'!IW37)","v":"XXXX"},{"$f":"IF('[2]Tasa de Falla'!IX37=0,\"\",'[2]Tasa de Falla'!IX37)","v":"XXXX"},{"$f":"IF('[2]Tasa de Falla'!IY37=0,\"\",'[2]Tasa de Falla'!IY37)","v":"XXXX"},{"$f":"IF('[2]Tasa de Falla'!IZ37=0,\"\",'[2]Tasa de Falla'!IZ37)","v":"XXXX"},{"$f":"IF('[2]Tasa de Falla'!JA37=0,\"\",'[2]Tasa de Falla'!JA37)","v":"XXXX"},{"$f":"IF('[2]Tasa de Falla'!JB37=0,\"\",'[2]Tasa de Falla'!JB37)","v":"XXXX"},{"$f":"IF('[2]Tasa de Falla'!JC37=0,\"\",'[2]Tasa de Falla'!JC37)","v":"XXXX"},{"$f":"IF('[2]Tasa de Falla'!JD37=0,\"\",'[2]Tasa de Falla'!JD37)","v":"XXXX"},{"$f":"IF('[2]Tasa de Falla'!JE37=0,\"\",'[2]Tasa de Falla'!JE37)","v":"XXXX"},{"$f":"IF('[2]Tasa de Falla'!JF37=0,\"\",'[2]Tasa de Falla'!JF37)","v":"XXXX"}]
[null,null,{"$f":"'[2]Tasa de Falla'!C38","v":22},{"$f":"'[2]Tasa de Falla'!D38","v":"MINETTI - SAN JUANCITO"},{"$f":"'[2]Tasa de Falla'!E38","v":132},{"$f":"'[2]Tasa de Falla'!F38","v":26},{"$f":"IF('[2]Tasa de Falla'!IU38=0,\"\",'[2]Tasa de Falla'!IU38)","v":""},{"$f":"IF('[2]Tasa de Falla'!IV38=0,\"\",'[2]Tasa de Falla'!IV38)","v":""},{"$f":"IF('[2]Tasa de Falla'!IW38=0,\"\",'[2]Tasa de Falla'!IW38)","v":""},{"$f":"IF('[2]Tasa de Falla'!IX38=0,\"\",'[2]Tasa de Falla'!IX38)","v":2},{"$f":"IF('[2]Tasa de Falla'!IY38=0,\"\",'[2]Tasa de Falla'!IY38)","v":""},{"$f":"IF('[2]Tasa de Falla'!IZ38=0,\"\",'[2]Tasa de Falla'!IZ38)","v":""},{"$f":"IF('[2]Tasa de Falla'!JA38=0,\"\",'[2]Tasa de Falla'!JA38)","v":1},{"$f":"IF('[2]Tasa de Falla'!JB38=0,\"\",'[2]Tasa de Falla'!JB38)","v":""},{"$f":"IF('[2]Tasa de Falla'!JC38=0,\"\",'[2]Tasa de Falla'!JC38)","v":""},{"$f":"IF('[2]Tasa de Falla'!JD38=0,\"\",'[2]Tasa de Falla'!JD38)","v":""},{"$f":"IF('[2]Tasa de Falla'!JE38=0,\"\",'[2]Tasa de Falla'!JE38)","v":""},{"$f":"IF('[2]Tasa de Falla'!JF38=0,\"\",'[2]Tasa de Falla'!JF38)","v":""}]
[null,null,{"$f":"'[2]Tasa de Falla'!C39","v":23},{"$f":"'[2]Tasa de Falla'!D39","v":"PALPALA - JUJUY SUR"},{"$f":"'[2]Tasa de Falla'!E39","v":132},{"$f":"'[2]Tasa de Falla'!F39","v":14},{"$f":"IF('[2]Tasa de Falla'!IU39=0,\"\",'[2]Tasa de Falla'!IU39)","v":"XXXX"},{"$f":"IF('[2]Tasa de Falla'!IV39=0,\"\",'[2]Tasa de Falla'!IV39)","v":"XXXX"},{"$f":"IF('[2]Tasa de Falla'!IW39=0,\"\",'[2]Tasa de Falla'!IW39)","v":"XXXX"},{"$f":"IF('[2]Tasa de Falla'!IX39=0,\"\",'[2]Tasa de Falla'!IX39)","v":"XXXX"},{"$f":"IF('[2]Tasa de Falla'!IY39=0,\"\",'[2]Tasa de Falla'!IY39)","v":"XXXX"},{"$f":"IF('[2]Tasa de Falla'!IZ39=0,\"\",'[2]Tasa de Falla'!IZ39)","v":"XXXX"},{"$f":"IF('[2]Tasa de Falla'!JA39=0,\"\",'[2]Tasa de Falla'!JA39)","v":"XXXX"},{"$f":"IF('[2]Tasa de Falla'!JB39=0,\"\",'[2]Tasa de Falla'!JB39)","v":"XXXX"},{"$f":"IF('[2]Tasa de Falla'!JC39=0,\"\",'[2]Tasa de Falla'!JC39)","v":"XXXX"},{"$f":"IF('[2]Tasa de Falla'!JD39=0,\"\",'[2]Tasa de Falla'!JD39)","v":"XXXX"},{"$f":"IF('[2]Tasa de Falla'!JE39=0,\"\",'[2]Tasa de Falla'!JE39)","v":"XXXX"},{"$f":"IF('[2]Tasa de Falla'!JF39=0,\"\",'[2]Tasa de Falla'!JF39)","v":"XXXX"}]
[null,null,{"$f":"'[2]Tasa de Falla'!C40","v":24},{"$f":"'[2]Tasa de Falla'!D40","v":"ORAN - PICHANAL"},{"$f":"'[2]Tasa de Falla'!E40","v":132},{"$f":"'[2]Tasa de Falla'!F40","v":17},{"$f":"IF('[2]Tasa de Falla'!IU40=0,\"\",'[2]Tasa de Falla'!IU40)","v":"XXXX"},{"$f":"IF('[2]Tasa de Falla'!IV40=0,\"\",'[2]Tasa de Falla'!IV40)","v":"XXXX"},{"$f":"IF('[2]Tasa de Falla'!IW40=0,\"\",'[2]Tasa de Falla'!IW40)","v":"XXXX"},{"$f":"IF('[2]Tasa de Falla'!IX40=0,\"\",'[2]Tasa de Falla'!IX40)","v":"XXXX"},{"$f":"IF('[2]Tasa de Falla'!IY40=0,\"\",'[2]Tasa de Falla'!IY40)","v":"XXXX"},{"$f":"IF('[2]Tasa de Falla'!IZ40=0,\"\",'[2]Tasa de Falla'!IZ40)","v":"XXXX"},{"$f":"IF('[2]Tasa de Falla'!JA40=0,\"\",'[2]Tasa de Falla'!JA40)","v":"XXXX"},{"$f":"IF('[2]Tasa de Falla'!JB40=0,\"\",'[2]Tasa de Falla'!JB40)","v":"XXXX"},{"$f":"IF('[2]Tasa de Falla'!JC40=0,\"\",'[2]Tasa de Falla'!JC40)","v":"XXXX"},{"$f":"IF('[2]Tasa de Falla'!JD40=0,\"\",'[2]Tasa de Falla'!JD40)","v":"XXXX"},{"$f":"IF('[2]Tasa de Falla'!JE40=0,\"\",'[2]Tasa de Falla'!JE40)","v":"XXXX"},{"$f":"IF('[2]Tasa de Falla'!JF40=0,\"\",'[2]Tasa de Falla'!JF40)","v":"XXXX"}]
[null,null,{"$f":"'[2]Tasa de Falla'!C41","v":25},{"$f":"'[2]Tasa de Falla'!D41","v":"PICHANAL - TARTAGAL"},{"$f":"'[2]Tasa de Falla'!E41","v":132},{"$f":"'[2]Tasa de Falla'!F41","v":105},{"$f":"IF('[2]Tasa de Falla'!IU41=0,\"\",'[2]Tasa de Falla'!IU41)","v":""},{"$f":"IF('[2]Tasa de Falla'!IV41=0,\"\",'[2]Tasa de Falla'!IV41)","v":"XXXX"},{"$f":"IF('[2]Tasa de Falla'!IW41=0,\"\",'[2]Tasa de Falla'!IW41)","v":"XXXX"},{"$f":"IF('[2]Tasa de Falla'!IX41=0,\"\",'[2]Tasa de Falla'!IX41)","v":"XXXX"},{"$f":"IF('[2]Tasa de Falla'!IY41=0,\"\",'[2]Tasa de Falla'!IY41)","v":"XXXX"},{"$f":"IF('[2]Tasa de Falla'!IZ41=0,\"\",'[2]Tasa de Falla'!IZ41)","v":"XXXX"},{"$f":"IF('[2]Tasa de Falla'!JA41=0,\"\",'[2]Tasa de Falla'!JA41)","v":"XXXX"},{"$f":"IF('[2]Tasa de Falla'!JB41=0,\"\",'[2]Tasa de Falla'!JB41)","v":"XXXX"},{"$f":"IF('[2]Tasa de Falla'!JC41=0,\"\",'[2]Tasa de Falla'!JC41)","v":"XXXX"},{"$f":"IF('[2]Tasa de Falla'!JD41=0,\"\",'[2]Tasa de Falla'!JD41)","v":"XXXX"},{"$f":"IF('[2]Tasa de Falla'!JE41=0,\"\",'[2]Tasa de Falla'!JE41)","v":"XXXX"},{"$f":"IF('[2]Tasa de Falla'!JF41=0,\"\",'[2]Tasa de Falla'!JF41)","v":"XXXX"}]
[null,null,{"$f":"'[2]Tasa de Falla'!C42","v":26},{"$f":"'[2]Tasa de Falla'!D42","v":"C.H. RIO HONDO - LA BANDA"},{"$f":"'[2]Tasa de Falla'!E42","v":132},{"$f":"'[2]Tasa de Falla'!F42","v":76.5},{"$f":"IF('[2]Tasa de Falla'!IU42=0,\"\",'[2]Tasa de Falla'!IU42)","v":""},{"$f":"IF('[2]Tasa de Falla'!IV42=0,\"\",'[2]Tasa de Falla'!IV42)","v":1},{"$f":"IF('[2]Tasa de Falla'!IW42=0,\"\",'[2]Tasa de Falla'!IW42)","v":""},{"$f":"IF('[2]Tasa de Falla'!IX42=0,\"\",'[2]Tasa de Falla'!IX42)","v":""},{"$f":"IF('[2]Tasa de Falla'!IY42=0,\"\",'[2]Tasa de Falla'!IY42)","v":""},{"$f":"IF('[2]Tasa de Falla'!IZ42=0,\"\",'[2]Tasa de Falla'!IZ42)","v":""},{"$f":"IF('[2]Tasa de Falla'!JA42=0,\"\",'[2]Tasa de Falla'!JA42)","v":""},{"$f":"IF('[2]Tasa de Falla'!JB42=0,\"\",'[2]Tasa de Falla'!JB42)","v":""},{"$f":"IF('[2]Tasa de Falla'!JC42=0,\"\",'[2]Tasa de Falla'!JC42)","v":""},{"$f":"IF('[2]Tasa de Falla'!JD42=0,\"\",'[2]Tasa de Falla'!JD42)","v":1},{"$f":"IF('[2]Tasa de Falla'!JE42=0,\"\",'[2]Tasa de Falla'!JE42)","v":""},{"$f":"IF('[2]Tasa de Falla'!JF42=0,\"\",'[2]Tasa de Falla'!JF42)","v":""}]
[null,null,{"$f":"'[2]Tasa de Falla'!C43","v":27},{"$f":"'[2]Tasa de Falla'!D43","v":"LA RIOJA - RECREO  2"},{"$f":"'[2]Tasa de Falla'!E43","v":132},{"$f":"'[2]Tasa de Falla'!F43","v":220},{"$f":"IF('[2]Tasa de Falla'!IU43=0,\"\",'[2]Tasa de Falla'!IU43)","v":"XXXX"},{"$f":"IF('[2]Tasa de Falla'!IV43=0,\"\",'[2]Tasa de Falla'!IV43)","v":"XXXX"},{"$f":"IF('[2]Tasa de Falla'!IW43=0,\"\",'[2]Tasa de Falla'!IW43)","v":"XXXX"},{"$f":"IF('[2]Tasa de Falla'!IX43=0,\"\",'[2]Tasa de Falla'!IX43)","v":"XXXX"},{"$f":"IF('[2]Tasa de Falla'!IY43=0,\"\",'[2]Tasa de Falla'!IY43)","v":"XXXX"},{"$f":"IF('[2]Tasa de Falla'!IZ43=0,\"\",'[2]Tasa de Falla'!IZ43)","v":"XXXX"},{"$f":"IF('[2]Tasa de Falla'!JA43=0,\"\",'[2]Tasa de Falla'!JA43)","v":"XXXX"},{"$f":"IF('[2]Tasa de Falla'!JB43=0,\"\",'[2]Tasa de Falla'!JB43)","v":"XXXX"},{"$f":"IF('[2]Tasa de Falla'!JC43=0,\"\",'[2]Tasa de Falla'!JC43)","v":"XXXX"},{"$f":"IF('[2]Tasa de Falla'!JD43=0,\"\",'[2]Tasa de Falla'!JD43)","v":"XXXX"},{"$f":"IF('[2]Tasa de Falla'!JE43=0,\"\",'[2]Tasa de Falla'!JE43)","v":"XXXX"},{"$f":"IF('[2]Tasa de Falla'!JF43=0,\"\",'[2]Tasa de Falla'!JF43)","v":"XXXX"}]
[null,null,{"$f":"'[2]Tasa de Falla'!C44","v":28},{"$f":"'[2]Tasa de Falla'!D44","v":"CAMPO SANTO - SALTA SUR"},{"$f":"'[2]Tasa de Falla'!E44","v":132},{"$f":"'[2]Tasa de Falla'!F44","v":40.92},{"$f":"IF('[2]Tasa de Falla'!IU44=0,\"\",'[2]Tasa de Falla'!IU44)","v":"XXXX"},{"$f":"IF('[2]Tasa de Falla'!IV44=0,\"\",'[2]Tasa de Falla'!IV44)","v":"XXXX"},{"$f":"IF('[2]Tasa de Falla'!IW44=0,\"\",'[2]Tasa de Falla'!IW44)","v":"XXXX"},{"$f":"IF('[2]Tasa de Falla'!IX44=0,\"\",'[2]Tasa de Falla'!IX44)","v":"XXXX"},{"$f":"IF('[2]Tasa de Falla'!IY44=0,\"\",'[2]Tasa de Falla'!IY44)","v":"XXXX"},{"$f":"IF('[2]Tasa de Falla'!IZ44=0,\"\",'[2]Tasa de Falla'!IZ44)","v":"XXXX"},{"$f":"IF('[2]Tasa de Falla'!JA44=0,\"\",'[2]Tasa de Falla'!JA44)","v":"XXXX"},{"$f":"IF('[2]Tasa de Falla'!JB44=0,\"\",'[2]Tasa de Falla'!JB44)","v":"XXXX"},{"$f":"IF('[2]Tasa de Falla'!JC44=0,\"\",'[2]Tasa de Falla'!JC44)","v":"XXXX"},{"$f":"IF('[2]Tasa de Falla'!JD44=0,\"\",'[2]Tasa de Falla'!JD44)","v":"XXXX"},{"$f":"IF('[2]Tasa de Falla'!JE44=0,\"\",'[2]Tasa de Falla'!JE44)","v":"XXXX"},{"$f":"IF('[2]Tasa de Falla'!JF44=0,\"\",'[2]Tasa de Falla'!JF44)","v":"XXXX"}]
[null,null,{"$f":"'[2]Tasa de Falla'!C45","v":29},{"$f":"'[2]Tasa de Falla'!D45","v":"PALPALA - SAN JUANCITO"},{"$f":"'[2]Tasa de Falla'!E45","v":132},{"$f":"'[2]Tasa de Falla'!F45","v":23.9},{"$f":"IF('[2]Tasa de Falla'!IU45=0,\"\",'[2]Tasa de Falla'!IU45)","v":""},{"$f":"IF('[2]Tasa de Falla'!IV45=0,\"\",'[2]Tasa de Falla'!IV45)","v":""},{"$f":"IF('[2]Tasa de Falla'!IW45=0,\"\",'[2]Tasa de Falla'!IW45)","v":2},{"$f":"IF('[2]Tasa de Falla'!IX45=0,\"\",'[2]Tasa de Falla'!IX45)","v":2},{"$f":"IF('[2]Tasa de Falla'!IY45=0,\"\",'[2]Tasa de Falla'!IY45)","v":""},{"$f":"IF('[2]Tasa de Falla'!IZ45=0,\"\",'[2]Tasa de Falla'!IZ45)","v":""},{"$f":"IF('[2]Tasa de Falla'!JA45=0,\"\",'[2]Tasa de Falla'!JA45)","v":""},{"$f":"IF('[2]Tasa de Falla'!JB45=0,\"\",'[2]Tasa de Falla'!JB45)","v":""},{"$f":"IF('[2]Tasa de Falla'!JC45=0,\"\",'[2]Tasa de Falla'!JC45)","v":""},{"$f":"IF('[2]Tasa de Falla'!JD45=0,\"\",'[2]Tasa de Falla'!JD45)","v":2},{"$f":"IF('[2]Tasa de Falla'!JE45=0,\"\",'[2]Tasa de Falla'!JE45)","v":""},{"$f":"IF('[2]Tasa de Falla'!JF45=0,\"\",'[2]Tasa de Falla'!JF45)","v":""}]
[null,null,{"$f":"'[2]Tasa de Falla'!C46","v":30},{"$f":"'[2]Tasa de Falla'!D46","v":"SAN JUANCITO - SAN PEDRO JUJUY"},{"$f":"'[2]Tasa de Falla'!E46","v":132},{"$f":"'[2]Tasa de Falla'!F46","v":27},{"$f":"IF('[2]Tasa de Falla'!IU46=0,\"\",'[2]Tasa de Falla'!IU46)","v":""},{"$f":"IF('[2]Tasa de Falla'!IV46=0,\"\",'[2]Tasa de Falla'!IV46)","v":""},{"$f":"IF('[2]Tasa de Falla'!IW46=0,\"\",'[2]Tasa de Falla'!IW46)","v":""},{"$f":"IF('[2]Tasa de Falla'!IX46=0,\"\",'[2]Tasa de Falla'!IX46)","v":""},{"$f":"IF('[2]Tasa de Falla'!IY46=0,\"\",'[2]Tasa de Falla'!IY46)","v":""},{"$f":"IF('[2]Tasa de Falla'!IZ46=0,\"\",'[2]Tasa de Falla'!IZ46)","v":""},{"$f":"IF('[2]Tasa de Falla'!JA46=0,\"\",'[2]Tasa de Falla'!JA46)","v":""},{"$f":"IF('[2]Tasa de Falla'!JB46=0,\"\",'[2]Tasa de Falla'!JB46)","v":""},{"$f":"IF('[2]Tasa de Falla'!JC46=0,\"\",'[2]Tasa de Falla'!JC46)","v":""},{"$f":"IF('[2]Tasa de Falla'!JD46=0,\"\",'[2]Tasa de Falla'!JD46)","v":""},{"$f":"IF('[2]Tasa de Falla'!JE46=0,\"\",'[2]Tasa de Falla'!JE46)","v":""},{"$f":"IF('[2]Tasa de Falla'!JF46=0,\"\",'[2]Tasa de Falla'!JF46)","v":""}]
[null,null,{"$f":"'[2]Tasa de Falla'!C47","v":31},{"$f":"'[2]Tasa de Falla'!D47","v":"SAN MARTIN - CATAMARCA"},{"$f":"'[2]Tasa de Falla'!E47","v":132},{"$f":"'[2]Tasa de Falla'!F47","v":88},{"$f":"IF('[2]Tasa de Falla'!IU47=0,\"\",'[2]Tasa de Falla'!IU47)","v":"XXXX"},{"$f":"IF('[2]Tasa de Falla'!IV47=0,\"\",'[2]Tasa de Falla'!IV47)","v":"XXXX"},{"$f":"IF('[2]Tasa de Falla'!IW47=0,\"\",'[2]Tasa de Falla'!IW47)","v":"XXXX"},{"$f":"IF('[2]Tasa de Falla'!IX47=0,\"\",'[2]Tasa de Falla'!IX47)","v":"XXXX"},{"$f":"IF('[2]Tasa de Falla'!IY47=0,\"\",'[2]Tasa de Falla'!IY47)","v":"XXXX"},{"$f":"IF('[2]Tasa de Falla'!IZ47=0,\"\",'[2]Tasa de Falla'!IZ47)","v":"XXXX"},{"$f":"IF('[2]Tasa de Falla'!JA47=0,\"\",'[2]Tasa de Falla'!JA47)","v":"XXXX"},{"$f":"IF('[2]Tasa de Falla'!JB47=0,\"\",'[2]Tasa de Falla'!JB47)","v":"XXXX"},{"$f":"IF('[2]Tasa de Falla'!JC47=0,\"\",'[2]Tasa de Falla'!JC47)","v":"XXXX"},{"$f":"IF('[2]Tasa de Falla'!JD47=0,\"\",'[2]Tasa de Falla'!JD47)","v":"XXXX"},{"$f":"IF('[2]Tasa de Falla'!JE47=0,\"\",'[2]Tasa de Falla'!JE47)","v":"XXXX"},{"$f":"IF('[2]Tasa de Falla'!JF47=0,\"\",'[2]Tasa de Falla'!JF47)","v":"XXXX"}]
[null,null,{"$f":"'[2]Tasa de Falla'!C48","v":32},{"$f":"'[2]Tasa de Falla'!D48","v":"SAN MARTIN - RECREO"},{"$f":"'[2]Tasa de Falla'!E48","v":132},{"$f":"'[2]Tasa de Falla'!F48","v":115},{"$f":"IF('[2]Tasa de Falla'!IU48=0,\"\",'[2]Tasa de Falla'!IU48)","v":"XXXX"},{"$f":"IF('[2]Tasa de Falla'!IV48=0,\"\",'[2]Tasa de Falla'!IV48)","v":"XXXX"},{"$f":"IF('[2]Tasa de Falla'!IW48=0,\"\",'[2]Tasa de Falla'!IW48)","v":"XXXX"},{"$f":"IF('[2]Tasa de Falla'!IX48=0,\"\",'[2]Tasa de Falla'!IX48)","v":"XXXX"},{"$f":"IF('[2]Tasa de Falla'!IY48=0,\"\",'[2]Tasa de Falla'!IY48)","v":"XXXX"},{"$f":"IF('[2]Tasa de Falla'!IZ48=0,\"\",'[2]Tasa de Falla'!IZ48)","v":"XXXX"},{"$f":"IF('[2]Tasa de Falla'!JA48=0,\"\",'[2]Tasa de Falla'!JA48)","v":"XXXX"},{"$f":"IF('[2]Tasa de Falla'!JB48=0,\"\",'[2]Tasa de Falla'!JB48)","v":"XXXX"},{"$f":"IF('[2]Tasa de Falla'!JC48=0,\"\",'[2]Tasa de Falla'!JC48)","v":"XXXX"},{"$f":"IF('[2]Tasa de Falla'!JD48=0,\"\",'[2]Tasa de Falla'!JD48)","v":"XXXX"},{"$f":"IF('[2]Tasa de Falla'!JE48=0,\"\",'[2]Tasa de Falla'!JE48)","v":"XXXX"},{"$f":"IF('[2]Tasa de Falla'!JF48=0,\"\",'[2]Tasa de Falla'!JF48)","v":"XXXX"}]
[null,null,{"$f":"'[2]Tasa de Falla'!C49","v":33},{"$f":"'[2]Tasa de Falla'!D49","v":"SAN MARTIN C. - LA RIOJA"},{"$f":"'[2]Tasa de Falla'!E49","v":132},{"$f":"'[2]Tasa de Falla'!F49","v":105},{"$f":"IF('[2]Tasa de Falla'!IU49=0,\"\",'[2]Tasa de Falla'!IU49)","v":"XXXX"},{"$f":"IF('[2]Tasa de Falla'!IV49=0,\"\",'[2]Tasa de Falla'!IV49)","v":"XXXX"},{"$f":"IF('[2]Tasa de Falla'!IW49=0,\"\",'[2]Tasa de Falla'!IW49)","v":"XXXX"},{"$f":"IF('[2]Tasa de Falla'!IX49=0,\"\",'[2]Tasa de Falla'!IX49)","v":"XXXX"},{"$f":"IF('[2]Tasa de Falla'!IY49=0,\"\",'[2]Tasa de Falla'!IY49)","v":"XXXX"},{"$f":"IF('[2]Tasa de Falla'!IZ49=0,\"\",'[2]Tasa de Falla'!IZ49)","v":"XXXX"},{"$f":"IF('[2]Tasa de Falla'!JA49=0,\"\",'[2]Tasa de Falla'!JA49)","v":"XXXX"},{"$f":"IF('[2]Tasa de Falla'!JB49=0,\"\",'[2]Tasa de Falla'!JB49)","v":"XXXX"},{"$f":"IF('[2]Tasa de Falla'!JC49=0,\"\",'[2]Tasa de Falla'!JC49)","v":"XXXX"},{"$f":"IF('[2]Tasa de Falla'!JD49=0,\"\",'[2]Tasa de Falla'!JD49)","v":"XXXX"},{"$f":"IF('[2]Tasa de Falla'!JE49=0,\"\",'[2]Tasa de Falla'!JE49)","v":"XXXX"},{"$f":"IF('[2]Tasa de Falla'!JF49=0,\"\",'[2]Tasa de Falla'!JF49)","v":"XXXX"}]
[null,null,{"$f":"'[2]Tasa de Falla'!C50","v":34},{"$f":"'[2]Tasa de Falla'!D50","v":"SAN PEDRO JUJUY - LIBERTADOR NOA."},{"$f":"'[2]Tasa de Falla'!E50","v":132},{"$f":"'[2]Tasa de Falla'!F50","v":49},{"$f":"IF('[2]Tasa de Falla'!IU50=0,\"\",'[2]Tasa de Falla'!IU50)","v":""},{"$f":"IF('[2]Tasa de Falla'!IV50=0,\"\",'[2]Tasa de Falla'!IV50)","v":""},{"$f":"IF('[2]Tasa de Falla'!IW50=0,\"\",'[2]Tasa de Falla'!IW50)","v":""},{"$f":"IF('[2]Tasa de Falla'!IX50=0,\"\",'[2]Tasa de Falla'!IX50)","v":""},{"$f":"IF('[2]Tasa de Falla'!IY50=0,\"\",'[2]Tasa de Falla'!IY50)","v":""},{"$f":"IF('[2]Tasa de Falla'!IZ50=0,\"\",'[2]Tasa de Falla'!IZ50)","v":""},{"$f":"IF('[2]Tasa de Falla'!JA50=0,\"\",'[2]Tasa de Falla'!JA50)","v":""},{"$f":"IF('[2]Tasa de Falla'!JB50=0,\"\",'[2]Tasa de Falla'!JB50)","v":""},{"$f":"IF('[2]Tasa de Falla'!JC50=0,\"\",'[2]Tasa de Falla'!JC50)","v":""},{"$f":"IF('[2]Tasa de Falla'!JD50=0,\"\",'[2]Tasa de Falla'!JD50)","v":1},{"$f":"IF('[2]Tasa de Falla'!JE50=0,\"\",'[2]Tasa de Falla'!JE50)","v":""},{"$f":"IF('[2]Tasa de Falla'!JF50=0,\"\",'[2]Tasa de Falla'!JF50)","v":""}]
[null,null,{"$f":"'[2]Tasa de Falla'!C51","v":35},{"$f":"'[2]Tasa de Falla'!D51","v":"TUCUMAN NORTE - EL BRACHO"},{"$f":"'[2]Tasa de Falla'!E51","v":132},{"$f":"'[2]Tasa de Falla'!F51","v":31.5},{"$f":"IF('[2]Tasa de Falla'!IU51=0,\"\",'[2]Tasa de Falla'!IU51)","v":""},{"$f":"IF('[2]Tasa de Falla'!IV51=0,\"\",'[2]Tasa de Falla'!IV51)","v":""},{"$f":"IF('[2]Tasa de Falla'!IW51=0,\"\",'[2]Tasa de Falla'!IW51)","v":""},{"$f":"IF('[2]Tasa de Falla'!IX51=0,\"\",'[2]Tasa de Falla'!IX51)","v":""},{"$f":"IF('[2]Tasa de Falla'!IY51=0,\"\",'[2]Tasa de Falla'!IY51)","v":""},{"$f":"IF('[2]Tasa de Falla'!IZ51=0,\"\",'[2]Tasa de Falla'!IZ51)","v":""},{"$f":"IF('[2]Tasa de Falla'!JA51=0,\"\",'[2]Tasa de Falla'!JA51)","v":1},{"$f":"IF('[2]Tasa de Falla'!JB51=0,\"\",'[2]Tasa de Falla'!JB51)","v":""},{"$f":"IF('[2]Tasa de Falla'!JC51=0,\"\",'[2]Tasa de Falla'!JC51)","v":""},{"$f":"IF('[2]Tasa de Falla'!JD51=0,\"\",'[2]Tasa de Falla'!JD51)","v":""},{"$f":"IF('[2]Tasa de Falla'!JE51=0,\"\",'[2]Tasa de Falla'!JE51)","v":""},{"$f":"IF('[2]Tasa de Falla'!JF51=0,\"\",'[2]Tasa de Falla'!JF51)","v":""}]
[null,null,{"$f":"'[2]Tasa de Falla'!C52","v":36},{"$f":"'[2]Tasa de Falla'!D52","v":"C.H. EL CADILLAL - TUCUMAN NORTE"},{"$f":"'[2]Tasa de Falla'!E52","v":132},{"$f":"'[2]Tasa de Falla'!F52","v":21.8},{"$f":"IF('[2]Tasa de Falla'!IU52=0,\"\",'[2]Tasa de Falla'!IU52)","v":2},{"$f":"IF('[2]Tasa de Falla'!IV52=0,\"\",'[2]Tasa de Falla'!IV52)","v":""},{"$f":"IF('[2]Tasa de Falla'!IW52=0,\"\",'[2]Tasa de Falla'!IW52)","v":1},{"$f":"IF('[2]Tasa de Falla'!IX52=0,\"\",'[2]Tasa de Falla'!IX52)","v":""},{"$f":"IF('[2]Tasa de Falla'!IY52=0,\"\",'[2]Tasa de Falla'!IY52)","v":""},{"$f":"IF('[2]Tasa de Falla'!IZ52=0,\"\",'[2]Tasa de Falla'!IZ52)","v":""},{"$f":"IF('[2]Tasa de Falla'!JA52=0,\"\",'[2]Tasa de Falla'!JA52)","v":""},{"$f":"IF('[2]Tasa de Falla'!JB52=0,\"\",'[2]Tasa de Falla'!JB52)","v":""},{"$f":"IF('[2]Tasa de Falla'!JC52=0,\"\",'[2]Tasa de Falla'!JC52)","v":""},{"$f":"IF('[2]Tasa de Falla'!JD52=0,\"\",'[2]Tasa de Falla'!JD52)","v":""},{"$f":"IF('[2]Tasa de Falla'!JE52=0,\"\",'[2]Tasa de Falla'!JE52)","v":""},{"$f":"IF('[2]Tasa de Falla'!JF52=0,\"\",'[2]Tasa de Falla'!JF52)","v":""}]
[null,null,{"$f":"'[2]Tasa de Falla'!C53","v":37},{"$f":"'[2]Tasa de Falla'!D53","v":"TUCUMAN NORTE - CABRA CORRAL"},{"$f":"'[2]Tasa de Falla'!E53","v":132},{"$f":"'[2]Tasa de Falla'!F53","v":190},{"$f":"IF('[2]Tasa de Falla'!IU53=0,\"\",'[2]Tasa de Falla'!IU53)","v":"XXXX"},{"$f":"IF('[2]Tasa de Falla'!IV53=0,\"\",'[2]Tasa de Falla'!IV53)","v":"XXXX"},{"$f":"IF('[2]Tasa de Falla'!IW53=0,\"\",'[2]Tasa de Falla'!IW53)","v":"XXXX"},{"$f":"IF('[2]Tasa de Falla'!IX53=0,\"\",'[2]Tasa de Falla'!IX53)","v":"XXXX"},{"$f":"IF('[2]Tasa de Falla'!IY53=0,\"\",'[2]Tasa de Falla'!IY53)","v":"XXXX"},{"$f":"IF('[2]Tasa de Falla'!IZ53=0,\"\",'[2]Tasa de Falla'!IZ53)","v":"XXXX"},{"$f":"IF('[2]Tasa de Falla'!JA53=0,\"\",'[2]Tasa de Falla'!JA53)","v":"XXXX"},{"$f":"IF('[2]Tasa de Falla'!JB53=0,\"\",'[2]Tasa de Falla'!JB53)","v":"XXXX"},{"$f":"IF('[2]Tasa de Falla'!JC53=0,\"\",'[2]Tasa de Falla'!JC53)","v":"XXXX"},{"$f":"IF('[2]Tasa de Falla'!JD53=0,\"\",'[2]Tasa de Falla'!JD53)","v":"XXXX"},{"$f":"IF('[2]Tasa de Falla'!JE53=0,\"\",'[2]Tasa de Falla'!JE53)","v":"XXXX"},{"$f":"IF('[2]Tasa de Falla'!JF53=0,\"\",'[2]Tasa de Falla'!JF53)","v":"XXXX"}]
[null,null,{"$f":"'[2]Tasa de Falla'!C54","v":38},{"$f":"'[2]Tasa de Falla'!D54","v":"METAN - TUCUMAN NORTE"},{"$f":"'[2]Tasa de Falla'!E54","v":132},{"$f":"'[2]Tasa de Falla'!F54","v":155.6},{"$f":"IF('[2]Tasa de Falla'!IU54=0,\"\",'[2]Tasa de Falla'!IU54)","v":""},{"$f":"IF('[2]Tasa de Falla'!IV54=0,\"\",'[2]Tasa de Falla'!IV54)","v":""},{"$f":"IF('[2]Tasa de Falla'!IW54=0,\"\",'[2]Tasa de Falla'!IW54)","v":""},{"$f":"IF('[2]Tasa de Falla'!IX54=0,\"\",'[2]Tasa de Falla'!IX54)","v":""},{"$f":"IF('[2]Tasa de Falla'!IY54=0,\"\",'[2]Tasa de Falla'!IY54)","v":""},{"$f":"IF('[2]Tasa de Falla'!IZ54=0,\"\",'[2]Tasa de Falla'!IZ54)","v":""},{"$f":"IF('[2]Tasa de Falla'!JA54=0,\"\",'[2]Tasa de Falla'!JA54)","v":""},{"$f":"IF('[2]Tasa de Falla'!JB54=0,\"\",'[2]Tasa de Falla'!JB54)","v":""},{"$f":"IF('[2]Tasa de Falla'!JC54=0,\"\",'[2]Tasa de Falla'!JC54)","v":""},{"$f":"IF('[2]Tasa de Falla'!JD54=0,\"\",'[2]Tasa de Falla'!JD54)","v":""},{"$f":"IF('[2]Tasa de Falla'!JE54=0,\"\",'[2]Tasa de Falla'!JE54)","v":""},{"$f":"IF('[2]Tasa de Falla'!JF54=0,\"\",'[2]Tasa de Falla'!JF54)","v":1}]
[null,null,{"$f":"'[2]Tasa de Falla'!C55","v":39},{"$f":"'[2]Tasa de Falla'!D55","v":"SARMIENTO - TUCUMAN NORTE (O.F.)"},{"$f":"'[2]Tasa de Falla'!E55","v":132},{"$f":"'[2]Tasa de Falla'!F55","v":3.3},{"$f":"IF('[2]Tasa de Falla'!IU55=0,\"\",'[2]Tasa de Falla'!IU55)","v":""},{"$f":"IF('[2]Tasa de Falla'!IV55=0,\"\",'[2]Tasa de Falla'!IV55)","v":""},{"$f":"IF('[2]Tasa de Falla'!IW55=0,\"\",'[2]Tasa de Falla'!IW55)","v":""},{"$f":"IF('[2]Tasa de Falla'!IX55=0,\"\",'[2]Tasa de Falla'!IX55)","v":""},{"$f":"IF('[2]Tasa de Falla'!IY55=0,\"\",'[2]Tasa de Falla'!IY55)","v":""},{"$f":"IF('[2]Tasa de Falla'!IZ55=0,\"\",'[2]Tasa de Falla'!IZ55)","v":""},{"$f":"IF('[2]Tasa de Falla'!JA55=0,\"\",'[2]Tasa de Falla'!JA55)","v":""},{"$f":"IF('[2]Tasa de Falla'!JB55=0,\"\",'[2]Tasa de Falla'!JB55)","v":""},{"$f":"IF('[2]Tasa de Falla'!JC55=0,\"\",'[2]Tasa de Falla'!JC55)","v":""},{"$f":"IF('[2]Tasa de Falla'!JD55=0,\"\",'[2]Tasa de Falla'!JD55)","v":""},{"$f":"IF('[2]Tasa de Falla'!JE55=0,\"\",'[2]Tasa de Falla'!JE55)","v":""},{"$f":"IF('[2]Tasa de Falla'!JF55=0,\"\",'[2]Tasa de Falla'!JF55)","v":""}]
[null,null,{"$f":"'[2]Tasa de Falla'!C56","v":40},{"$f":"'[2]Tasa de Falla'!D56","v":"TUCUMAN OESTE - TUCUMAN NORTE"},{"$f":"'[2]Tasa de Falla'!E56","v":132},{"$f":"'[2]Tasa de Falla'!F56","v":7},{"$f":"IF('[2]Tasa de Falla'!IU56=0,\"\",'[2]Tasa de Falla'!IU56)","v":""},{"$f":"IF('[2]Tasa de Falla'!IV56=0,\"\",'[2]Tasa de Falla'!IV56)","v":""},{"$f":"IF('[2]Tasa de Falla'!IW56=0,\"\",'[2]Tasa de Falla'!IW56)","v":""},{"$f":"IF('[2]Tasa de Falla'!IX56=0,\"\",'[2]Tasa de Falla'!IX56)","v":""},{"$f":"IF('[2]Tasa de Falla'!IY56=0,\"\",'[2]Tasa de Falla'!IY56)","v":""},{"$f":"IF('[2]Tasa de Falla'!IZ56=0,\"\",'[2]Tasa de Falla'!IZ56)","v":1},{"$f":"IF('[2]Tasa de Falla'!JA56=0,\"\",'[2]Tasa de Falla'!JA56)","v":1},{"$f":"IF('[2]Tasa de Falla'!JB56=0,\"\",'[2]Tasa de Falla'!JB56)","v":""},{"$f":"IF('[2]Tasa de Falla'!JC56=0,\"\",'[2]Tasa de Falla'!JC56)","v":""},{"$f":"IF('[2]Tasa de Falla'!JD56=0,\"\",'[2]Tasa de Falla'!JD56)","v":""},{"$f":"IF('[2]Tasa de Falla'!JE56=0,\"\",'[2]Tasa de Falla'!JE56)","v":1},{"$f":"IF('[2]Tasa de Falla'!JF56=0,\"\",'[2]Tasa de Falla'!JF56)","v":""}]
[null,null,{"$f":"'[2]Tasa de Falla'!C57","v":41},{"$f":"'[2]Tasa de Falla'!D57","v":"AGUILARES - VILLA QUINTEROS"},{"$f":"'[2]Tasa de Falla'!E57","v":132},{"$f":"'[2]Tasa de Falla'!F57","v":21},{"$f":"IF('[2]Tasa de Falla'!IU57=0,\"\",'[2]Tasa de Falla'!IU57)","v":""},{"$f":"IF('[2]Tasa de Falla'!IV57=0,\"\",'[2]Tasa de Falla'!IV57)","v":""},{"$f":"IF('[2]Tasa de Falla'!IW57=0,\"\",'[2]Tasa de Falla'!IW57)","v":1},{"$f":"IF('[2]Tasa de Falla'!IX57=0,\"\",'[2]Tasa de Falla'!IX57)","v":""},{"$f":"IF('[2]Tasa de Falla'!IY57=0,\"\",'[2]Tasa de Falla'!IY57)","v":""},{"$f":"IF('[2]Tasa de Falla'!IZ57=0,\"\",'[2]Tasa de Falla'!IZ57)","v":""},{"$f":"IF('[2]Tasa de Falla'!JA57=0,\"\",'[2]Tasa de Falla'!JA57)","v":""},{"$f":"IF('[2]Tasa de Falla'!JB57=0,\"\",'[2]Tasa de Falla'!JB57)","v":""},{"$f":"IF('[2]Tasa de Falla'!JC57=0,\"\",'[2]Tasa de Falla'!JC57)","v":""},{"$f":"IF('[2]Tasa de Falla'!JD57=0,\"\",'[2]Tasa de Falla'!JD57)","v":""},{"$f":"IF('[2]Tasa de Falla'!JE57=0,\"\",'[2]Tasa de Falla'!JE57)","v":""},{"$f":"IF('[2]Tasa de Falla'!JF57=0,\"\",'[2]Tasa de Falla'!JF57)","v":1}]
[null,null,{"$f":"'[2]Tasa de Falla'!C58","v":42},{"$f":"'[2]Tasa de Falla'!D58","v":"C.H. PUEBLO VIEJO - VILLA QUINTEROS "},{"$f":"'[2]Tasa de Falla'!E58","v":132},{"$f":"'[2]Tasa de Falla'!F58","v":24.5},{"$f":"IF('[2]Tasa de Falla'!IU58=0,\"\",'[2]Tasa de Falla'!IU58)","v":""},{"$f":"IF('[2]Tasa de Falla'!IV58=0,\"\",'[2]Tasa de Falla'!IV58)","v":1},{"$f":"IF('[2]Tasa de Falla'!IW58=0,\"\",'[2]Tasa de Falla'!IW58)","v":""},{"$f":"IF('[2]Tasa de Falla'!IX58=0,\"\",'[2]Tasa de Falla'!IX58)","v":""},{"$f":"IF('[2]Tasa de Falla'!IY58=0,\"\",'[2]Tasa de Falla'!IY58)","v":""},{"$f":"IF('[2]Tasa de Falla'!IZ58=0,\"\",'[2]Tasa de Falla'!IZ58)","v":""},{"$f":"IF('[2]Tasa de Falla'!JA58=0,\"\",'[2]Tasa de Falla'!JA58)","v":""},{"$f":"IF('[2]Tasa de Falla'!JB58=0,\"\",'[2]Tasa de Falla'!JB58)","v":""},{"$f":"IF('[2]Tasa de Falla'!JC58=0,\"\",'[2]Tasa de Falla'!JC58)","v":""},{"$f":"IF('[2]Tasa de Falla'!JD58=0,\"\",'[2]Tasa de Falla'!JD58)","v":""},{"$f":"IF('[2]Tasa de Falla'!JE58=0,\"\",'[2]Tasa de Falla'!JE58)","v":1},{"$f":"IF('[2]Tasa de Falla'!JF58=0,\"\",'[2]Tasa de Falla'!JF58)","v":""}]
[null,null,{"$f":"'[2]Tasa de Falla'!C59","v":43},{"$f":"'[2]Tasa de Falla'!D59","v":"C.H. RIO HONDO - VILLA QUINTEROS"},{"$f":"'[2]Tasa de Falla'!E59","v":132},{"$f":"'[2]Tasa de Falla'!F59","v":75.400000000000006},{"$f":"IF('[2]Tasa de Falla'!IU59=0,\"\",'[2]Tasa de Falla'!IU59)","v":""},{"$f":"IF('[2]Tasa de Falla'!IV59=0,\"\",'[2]Tasa de Falla'!IV59)","v":""},{"$f":"IF('[2]Tasa de Falla'!IW59=0,\"\",'[2]Tasa de Falla'!IW59)","v":""},{"$f":"IF('[2]Tasa de Falla'!IX59=0,\"\",'[2]Tasa de Falla'!IX59)","v":""},{"$f":"IF('[2]Tasa de Falla'!IY59=0,\"\",'[2]Tasa de Falla'!IY59)","v":""},{"$f":"IF('[2]Tasa de Falla'!IZ59=0,\"\",'[2]Tasa de Falla'!IZ59)","v":""},{"$f":"IF('[2]Tasa de Falla'!JA59=0,\"\",'[2]Tasa de Falla'!JA59)","v":""},{"$f":"IF('[2]Tasa de Falla'!JB59=0,\"\",'[2]Tasa de Falla'!JB59)","v":1},{"$f":"IF('[2]Tasa de Falla'!JC59=0,\"\",'[2]Tasa de Falla'!JC59)","v":""},{"$f":"IF('[2]Tasa de Falla'!JD59=0,\"\",'[2]Tasa de Falla'!JD59)","v":""},{"$f":"IF('[2]Tasa de Falla'!JE59=0,\"\",'[2]Tasa de Falla'!JE59)","v":1},{"$f":"IF('[2]Tasa de Falla'!JF59=0,\"\",'[2]Tasa de Falla'!JF59)","v":""}]
[null,null,{"$f":"'[2]Tasa de Falla'!C60","v":44},{"$f":"'[2]Tasa de Falla'!D60","v":"C.H. RIO HONDO - SANTIAGO CENTRO"},{"$f":"'[2]Tasa de Falla'!E60","v":132},{"$f":"'[2]Tasa de Falla'!F60","v":79},{"$f":"IF('[2]Tasa de Falla'!IU60=0,\"\",'[2]Tasa de Falla'!IU60)","v":"XXXX"},{"$f":"IF('[2]Tasa de Falla'!IV60=0,\"\",'[2]Tasa de Falla'!IV60)","v":"XXXX"},{"$f":"IF('[2]Tasa de Falla'!IW60=0,\"\",'[2]Tasa de Falla'!IW60)","v":"XXXX"},{"$f":"IF('[2]Tasa de Falla'!IX60=0,\"\",'[2]Tasa de Falla'!IX60)","v":"XXXX"},{"$f":"IF('[2]Tasa de Falla'!IY60=0,\"\",'[2]Tasa de Falla'!IY60)","v":"XXXX"},{"$f":"IF('[2]Tasa de Falla'!IZ60=0,\"\",'[2]Tasa de Falla'!IZ60)","v":"XXXX"},{"$f":"IF('[2]Tasa de Falla'!JA60=0,\"\",'[2]Tasa de Falla'!JA60)","v":"XXXX"},{"$f":"IF('[2]Tasa de Falla'!JB60=0,\"\",'[2]Tasa de Falla'!JB60)","v":"XXXX"},{"$f":"IF('[2]Tasa de Falla'!JC60=0,\"\",'[2]Tasa de Falla'!JC60)","v":"XXXX"},{"$f":"IF('[2]Tasa de Falla'!JD60=0,\"\",'[2]Tasa de Falla'!JD60)","v":"XXXX"},{"$f":"IF('[2]Tasa de Falla'!JE60=0,\"\",'[2]Tasa de Falla'!JE60)","v":"XXXX"},{"$f":"IF('[2]Tasa de Falla'!JF60=0,\"\",'[2]Tasa de Falla'!JF60)","v":"XXXX"}]
[null,null,{"$f":"'[2]Tasa de Falla'!C61","v":45},{"$f":"'[2]Tasa de Falla'!D61","v":"C.H. RIO HONDO - EL BRACHO"},{"$f":"'[2]Tasa de Falla'!E61","v":132},{"$f":"'[2]Tasa de Falla'!F61","v":80.66},{"$f":"IF('[2]Tasa de Falla'!IU61=0,\"\",'[2]Tasa de Falla'!IU61)","v":"XXXX"},{"$f":"IF('[2]Tasa de Falla'!IV61=0,\"\",'[2]Tasa de Falla'!IV61)","v":"XXXX"},{"$f":"IF('[2]Tasa de Falla'!IW61=0,\"\",'[2]Tasa de Falla'!IW61)","v":"XXXX"},{"$f":"IF('[2]Tasa de Falla'!IX61=0,\"\",'[2]Tasa de Falla'!IX61)","v":"XXXX"},{"$f":"IF('[2]Tasa de Falla'!IY61=0,\"\",'[2]Tasa de Falla'!IY61)","v":"XXXX"},{"$f":"IF('[2]Tasa de Falla'!IZ61=0,\"\",'[2]Tasa de Falla'!IZ61)","v":"XXXX"},{"$f":"IF('[2]Tasa de Falla'!JA61=0,\"\",'[2]Tasa de Falla'!JA61)","v":"XXXX"},{"$f":"IF('[2]Tasa de Falla'!JB61=0,\"\",'[2]Tasa de Falla'!JB61)","v":"XXXX"},{"$f":"IF('[2]Tasa de Falla'!JC61=0,\"\",'[2]Tasa de Falla'!JC61)","v":"XXXX"},{"$f":"IF('[2]Tasa de Falla'!JD61=0,\"\",'[2]Tasa de Falla'!JD61)","v":"XXXX"},{"$f":"IF('[2]Tasa de Falla'!JE61=0,\"\",'[2]Tasa de Falla'!JE61)","v":"XXXX"},{"$f":"IF('[2]Tasa de Falla'!JF61=0,\"\",'[2]Tasa de Falla'!JF61)","v":"XXXX"}]
[null,null,{"$f":"'[2]Tasa de Falla'!C62","v":46},{"$f":"'[2]Tasa de Falla'!D62","v":"SALTA SUR - SALTA NORTE"},{"$f":"'[2]Tasa de Falla'!E62","v":132},{"$f":"'[2]Tasa de Falla'!F62","v":10},{"$f":"IF('[2]Tasa de Falla'!IU62=0,\"\",'[2]Tasa de Falla'!IU62)","v":""},{"$f":"IF('[2]Tasa de Falla'!IV62=0,\"\",'[2]Tasa de Falla'!IV62)","v":""},{"$f":"IF('[2]Tasa de Falla'!IW62=0,\"\",'[2]Tasa de Falla'!IW62)","v":""},{"$f":"IF('[2]Tasa de Falla'!IX62=0,\"\",'[2]Tasa de Falla'!IX62)","v":""},{"$f":"IF('[2]Tasa de Falla'!IY62=0,\"\",'[2]Tasa de Falla'!IY62)","v":""},{"$f":"IF('[2]Tasa de Falla'!IZ62=0,\"\",'[2]Tasa de Falla'!IZ62)","v":""},{"$f":"IF('[2]Tasa de Falla'!JA62=0,\"\",'[2]Tasa de Falla'!JA62)","v":""},{"$f":"IF('[2]Tasa de Falla'!JB62=0,\"\",'[2]Tasa de Falla'!JB62)","v":""},{"$f":"IF('[2]Tasa de Falla'!JC62=0,\"\",'[2]Tasa de Falla'!JC62)","v":""},{"$f":"IF('[2]Tasa de Falla'!JD62=0,\"\",'[2]Tasa de Falla'!JD62)","v":""},{"$f":"IF('[2]Tasa de Falla'!JE62=0,\"\",'[2]Tasa de Falla'!JE62)","v":""},{"$f":"IF('[2]Tasa de Falla'!JF62=0,\"\",'[2]Tasa de Falla'!JF62)","v":""}]
[null,null,{"$f":"'[2]Tasa de Falla'!C63","v":47},{"$f":"'[2]Tasa de Falla'!D63","v":"PALPALA - JUJUY ESTE"},{"$f":"'[2]Tasa de Falla'!E63","v":132},{"$f":"'[2]Tasa de Falla'!F63","v":12.3},{"$f":"IF('[2]Tasa de Falla'!IU63=0,\"\",'[2]Tasa de Falla'!IU63)","v":""},{"$f":"IF('[2]Tasa de Falla'!IV63=0,\"\",'[2]Tasa de Falla'!IV63)","v":""},{"$f":"IF('[2]Tasa de Falla'!IW63=0,\"\",'[2]Tasa de Falla'!IW63)","v":1},{"$f":"IF('[2]Tasa de Falla'!IX63=0,\"\",'[2]Tasa de Falla'!IX63)","v":""},{"$f":"IF('[2]Tasa de Falla'!IY63=0,\"\",'[2]Tasa de Falla'!IY63)","v":""},{"$f":"IF('[2]Tasa de Falla'!IZ63=0,\"\",'[2]Tasa de Falla'!IZ63)","v":""},{"$f":"IF('[2]Tasa de Falla'!JA63=0,\"\",'[2]Tasa de Falla'!JA63)","v":""},{"$f":"IF('[2]Tasa de Falla'!JB63=0,\"\",'[2]Tasa de Falla'!JB63)","v":""},{"$f":"IF('[2]Tasa de Falla'!JC63=0,\"\",'[2]Tasa de Falla'!JC63)","v":""},{"$f":"IF('[2]Tasa de Falla'!JD63=0,\"\",'[2]Tasa de Falla'!JD63)","v":""},{"$f":"IF('[2]Tasa de Falla'!JE63=0,\"\",'[2]Tasa de Falla'!JE63)","v":""},{"$f":"IF('[2]Tasa de Falla'!JF63=0,\"\",'[2]Tasa de Falla'!JF63)","v":""}]
[null,null,{"$f":"'[2]Tasa de Falla'!C64","v":48},{"$f":"'[2]Tasa de Falla'!D64","v":"JUJUY ESTE - JUJUY SUR"},{"$f":"'[2]Tasa de Falla'!E64","v":132},{"$f":"'[2]Tasa de Falla'!F64","v":4.3},{"$f":"IF('[2]Tasa de Falla'!IU64=0,\"\",'[2]Tasa de Falla'!IU64)","v":""},{"$f":"IF('[2]Tasa de Falla'!IV64=0,\"\",'[2]Tasa de Falla'!IV64)","v":""},{"$f":"IF('[2]Tasa de Falla'!IW64=0,\"\",'[2]Tasa de Falla'!IW64)","v":""},{"$f":"IF('[2]Tasa de Falla'!IX64=0,\"\",'[2]Tasa de Falla'!IX64)","v":""},{"$f":"IF('[2]Tasa de Falla'!IY64=0,\"\",'[2]Tasa de Falla'!IY64)","v":""},{"$f":"IF('[2]Tasa de Falla'!IZ64=0,\"\",'[2]Tasa de Falla'!IZ64)","v":""},{"$f":"IF('[2]Tasa de Falla'!JA64=0,\"\",'[2]Tasa de Falla'!JA64)","v":""},{"$f":"IF('[2]Tasa de Falla'!JB64=0,\"\",'[2]Tasa de Falla'!JB64)","v":""},{"$f":"IF('[2]Tasa de Falla'!JC64=0,\"\",'[2]Tasa de Falla'!JC64)","v":""},{"$f":"IF('[2]Tasa de Falla'!JD64=0,\"\",'[2]Tasa de Falla'!JD64)","v":""},{"$f":"IF('[2]Tasa de Falla'!JE64=0,\"\",'[2]Tasa de Falla'!JE64)","v":""},{"$f":"IF('[2]Tasa de Falla'!JF64=0,\"\",'[2]Tasa de Falla'!JF64)","v":""}]
[null,null,{"$f":"'[2]Tasa de Falla'!C65","v":49},{"$f":"'[2]Tasa de Falla'!D65","v":"CEVIL POZO - GUEMES"},{"$f":"'[2]Tasa de Falla'!E65","v":132},{"$f":"'[2]Tasa de Falla'!F65","v":291},{"$f":"IF('[2]Tasa de Falla'!IU65=0,\"\",'[2]Tasa de Falla'!IU65)","v":"XXXX"},{"$f":"IF('[2]Tasa de Falla'!IV65=0,\"\",'[2]Tasa de Falla'!IV65)","v":"XXXX"},{"$f":"IF('[2]Tasa de Falla'!IW65=0,\"\",'[2]Tasa de Falla'!IW65)","v":"XXXX"},{"$f":"IF('[2]Tasa de Falla'!IX65=0,\"\",'[2]Tasa de Falla'!IX65)","v":"XXXX"},{"$f":"IF('[2]Tasa de Falla'!IY65=0,\"\",'[2]Tasa de Falla'!IY65)","v":"XXXX"},{"$f":"IF('[2]Tasa de Falla'!IZ65=0,\"\",'[2]Tasa de Falla'!IZ65)","v":"XXXX"},{"$f":"IF('[2]Tasa de Falla'!JA65=0,\"\",'[2]Tasa de Falla'!JA65)","v":"XXXX"},{"$f":"IF('[2]Tasa de Falla'!JB65=0,\"\",'[2]Tasa de Falla'!JB65)","v":"XXXX"},{"$f":"IF('[2]Tasa de Falla'!JC65=0,\"\",'[2]Tasa de Falla'!JC65)","v":"XXXX"},{"$f":"IF('[2]Tasa de Falla'!JD65=0,\"\",'[2]Tasa de Falla'!JD65)","v":"XXXX"},{"$f":"IF('[2]Tasa de Falla'!JE65=0,\"\",'[2]Tasa de Falla'!JE65)","v":"XXXX"},{"$f":"IF('[2]Tasa de Falla'!JF65=0,\"\",'[2]Tasa de Falla'!JF65)","v":"XXXX"}]
[null,null,{"$f":"'[2]Tasa de Falla'!C66","v":50},{"$f":"'[2]Tasa de Falla'!D66","v":"CEVIL POZO - EL BRACHO"},{"$f":"'[2]Tasa de Falla'!E66","v":132},{"$f":"'[2]Tasa de Falla'!F66","v":17},{"$f":"IF('[2]Tasa de Falla'!IU66=0,\"\",'[2]Tasa de Falla'!IU66)","v":""},{"$f":"IF('[2]Tasa de Falla'!IV66=0,\"\",'[2]Tasa de Falla'!IV66)","v":""},{"$f":"IF('[2]Tasa de Falla'!IW66=0,\"\",'[2]Tasa de Falla'!IW66)","v":""},{"$f":"IF('[2]Tasa de Falla'!IX66=0,\"\",'[2]Tasa de Falla'!IX66)","v":""},{"$f":"IF('[2]Tasa de Falla'!IY66=0,\"\",'[2]Tasa de Falla'!IY66)","v":""},{"$f":"IF('[2]Tasa de Falla'!IZ66=0,\"\",'[2]Tasa de Falla'!IZ66)","v":""},{"$f":"IF('[2]Tasa de Falla'!JA66=0,\"\",'[2]Tasa de Falla'!JA66)","v":""},{"$f":"IF('[2]Tasa de Falla'!JB66=0,\"\",'[2]Tasa de Falla'!JB66)","v":""},{"$f":"IF('[2]Tasa de Falla'!JC66=0,\"\",'[2]Tasa de Falla'!JC66)","v":""},{"$f":"IF('[2]Tasa de Falla'!JD66=0,\"\",'[2]Tasa de Falla'!JD66)","v":""},{"$f":"IF('[2]Tasa de Falla'!JE66=0,\"\",'[2]Tasa de Falla'!JE66)","v":""},{"$f":"IF('[2]Tasa de Falla'!JF66=0,\"\",'[2]Tasa de Falla'!JF66)","v":""}]
[null,null,{"$f":"'[2]Tasa de Falla'!C67","v":0},{"$f":"'[2]Tasa de Falla'!D67","v":0},{"$f":"'[2]Tasa de Falla'!E67","v":0},{"$f":"'[2]Tasa de Falla'!F67","v":0},{"$f":"IF('[2]Tasa de Falla'!IU67=0,\"\",'[2]Tasa de Falla'!IU67)","v":""},{"$f":"IF('[2]Tasa de Falla'!IV67=0,\"\",'[2]Tasa de Falla'!IV67)","v":""},{"$f":"IF('[2]Tasa de Falla'!IW67=0,\"\",'[2]Tasa de Falla'!IW67)","v":""},{"$f":"IF('[2]Tasa de Falla'!IX67=0,\"\",'[2]Tasa de Falla'!IX67)","v":""},{"$f":"IF('[2]Tasa de Falla'!IY67=0,\"\",'[2]Tasa de Falla'!IY67)","v":""},{"$f":"IF('[2]Tasa de Falla'!IZ67=0,\"\",'[2]Tasa de Falla'!IZ67)","v":""},{"$f":"IF('[2]Tasa de Falla'!JA67=0,\"\",'[2]Tasa de Falla'!JA67)","v":""},{"$f":"IF('[2]Tasa de Falla'!JB67=0,\"\",'[2]Tasa de Falla'!JB67)","v":""},{"$f":"IF('[2]Tasa de Falla'!JC67=0,\"\",'[2]Tasa de Falla'!JC67)","v":""},{"$f":"IF('[2]Tasa de Falla'!JD67=0,\"\",'[2]Tasa de Falla'!JD67)","v":""},{"$f":"IF('[2]Tasa de Falla'!JE67=0,\"\",'[2]Tasa de Falla'!JE67)","v":""},{"$f":"IF('[2]Tasa de Falla'!JF67=0,\"\",'[2]Tasa de Falla'!JF67)","v":""}]
[null,null,{"$f":"'[2]Tasa de Falla'!C68","v":51},{"$f":"'[2]Tasa de Falla'!D68","v":"METAN - EL TUNAL"},{"$f":"'[2]Tasa de Falla'!E68","v":132},{"$f":"'[2]Tasa de Falla'!F68","v":75.599999999999994},{"$f":"IF('[2]Tasa de Falla'!IU68=0,\"\",'[2]Tasa de Falla'!IU68)","v":""},{"$f":"IF('[2]Tasa de Falla'!IV68=0,\"\",'[2]Tasa de Falla'!IV68)","v":""},{"$f":"IF('[2]Tasa de Falla'!IW68=0,\"\",'[2]Tasa de Falla'!IW68)","v":""},{"$f":"IF('[2]Tasa de Falla'!IX68=0,\"\",'[2]Tasa de Falla'!IX68)","v":""},{"$f":"IF('[2]Tasa de Falla'!IY68=0,\"\",'[2]Tasa de Falla'!IY68)","v":""},{"$f":"IF('[2]Tasa de Falla'!IZ68=0,\"\",'[2]Tasa de Falla'!IZ68)","v":""},{"$f":"IF('[2]Tasa de Falla'!JA68=0,\"\",'[2]Tasa de Falla'!JA68)","v":""},{"$f":"IF('[2]Tasa de Falla'!JB68=0,\"\",'[2]Tasa de Falla'!JB68)","v":""},{"$f":"IF('[2]Tasa de Falla'!JC68=0,\"\",'[2]Tasa de Falla'!JC68)","v":""},{"$f":"IF('[2]Tasa de Falla'!JD68=0,\"\",'[2]Tasa de Falla'!JD68)","v":""},{"$f":"IF('[2]Tasa de Falla'!JE68=0,\"\",'[2]Tasa de Falla'!JE68)","v":""},{"$f":"IF('[2]Tasa de Falla'!JF68=0,\"\",'[2]Tasa de Falla'!JF68)","v":""}]
[null,null,{"$f":"'[2]Tasa de Falla'!C69","v":52},{"$f":"'[2]Tasa de Falla'!D69","v":"EL TUNAL - J.V. GONZALEZ"},{"$f":"'[2]Tasa de Falla'!E69","v":132},{"$f":"'[2]Tasa de Falla'!F69","v":41.4},{"$f":"IF('[2]Tasa de Falla'!IU69=0,\"\",'[2]Tasa de Falla'!IU69)","v":""},{"$f":"IF('[2]Tasa de Falla'!IV69=0,\"\",'[2]Tasa de Falla'!IV69)","v":""},{"$f":"IF('[2]Tasa de Falla'!IW69=0,\"\",'[2]Tasa de Falla'!IW69)","v":""},{"$f":"IF('[2]Tasa de Falla'!IX69=0,\"\",'[2]Tasa de Falla'!IX69)","v":""},{"$f":"IF('[2]Tasa de Falla'!IY69=0,\"\",'[2]Tasa de Falla'!IY69)","v":""},{"$f":"IF('[2]Tasa de Falla'!IZ69=0,\"\",'[2]Tasa de Falla'!IZ69)","v":""},{"$f":"IF('[2]Tasa de Falla'!JA69=0,\"\",'[2]Tasa de Falla'!JA69)","v":""},{"$f":"IF('[2]Tasa de Falla'!JB69=0,\"\",'[2]Tasa de Falla'!JB69)","v":""},{"$f":"IF('[2]Tasa de Falla'!JC69=0,\"\",'[2]Tasa de Falla'!JC69)","v":""},{"$f":"IF('[2]Tasa de Falla'!JD69=0,\"\",'[2]Tasa de Falla'!JD69)","v":""},{"$f":"IF('[2]Tasa de Falla'!JE69=0,\"\",'[2]Tasa de Falla'!JE69)","v":""},{"$f":"IF('[2]Tasa de Falla'!JF69=0,\"\",'[2]Tasa de Falla'!JF69)","v":""}]
[null,null,{"$f":"'[2]Tasa de Falla'!C70","v":0},{"$f":"'[2]Tasa de Falla'!D70","v":0},{"$f":"'[2]Tasa de Falla'!E70","v":0},{"$f":"'[2]Tasa de Falla'!F70","v":0},{"$f":"IF('[2]Tasa de Falla'!IU70=0,\"\",'[2]Tasa de Falla'!IU70)","v":""},{"$f":"IF('[2]Tasa de Falla'!IV70=0,\"\",'[2]Tasa de Falla'!IV70)","v":""},{"$f":"IF('[2]Tasa de Falla'!IW70=0,\"\",'[2]Tasa de Falla'!IW70)","v":""},{"$f":"IF('[2]Tasa de Falla'!IX70=0,\"\",'[2]Tasa de Falla'!IX70)","v":""},{"$f":"IF('[2]Tasa de Falla'!IY70=0,\"\",'[2]Tasa de Falla'!IY70)","v":""},{"$f":"IF('[2]Tasa de Falla'!IZ70=0,\"\",'[2]Tasa de Falla'!IZ70)","v":""},{"$f":"IF('[2]Tasa de Falla'!JA70=0,\"\",'[2]Tasa de Falla'!JA70)","v":""},{"$f":"IF('[2]Tasa de Falla'!JB70=0,\"\",'[2]Tasa de Falla'!JB70)","v":""},{"$f":"IF('[2]Tasa de Falla'!JC70=0,\"\",'[2]Tasa de Falla'!JC70)","v":""},{"$f":"IF('[2]Tasa de Falla'!JD70=0,\"\",'[2]Tasa de Falla'!JD70)","v":""},{"$f":"IF('[2]Tasa de Falla'!JE70=0,\"\",'[2]Tasa de Falla'!JE70)","v":""},{"$f":"IF('[2]Tasa de Falla'!JF70=0,\"\",'[2]Tasa de Falla'!JF70)","v":""}]
[null,null,{"$f":"'[2]Tasa de Falla'!C71","v":53},{"$f":"'[2]Tasa de Falla'!D71","v":"LOS PIZARROS - ESCABA"},{"$f":"'[2]Tasa de Falla'!E71","v":132},{"$f":"'[2]Tasa de Falla'!F71","v":21.4},{"$f":"IF('[2]Tasa de Falla'!IU71=0,\"\",'[2]Tasa de Falla'!IU71)","v":""},{"$f":"IF('[2]Tasa de Falla'!IV71=0,\"\",'[2]Tasa de Falla'!IV71)","v":1},{"$f":"IF('[2]Tasa de Falla'!IW71=0,\"\",'[2]Tasa de Falla'!IW71)","v":""},{"$f":"IF('[2]Tasa de Falla'!IX71=0,\"\",'[2]Tasa de Falla'!IX71)","v":""},{"$f":"IF('[2]Tasa de Falla'!IY71=0,\"\",'[2]Tasa de Falla'!IY71)","v":""},{"$f":"IF('[2]Tasa de Falla'!IZ71=0,\"\",'[2]Tasa de Falla'!IZ71)","v":""},{"$f":"IF('[2]Tasa de Falla'!JA71=0,\"\",'[2]Tasa de Falla'!JA71)","v":""},{"$f":"IF('[2]Tasa de Falla'!JB71=0,\"\",'[2]Tasa de Falla'!JB71)","v":1},{"$f":"IF('[2]Tasa de Falla'!JC71=0,\"\",'[2]Tasa de Falla'!JC71)","v":""},{"$f":"IF('[2]Tasa de Falla'!JD71=0,\"\",'[2]Tasa de Falla'!JD71)","v":""},{"$f":"IF('[2]Tasa de Falla'!JE71=0,\"\",'[2]Tasa de Falla'!JE71)","v":""},{"$f":"IF('[2]Tasa de Falla'!JF71=0,\"\",'[2]Tasa de Falla'!JF71)","v":""}]
[null,null,{"$f":"'[2]Tasa de Falla'!C72","v":54},{"$f":"'[2]Tasa de Falla'!D72","v":"LOS PIZARROS - LA COCHA"},{"$f":"'[2]Tasa de Falla'!E72","v":132},{"$f":"'[2]Tasa de Falla'!F72","v":6.5},{"$f":"IF('[2]Tasa de Falla'!IU72=0,\"\",'[2]Tasa de Falla'!IU72)","v":""},{"$f":"IF('[2]Tasa de Falla'!IV72=0,\"\",'[2]Tasa de Falla'!IV72)","v":""},{"$f":"IF('[2]Tasa de Falla'!IW72=0,\"\",'[2]Tasa de Falla'!IW72)","v":""},{"$f":"IF('[2]Tasa de Falla'!IX72=0,\"\",'[2]Tasa de Falla'!IX72)","v":""},{"$f":"IF('[2]Tasa de Falla'!IY72=0,\"\",'[2]Tasa de Falla'!IY72)","v":""},{"$f":"IF('[2]Tasa de Falla'!IZ72=0,\"\",'[2]Tasa de Falla'!IZ72)","v":""},{"$f":"IF('[2]Tasa de Falla'!JA72=0,\"\",'[2]Tasa de Falla'!JA72)","v":""},{"$f":"IF('[2]Tasa de Falla'!JB72=0,\"\",'[2]Tasa de Falla'!JB72)","v":""},{"$f":"IF('[2]Tasa de Falla'!JC72=0,\"\",'[2]Tasa de Falla'!JC72)","v":""},{"$f":"IF('[2]Tasa de Falla'!JD72=0,\"\",'[2]Tasa de Falla'!JD72)","v":""},{"$f":"IF('[2]Tasa de Falla'!JE72=0,\"\",'[2]Tasa de Falla'!JE72)","v":""},{"$f":"IF('[2]Tasa de Falla'!JF72=0,\"\",'[2]Tasa de Falla'!JF72)","v":""}]
[null,null,{"$f":"'[2]Tasa de Falla'!C73","v":55},{"$f":"'[2]Tasa de Falla'!D73","v":"HUACRA - LOS PIZARROS"},{"$f":"'[2]Tasa de Falla'!E73","v":132},{"$f":"'[2]Tasa de Falla'!F73","v":28.5},{"$f":"IF('[2]Tasa de Falla'!IU73=0,\"\",'[2]Tasa de Falla'!IU73)","v":1},{"$f":"IF('[2]Tasa de Falla'!IV73=0,\"\",'[2]Tasa de Falla'!IV73)","v":""},{"$f":"IF('[2]Tasa de Falla'!IW73=0,\"\",'[2]Tasa de Falla'!IW73)","v":""},{"$f":"IF('[2]Tasa de Falla'!IX73=0,\"\",'[2]Tasa de Falla'!IX73)","v":""},{"$f":"IF('[2]Tasa de Falla'!IY73=0,\"\",'[2]Tasa de Falla'!IY73)","v":""},{"$f":"IF('[2]Tasa de Falla'!IZ73=0,\"\",'[2]Tasa de Falla'!IZ73)","v":""},{"$f":"IF('[2]Tasa de Falla'!JA73=0,\"\",'[2]Tasa de Falla'!JA73)","v":""},{"$f":"IF('[2]Tasa de Falla'!JB73=0,\"\",'[2]Tasa de Falla'!JB73)","v":""},{"$f":"IF('[2]Tasa de Falla'!JC73=0,\"\",'[2]Tasa de Falla'!JC73)","v":""},{"$f":"IF('[2]Tasa de Falla'!JD73=0,\"\",'[2]Tasa de Falla'!JD73)","v":""},{"$f":"IF('[2]Tasa de Falla'!JE73=0,\"\",'[2]Tasa de Falla'!JE73)","v":""},{"$f":"IF('[2]Tasa de Falla'!JF73=0,\"\",'[2]Tasa de Falla'!JF73)","v":""}]
[null,null,{"$f":"'[2]Tasa de Falla'!C74","v":56},{"$f":"'[2]Tasa de Falla'!D74","v":"CEVIL POZO - AVELLANEDA"},{"$f":"'[2]Tasa de Falla'!E74","v":132},{"$f":"'[2]Tasa de Falla'!F74","v":8},{"$f":"IF('[2]Tasa de Falla'!IU74=0,\"\",'[2]Tasa de Falla'!IU74)","v":""},{"$f":"IF('[2]Tasa de Falla'!IV74=0,\"\",'[2]Tasa de Falla'!IV74)","v":""},{"$f":"IF('[2]Tasa de Falla'!IW74=0,\"\",'[2]Tasa de Falla'!IW74)","v":""},{"$f":"IF('[2]Tasa de Falla'!IX74=0,\"\",'[2]Tasa de Falla'!IX74)","v":""},{"$f":"IF('[2]Tasa de Falla'!IY74=0,\"\",'[2]Tasa de Falla'!IY74)","v":""},{"$f":"IF('[2]Tasa de Falla'!IZ74=0,\"\",'[2]Tasa de Falla'!IZ74)","v":""},{"$f":"IF('[2]Tasa de Falla'!JA74=0,\"\",'[2]Tasa de Falla'!JA74)","v":""},{"$f":"IF('[2]Tasa de Falla'!JB74=0,\"\",'[2]Tasa de Falla'!JB74)","v":""},{"$f":"IF('[2]Tasa de Falla'!JC74=0,\"\",'[2]Tasa de Falla'!JC74)","v":""},{"$f":"IF('[2]Tasa de Falla'!JD74=0,\"\",'[2]Tasa de Falla'!JD74)","v":""},{"$f":"IF('[2]Tasa de Falla'!JE74=0,\"\",'[2]Tasa de Falla'!JE74)","v":""},{"$f":"IF('[2]Tasa de Falla'!JF74=0,\"\",'[2]Tasa de Falla'!JF74)","v":""}]
[null,null,{"$f":"'[2]Tasa de Falla'!C75","v":57},{"$f":"'[2]Tasa de Falla'!D75","v":"CABRA CORRAL - SALTA ESTE"},{"$f":"'[2]Tasa de Falla'!E75","v":132},{"$f":"'[2]Tasa de Falla'!F75","v":55},{"$f":"IF('[2]Tasa de Falla'!IU75=0,\"\",'[2]Tasa de Falla'!IU75)","v":1},{"$f":"IF('[2]Tasa de Falla'!IV75=0,\"\",'[2]Tasa de Falla'!IV75)","v":""},{"$f":"IF('[2]Tasa de Falla'!IW75=0,\"\",'[2]Tasa de Falla'!IW75)","v":1},{"$f":"IF('[2]Tasa de Falla'!IX75=0,\"\",'[2]Tasa de Falla'!IX75)","v":""},{"$f":"IF('[2]Tasa de Falla'!IY75=0,\"\",'[2]Tasa de Falla'!IY75)","v":""},{"$f":"IF('[2]Tasa de Falla'!IZ75=0,\"\",'[2]Tasa de Falla'!IZ75)","v":1},{"$f":"IF('[2]Tasa de Falla'!JA75=0,\"\",'[2]Tasa de Falla'!JA75)","v":""},{"$f":"IF('[2]Tasa de Falla'!JB75=0,\"\",'[2]Tasa de Falla'!JB75)","v":""},{"$f":"IF('[2]Tasa de Falla'!JC75=0,\"\",'[2]Tasa de Falla'!JC75)","v":""},{"$f":"IF('[2]Tasa de Falla'!JD75=0,\"\",'[2]Tasa de Falla'!JD75)","v":""},{"$f":"IF('[2]Tasa de Falla'!JE75=0,\"\",'[2]Tasa de Falla'!JE75)","v":1},{"$f":"IF('[2]Tasa de Falla'!JF75=0,\"\",'[2]Tasa de Falla'!JF75)","v":""}]
[null,null,{"$f":"'[2]Tasa de Falla'!C76","v":58},{"$f":"'[2]Tasa de Falla'!D76","v":"SALTA ESTE - SALTA SUR"},{"$f":"'[2]Tasa de Falla'!E76","v":132},{"$f":"'[2]Tasa de Falla'!F76","v":7},{"$f":"IF('[2]Tasa de Falla'!IU76=0,\"\",'[2]Tasa de Falla'!IU76)","v":""},{"$f":"IF('[2]Tasa de Falla'!IV76=0,\"\",'[2]Tasa de Falla'!IV76)","v":""},{"$f":"IF('[2]Tasa de Falla'!IW76=0,\"\",'[2]Tasa de Falla'!IW76)","v":""},{"$f":"IF('[2]Tasa de Falla'!IX76=0,\"\",'[2]Tasa de Falla'!IX76)","v":""},{"$f":"IF('[2]Tasa de Falla'!IY76=0,\"\",'[2]Tasa de Falla'!IY76)","v":""},{"$f":"IF('[2]Tasa de Falla'!IZ76=0,\"\",'[2]Tasa de Falla'!IZ76)","v":""},{"$f":"IF('[2]Tasa de Falla'!JA76=0,\"\",'[2]Tasa de Falla'!JA76)","v":""},{"$f":"IF('[2]Tasa de Falla'!JB76=0,\"\",'[2]Tasa de Falla'!JB76)","v":""},{"$f":"IF('[2]Tasa de Falla'!JC76=0,\"\",'[2]Tasa de Falla'!JC76)","v":""},{"$f":"IF('[2]Tasa de Falla'!JD76=0,\"\",'[2]Tasa de Falla'!JD76)","v":""},{"$f":"IF('[2]Tasa de Falla'!JE76=0,\"\",'[2]Tasa de Falla'!JE76)","v":""},{"$f":"IF('[2]Tasa de Falla'!JF76=0,\"\",'[2]Tasa de Falla'!JF76)","v":""}]
[null,null,{"$f":"'[2]Tasa de Falla'!C77","v":59},{"$f":"'[2]Tasa de Falla'!D77","v":"V. QUINTEROS - ACONQUIJA - ANDALGALA"},{"$f":"'[2]Tasa de Falla'!E77","v":132},{"$f":"'[2]Tasa de Falla'!F77","v":102},{"$f":"IF('[2]Tasa de Falla'!IU77=0,\"\",'[2]Tasa de Falla'!IU77)","v":2},{"$f":"IF('[2]Tasa de Falla'!IV77=0,\"\",'[2]Tasa de Falla'!IV77)","v":1},{"$f":"IF('[2]Tasa de Falla'!IW77=0,\"\",'[2]Tasa de Falla'!IW77)","v":""},{"$f":"IF('[2]Tasa de Falla'!IX77=0,\"\",'[2]Tasa de Falla'!IX77)","v":""},{"$f":"IF('[2]Tasa de Falla'!IY77=0,\"\",'[2]Tasa de Falla'!IY77)","v":""},{"$f":"IF('[2]Tasa de Falla'!IZ77=0,\"\",'[2]Tasa de Falla'!IZ77)","v":""},{"$f":"IF('[2]Tasa de Falla'!JA77=0,\"\",'[2]Tasa de Falla'!JA77)","v":1},{"$f":"IF('[2]Tasa de Falla'!JB77=0,\"\",'[2]Tasa de Falla'!JB77)","v":""},{"$f":"IF('[2]Tasa de Falla'!JC77=0,\"\",'[2]Tasa de Falla'!JC77)","v":2},{"$f":"IF('[2]Tasa de Falla'!JD77=0,\"\",'[2]Tasa de Falla'!JD77)","v":""},{"$f":"IF('[2]Tasa de Falla'!JE77=0,\"\",'[2]Tasa de Falla'!JE77)","v":""},{"$f":"IF('[2]Tasa de Falla'!JF77=0,\"\",'[2]Tasa de Falla'!JF77)","v":1}]
[null,null,{"$f":"'[2]Tasa de Falla'!C78","v":60},{"$f":"'[2]Tasa de Falla'!D78","v":"ANDALGALA - BELEN"},{"$f":"'[2]Tasa de Falla'!E78","v":132},{"$f":"'[2]Tasa de Falla'!F78","v":80.3},{"$f":"IF('[2]Tasa de Falla'!IU78=0,\"\",'[2]Tasa de Falla'!IU78)","v":1},{"$f":"IF('[2]Tasa de Falla'!IV78=0,\"\",'[2]Tasa de Falla'!IV78)","v":""},{"$f":"IF('[2]Tasa de Falla'!IW78=0,\"\",'[2]Tasa de Falla'!IW78)","v":""},{"$f":"IF('[2]Tasa de Falla'!IX78=0,\"\",'[2]Tasa de Falla'!IX78)","v":""},{"$f":"IF('[2]Tasa de Falla'!IY78=0,\"\",'[2]Tasa de Falla'!IY78)","v":""},{"$f":"IF('[2]Tasa de Falla'!IZ78=0,\"\",'[2]Tasa de Falla'!IZ78)","v":""},{"$f":"IF('[2]Tasa de Falla'!JA78=0,\"\",'[2]Tasa de Falla'!JA78)","v":""},{"$f":"IF('[2]Tasa de Falla'!JB78=0,\"\",'[2]Tasa de Falla'!JB78)","v":""},{"$f":"IF('[2]Tasa de Falla'!JC78=0,\"\",'[2]Tasa de Falla'!JC78)","v":""},{"$f":"IF('[2]Tasa de Falla'!JD78=0,\"\",'[2]Tasa de Falla'!JD78)","v":""},{"$f":"IF('[2]Tasa de Falla'!JE78=0,\"\",'[2]Tasa de Falla'!JE78)","v":""},{"$f":"IF('[2]Tasa de Falla'!JF78=0,\"\",'[2]Tasa de Falla'!JF78)","v":""}]
[null,null,{"$f":"'[2]Tasa de Falla'!C79","v":61},{"$f":"'[2]Tasa de Falla'!D79","v":"TUCUMAN NORTE - TRANCAS"},{"$f":"'[2]Tasa de Falla'!E79","v":132},{"$f":"'[2]Tasa de Falla'!F79","v":75},{"$f":"IF('[2]Tasa de Falla'!IU79=0,\"\",'[2]Tasa de Falla'!IU79)","v":""},{"$f":"IF('[2]Tasa de Falla'!IV79=0,\"\",'[2]Tasa de Falla'!IV79)","v":""},{"$f":"IF('[2]Tasa de Falla'!IW79=0,\"\",'[2]Tasa de Falla'!IW79)","v":""},{"$f":"IF('[2]Tasa de Falla'!IX79=0,\"\",'[2]Tasa de Falla'!IX79)","v":""},{"$f":"IF('[2]Tasa de Falla'!IY79=0,\"\",'[2]Tasa de Falla'!IY79)","v":""},{"$f":"IF('[2]Tasa de Falla'!IZ79=0,\"\",'[2]Tasa de Falla'!IZ79)","v":1},{"$f":"IF('[2]Tasa de Falla'!JA79=0,\"\",'[2]Tasa de Falla'!JA79)","v":""},{"$f":"IF('[2]Tasa de Falla'!JB79=0,\"\",'[2]Tasa de Falla'!JB79)","v":""},{"$f":"IF('[2]Tasa de Falla'!JC79=0,\"\",'[2]Tasa de Falla'!JC79)","v":""},{"$f":"IF('[2]Tasa de Falla'!JD79=0,\"\",'[2]Tasa de Falla'!JD79)","v":""},{"$f":"IF('[2]Tasa de Falla'!JE79=0,\"\",'[2]Tasa de Falla'!JE79)","v":""},{"$f":"IF('[2]Tasa de Falla'!JF79=0,\"\",'[2]Tasa de Falla'!JF79)","v":""}]
[null,null,{"$f":"'[2]Tasa de Falla'!C80","v":62},{"$f":"'[2]Tasa de Falla'!D80","v":"CABRA CORRAL - TRANCAS"},{"$f":"'[2]Tasa de Falla'!E80","v":132},{"$f":"'[2]Tasa de Falla'!F80","v":115},{"$f":"IF('[2]Tasa de Falla'!IU80=0,\"\",'[2]Tasa de Falla'!IU80)","v":"XXXX"},{"$f":"IF('[2]Tasa de Falla'!IV80=0,\"\",'[2]Tasa de Falla'!IV80)","v":"XXXX"},{"$f":"IF('[2]Tasa de Falla'!IW80=0,\"\",'[2]Tasa de Falla'!IW80)","v":"XXXX"},{"$f":"IF('[2]Tasa de Falla'!IX80=0,\"\",'[2]Tasa de Falla'!IX80)","v":"XXXX"},{"$f":"IF('[2]Tasa de Falla'!IY80=0,\"\",'[2]Tasa de Falla'!IY80)","v":"XXXX"},{"$f":"IF('[2]Tasa de Falla'!IZ80=0,\"\",'[2]Tasa de Falla'!IZ80)","v":"XXXX"},{"$f":"IF('[2]Tasa de Falla'!JA80=0,\"\",'[2]Tasa de Falla'!JA80)","v":"XXXX"},{"$f":"IF('[2]Tasa de Falla'!JB80=0,\"\",'[2]Tasa de Falla'!JB80)","v":"XXXX"},{"$f":"IF('[2]Tasa de Falla'!JC80=0,\"\",'[2]Tasa de Falla'!JC80)","v":"XXXX"},{"$f":"IF('[2]Tasa de Falla'!JD80=0,\"\",'[2]Tasa de Falla'!JD80)","v":"XXXX"},{"$f":"IF('[2]Tasa de Falla'!JE80=0,\"\",'[2]Tasa de Falla'!JE80)","v":"XXXX"},{"$f":"IF('[2]Tasa de Falla'!JF80=0,\"\",'[2]Tasa de Falla'!JF80)","v":"XXXX"}]
[null,null,{"$f":"'[2]Tasa de Falla'!C81","v":63},{"$f":"'[2]Tasa de Falla'!D81","v":"LAS MADERAS - JUJUY SUR"},{"$f":"'[2]Tasa de Falla'!E81","v":132},{"$f":"'[2]Tasa de Falla'!F81","v":27.6},{"$f":"IF('[2]Tasa de Falla'!IU81=0,\"\",'[2]Tasa de Falla'!IU81)","v":""},{"$f":"IF('[2]Tasa de Falla'!IV81=0,\"\",'[2]Tasa de Falla'!IV81)","v":""},{"$f":"IF('[2]Tasa de Falla'!IW81=0,\"\",'[2]Tasa de Falla'!IW81)","v":""},{"$f":"IF('[2]Tasa de Falla'!IX81=0,\"\",'[2]Tasa de Falla'!IX81)","v":""},{"$f":"IF('[2]Tasa de Falla'!IY81=0,\"\",'[2]Tasa de Falla'!IY81)","v":""},{"$f":"IF('[2]Tasa de Falla'!IZ81=0,\"\",'[2]Tasa de Falla'!IZ81)","v":""},{"$f":"IF('[2]Tasa de Falla'!JA81=0,\"\",'[2]Tasa de Falla'!JA81)","v":""},{"$f":"IF('[2]Tasa de Falla'!JB81=0,\"\",'[2]Tasa de Falla'!JB81)","v":""},{"$f":"IF('[2]Tasa de Falla'!JC81=0,\"\",'[2]Tasa de Falla'!JC81)","v":""},{"$f":"IF('[2]Tasa de Falla'!JD81=0,\"\",'[2]Tasa de Falla'!JD81)","v":""},{"$f":"IF('[2]Tasa de Falla'!JE81=0,\"\",'[2]Tasa de Falla'!JE81)","v":""},{"$f":"IF('[2]Tasa de Falla'!JF81=0,\"\",'[2]Tasa de Falla'!JF81)","v":""}]
[null,null,{"$f":"'[2]Tasa de Falla'!C82","v":64},{"$f":"'[2]Tasa de Falla'!D82","v":"BELEN - TINOGASTA"},{"$f":"'[2]Tasa de Falla'!E82","v":132},{"$f":"'[2]Tasa de Falla'!F82","v":72},{"$f":"IF('[2]Tasa de Falla'!IU82=0,\"\",'[2]Tasa de Falla'!IU82)","v":""},{"$f":"IF('[2]Tasa de Falla'!IV82=0,\"\",'[2]Tasa de Falla'!IV82)","v":""},{"$f":"IF('[2]Tasa de Falla'!IW82=0,\"\",'[2]Tasa de Falla'!IW82)","v":""},{"$f":"IF('[2]Tasa de Falla'!IX82=0,\"\",'[2]Tasa de Falla'!IX82)","v":""},{"$f":"IF('[2]Tasa de Falla'!IY82=0,\"\",'[2]Tasa de Falla'!IY82)","v":""},{"$f":"IF('[2]Tasa de Falla'!IZ82=0,\"\",'[2]Tasa de Falla'!IZ82)","v":""},{"$f":"IF('[2]Tasa de Falla'!JA82=0,\"\",'[2]Tasa de Falla'!JA82)","v":""},{"$f":"IF('[2]Tasa de Falla'!JB82=0,\"\",'[2]Tasa de Falla'!JB82)","v":""},{"$f":"IF('[2]Tasa de Falla'!JC82=0,\"\",'[2]Tasa de Falla'!JC82)","v":""},{"$f":"IF('[2]Tasa de Falla'!JD82=0,\"\",'[2]Tasa de Falla'!JD82)","v":""},{"$f":"IF('[2]Tasa de Falla'!JE82=0,\"\",'[2]Tasa de Falla'!JE82)","v":""},{"$f":"IF('[2]Tasa de Falla'!JF82=0,\"\",'[2]Tasa de Falla'!JF82)","v":""}]
[null,null,{"$f":"'[2]Tasa de Falla'!C83","v":65},{"$f":"'[2]Tasa de Falla'!D83","v":"BURRUYACU - CEVIL POZO"},{"$f":"'[2]Tasa de Falla'!E83","v":132},{"$f":"'[2]Tasa de Falla'!F83","v":56},{"$f":"IF('[2]Tasa de Falla'!IU83=0,\"\",'[2]Tasa de Falla'!IU83)","v":1},{"$f":"IF('[2]Tasa de Falla'!IV83=0,\"\",'[2]Tasa de Falla'!IV83)","v":1},{"$f":"IF('[2]Tasa de Falla'!IW83=0,\"\",'[2]Tasa de Falla'!IW83)","v":""},{"$f":"IF('[2]Tasa de Falla'!IX83=0,\"\",'[2]Tasa de Falla'!IX83)","v":""},{"$f":"IF('[2]Tasa de Falla'!IY83=0,\"\",'[2]Tasa de Falla'!IY83)","v":""},{"$f":"IF('[2]Tasa de Falla'!IZ83=0,\"\",'[2]Tasa de Falla'!IZ83)","v":""},{"$f":"IF('[2]Tasa de Falla'!JA83=0,\"\",'[2]Tasa de Falla'!JA83)","v":""},{"$f":"IF('[2]Tasa de Falla'!JB83=0,\"\",'[2]Tasa de Falla'!JB83)","v":""},{"$f":"IF('[2]Tasa de Falla'!JC83=0,\"\",'[2]Tasa de Falla'!JC83)","v":""},{"$f":"IF('[2]Tasa de Falla'!JD83=0,\"\",'[2]Tasa de Falla'!JD83)","v":""},{"$f":"IF('[2]Tasa de Falla'!JE83=0,\"\",'[2]Tasa de Falla'!JE83)","v":""},{"$f":"IF('[2]Tasa de Falla'!JF83=0,\"\",'[2]Tasa de Falla'!JF83)","v":""}]
[null,null,{"$f":"'[2]Tasa de Falla'!C84","v":66},{"$f":"'[2]Tasa de Falla'!D84","v":"GÜEMES - BURRUYACU"},{"$f":"'[2]Tasa de Falla'!E84","v":132},{"$f":"'[2]Tasa de Falla'!F84","v":235.1},{"$f":"IF('[2]Tasa de Falla'!IU84=0,\"\",'[2]Tasa de Falla'!IU84)","v":"XXXX"},{"$f":"IF('[2]Tasa de Falla'!IV84=0,\"\",'[2]Tasa de Falla'!IV84)","v":"XXXX"},{"$f":"IF('[2]Tasa de Falla'!IW84=0,\"\",'[2]Tasa de Falla'!IW84)","v":"XXXX"},{"$f":"IF('[2]Tasa de Falla'!IX84=0,\"\",'[2]Tasa de Falla'!IX84)","v":"XXXX"},{"$f":"IF('[2]Tasa de Falla'!IY84=0,\"\",'[2]Tasa de Falla'!IY84)","v":"XXXX"},{"$f":"IF('[2]Tasa de Falla'!IZ84=0,\"\",'[2]Tasa de Falla'!IZ84)","v":"XXXX"},{"$f":"IF('[2]Tasa de Falla'!JA84=0,\"\",'[2]Tasa de Falla'!JA84)","v":"XXXX"},{"$f":"IF('[2]Tasa de Falla'!JB84=0,\"\",'[2]Tasa de Falla'!JB84)","v":"XXXX"},{"$f":"IF('[2]Tasa de Falla'!JC84=0,\"\",'[2]Tasa de Falla'!JC84)","v":"XXXX"},{"$f":"IF('[2]Tasa de Falla'!JD84=0,\"\",'[2]Tasa de Falla'!JD84)","v":"XXXX"},{"$f":"IF('[2]Tasa de Falla'!JE84=0,\"\",'[2]Tasa de Falla'!JE84)","v":"XXXX"},{"$f":"IF('[2]Tasa de Falla'!JF84=0,\"\",'[2]Tasa de Falla'!JF84)","v":"XXXX"}]
[null,null,{"$f":"'[2]Tasa de Falla'!C85","v":67},{"$f":"'[2]Tasa de Falla'!D85","v":"FRIAS - RECREO"},{"$f":"'[2]Tasa de Falla'!E85","v":132},{"$f":"'[2]Tasa de Falla'!F85","v":74.540000000000006},{"$f":"IF('[2]Tasa de Falla'!IU85=0,\"\",'[2]Tasa de Falla'!IU85)","v":""},{"$f":"IF('[2]Tasa de Falla'!IV85=0,\"\",'[2]Tasa de Falla'!IV85)","v":""},{"$f":"IF('[2]Tasa de Falla'!IW85=0,\"\",'[2]Tasa de Falla'!IW85)","v":""},{"$f":"IF('[2]Tasa de Falla'!IX85=0,\"\",'[2]Tasa de Falla'!IX85)","v":""},{"$f":"IF('[2]Tasa de Falla'!IY85=0,\"\",'[2]Tasa de Falla'!IY85)","v":""},{"$f":"IF('[2]Tasa de Falla'!IZ85=0,\"\",'[2]Tasa de Falla'!IZ85)","v":""},{"$f":"IF('[2]Tasa de Falla'!JA85=0,\"\",'[2]Tasa de Falla'!JA85)","v":""},{"$f":"IF('[2]Tasa de Falla'!JB85=0,\"\",'[2]Tasa de Falla'!JB85)","v":""},{"$f":"IF('[2]Tasa de Falla'!JC85=0,\"\",'[2]Tasa de Falla'!JC85)","v":""},{"$f":"IF('[2]Tasa de Falla'!JD85=0,\"\",'[2]Tasa de Falla'!JD85)","v":""},{"$f":"IF('[2]Tasa de Falla'!JE85=0,\"\",'[2]Tasa de Falla'!JE85)","v":""},{"$f":"IF('[2]Tasa de Falla'!JF85=0,\"\",'[2]Tasa de Falla'!JF85)","v":2}]
[null,null,{"$f":"'[2]Tasa de Falla'!C86","v":68},{"$f":"'[2]Tasa de Falla'!D86","v":"RECREO - LA RIOJA 1"},{"$f":"'[2]Tasa de Falla'!E86","v":132},{"$f":"'[2]Tasa de Falla'!F86","v":221},{"$f":"IF('[2]Tasa de Falla'!IU86=0,\"\",'[2]Tasa de Falla'!IU86)","v":1},{"$f":"IF('[2]Tasa de Falla'!IV86=0,\"\",'[2]Tasa de Falla'!IV86)","v":""},{"$f":"IF('[2]Tasa de Falla'!IW86=0,\"\",'[2]Tasa de Falla'!IW86)","v":""},{"$f":"IF('[2]Tasa de Falla'!IX86=0,\"\",'[2]Tasa de Falla'!IX86)","v":""},{"$f":"IF('[2]Tasa de Falla'!IY86=0,\"\",'[2]Tasa de Falla'!IY86)","v":1},{"$f":"IF('[2]Tasa de Falla'!IZ86=0,\"\",'[2]Tasa de Falla'!IZ86)","v":1},{"$f":"IF('[2]Tasa de Falla'!JA86=0,\"\",'[2]Tasa de Falla'!JA86)","v":""},{"$f":"IF('[2]Tasa de Falla'!JB86=0,\"\",'[2]Tasa de Falla'!JB86)","v":""},{"$f":"IF('[2]Tasa de Falla'!JC86=0,\"\",'[2]Tasa de Falla'!JC86)","v":""},{"$f":"IF('[2]Tasa de Falla'!JD86=0,\"\",'[2]Tasa de Falla'!JD86)","v":2},{"$f":"IF('[2]Tasa de Falla'!JE86=0,\"\",'[2]Tasa de Falla'!JE86)","v":""},{"$f":"IF('[2]Tasa de Falla'!JF86=0,\"\",'[2]Tasa de Falla'!JF86)","v":""}]
[null,null,{"$f":"'[2]Tasa de Falla'!C87","v":69},{"$f":"'[2]Tasa de Falla'!D87","v":"RECREO - LA RIOJA 2"},{"$f":"'[2]Tasa de Falla'!E87","v":132},{"$f":"'[2]Tasa de Falla'!F87","v":220},{"$f":"IF('[2]Tasa de Falla'!IU87=0,\"\",'[2]Tasa de Falla'!IU87)","v":1},{"$f":"IF('[2]Tasa de Falla'!IV87=0,\"\",'[2]Tasa de Falla'!IV87)","v":""},{"$f":"IF('[2]Tasa de Falla'!IW87=0,\"\",'[2]Tasa de Falla'!IW87)","v":""},{"$f":"IF('[2]Tasa de Falla'!IX87=0,\"\",'[2]Tasa de Falla'!IX87)","v":1},{"$f":"IF('[2]Tasa de Falla'!IY87=0,\"\",'[2]Tasa de Falla'!IY87)","v":1},{"$f":"IF('[2]Tasa de Falla'!IZ87=0,\"\",'[2]Tasa de Falla'!IZ87)","v":""},{"$f":"IF('[2]Tasa de Falla'!JA87=0,\"\",'[2]Tasa de Falla'!JA87)","v":""},{"$f":"IF('[2]Tasa de Falla'!JB87=0,\"\",'[2]Tasa de Falla'!JB87)","v":""},{"$f":"IF('[2]Tasa de Falla'!JC87=0,\"\",'[2]Tasa de Falla'!JC87)","v":""},{"$f":"IF('[2]Tasa de Falla'!JD87=0,\"\",'[2]Tasa de Falla'!JD87)","v":3},{"$f":"IF('[2]Tasa de Falla'!JE87=0,\"\",'[2]Tasa de Falla'!JE87)","v":1},{"$f":"IF('[2]Tasa de Falla'!JF87=0,\"\",'[2]Tasa de Falla'!JF87)","v":2}]
[null,null,{"$f":"'[2]Tasa de Falla'!C88","v":70},{"$f":"'[2]Tasa de Falla'!D88","v":"RECREO - CATAMARCA"},{"$f":"'[2]Tasa de Falla'!E88","v":132},{"$f":"'[2]Tasa de Falla'!F88","v":203},{"$f":"IF('[2]Tasa de Falla'!IU88=0,\"\",'[2]Tasa de Falla'!IU88)","v":""},{"$f":"IF('[2]Tasa de Falla'!IV88=0,\"\",'[2]Tasa de Falla'!IV88)","v":""},{"$f":"IF('[2]Tasa de Falla'!IW88=0,\"\",'[2]Tasa de Falla'!IW88)","v":1},{"$f":"IF('[2]Tasa de Falla'!IX88=0,\"\",'[2]Tasa de Falla'!IX88)","v":""},{"$f":"IF('[2]Tasa de Falla'!IY88=0,\"\",'[2]Tasa de Falla'!IY88)","v":""},{"$f":"IF('[2]Tasa de Falla'!IZ88=0,\"\",'[2]Tasa de Falla'!IZ88)","v":""},{"$f":"IF('[2]Tasa de Falla'!JA88=0,\"\",'[2]Tasa de Falla'!JA88)","v":""},{"$f":"IF('[2]Tasa de Falla'!JB88=0,\"\",'[2]Tasa de Falla'!JB88)","v":""},{"$f":"IF('[2]Tasa de Falla'!JC88=0,\"\",'[2]Tasa de Falla'!JC88)","v":""},{"$f":"IF('[2]Tasa de Falla'!JD88=0,\"\",'[2]Tasa de Falla'!JD88)","v":""},{"$f":"IF('[2]Tasa de Falla'!JE88=0,\"\",'[2]Tasa de Falla'!JE88)","v":""},{"$f":"IF('[2]Tasa de Falla'!JF88=0,\"\",'[2]Tasa de Falla'!JF88)","v":""}]
[null,null,{"$f":"'[2]Tasa de Falla'!C89","v":71},{"$f":"'[2]Tasa de Falla'!D89","v":"CABRA CORRAL - EL CARRIL"},{"$f":"'[2]Tasa de Falla'!E89","v":132},{"$f":"'[2]Tasa de Falla'!F89","v":33.75},{"$f":"IF('[2]Tasa de Falla'!IU89=0,\"\",'[2]Tasa de Falla'!IU89)","v":""},{"$f":"IF('[2]Tasa de Falla'!IV89=0,\"\",'[2]Tasa de Falla'!IV89)","v":""},{"$f":"IF('[2]Tasa de Falla'!IW89=0,\"\",'[2]Tasa de Falla'!IW89)","v":""},{"$f":"IF('[2]Tasa de Falla'!IX89=0,\"\",'[2]Tasa de Falla'!IX89)","v":""},{"$f":"IF('[2]Tasa de Falla'!IY89=0,\"\",'[2]Tasa de Falla'!IY89)","v":""},{"$f":"IF('[2]Tasa de Falla'!IZ89=0,\"\",'[2]Tasa de Falla'!IZ89)","v":1},{"$f":"IF('[2]Tasa de Falla'!JA89=0,\"\",'[2]Tasa de Falla'!JA89)","v":""},{"$f":"IF('[2]Tasa de Falla'!JB89=0,\"\",'[2]Tasa de Falla'!JB89)","v":""},{"$f":"IF('[2]Tasa de Falla'!JC89=0,\"\",'[2]Tasa de Falla'!JC89)","v":""},{"$f":"IF('[2]Tasa de Falla'!JD89=0,\"\",'[2]Tasa de Falla'!JD89)","v":""},{"$f":"IF('[2]Tasa de Falla'!JE89=0,\"\",'[2]Tasa de Falla'!JE89)","v":""},{"$f":"IF('[2]Tasa de Falla'!JF89=0,\"\",'[2]Tasa de Falla'!JF89)","v":""}]
[null,null,{"$f":"'[2]Tasa de Falla'!C90","v":72},{"$f":"'[2]Tasa de Falla'!D90","v":"PAMPA GRANDE - CABRA CORRAL"},{"$f":"'[2]Tasa de Falla'!E90","v":132},{"$f":"'[2]Tasa de Falla'!F90","v":60},{"$f":"IF('[2]Tasa de Falla'!IU90=0,\"\",'[2]Tasa de Falla'!IU90)","v":1},{"$f":"IF('[2]Tasa de Falla'!IV90=0,\"\",'[2]Tasa de Falla'!IV90)","v":1},{"$f":"IF('[2]Tasa de Falla'!IW90=0,\"\",'[2]Tasa de Falla'!IW90)","v":1},{"$f":"IF('[2]Tasa de Falla'!IX90=0,\"\",'[2]Tasa de Falla'!IX90)","v":""},{"$f":"IF('[2]Tasa de Falla'!IY90=0,\"\",'[2]Tasa de Falla'!IY90)","v":""},{"$f":"IF('[2]Tasa de Falla'!IZ90=0,\"\",'[2]Tasa de Falla'!IZ90)","v":1},{"$f":"IF('[2]Tasa de Falla'!JA90=0,\"\",'[2]Tasa de Falla'!JA90)","v":""},{"$f":"IF('[2]Tasa de Falla'!JB90=0,\"\",'[2]Tasa de Falla'!JB90)","v":""},{"$f":"IF('[2]Tasa de Falla'!JC90=0,\"\",'[2]Tasa de Falla'!JC90)","v":""},{"$f":"IF('[2]Tasa de Falla'!JD90=0,\"\",'[2]Tasa de Falla'!JD90)","v":"XXXX"},{"$f":"IF('[2]Tasa de Falla'!JE90=0,\"\",'[2]Tasa de Falla'!JE90)","v":"XXXX"},{"$f":"IF('[2]Tasa de Falla'!JF90=0,\"\",'[2]Tasa de Falla'!JF90)","v":"XXXX"}]
[null,null,{"$f":"'[2]Tasa de Falla'!C91","v":73},{"$f":"'[2]Tasa de Falla'!D91","v":"PAMPA GRANDE - CAFAYATE"},{"$f":"'[2]Tasa de Falla'!E91","v":132},{"$f":"'[2]Tasa de Falla'!F91","v":63},{"$f":"IF('[2]Tasa de Falla'!IU91=0,\"\",'[2]Tasa de Falla'!IU91)","v":""},{"$f":"IF('[2]Tasa de Falla'!IV91=0,\"\",'[2]Tasa de Falla'!IV91)","v":""},{"$f":"IF('[2]Tasa de Falla'!IW91=0,\"\",'[2]Tasa de Falla'!IW91)","v":""},{"$f":"IF('[2]Tasa de Falla'!IX91=0,\"\",'[2]Tasa de Falla'!IX91)","v":""},{"$f":"IF('[2]Tasa de Falla'!IY91=0,\"\",'[2]Tasa de Falla'!IY91)","v":""},{"$f":"IF('[2]Tasa de Falla'!IZ91=0,\"\",'[2]Tasa de Falla'!IZ91)","v":""},{"$f":"IF('[2]Tasa de Falla'!JA91=0,\"\",'[2]Tasa de Falla'!JA91)","v":""},{"$f":"IF('[2]Tasa de Falla'!JB91=0,\"\",'[2]Tasa de Falla'!JB91)","v":""},{"$f":"IF('[2]Tasa de Falla'!JC91=0,\"\",'[2]Tasa de Falla'!JC91)","v":3},{"$f":"IF('[2]Tasa de Falla'!JD91=0,\"\",'[2]Tasa de Falla'!JD91)","v":""},{"$f":"IF('[2]Tasa de Falla'!JE91=0,\"\",'[2]Tasa de Falla'!JE91)","v":""},{"$f":"IF('[2]Tasa de Falla'!JF91=0,\"\",'[2]Tasa de Falla'!JF91)","v":""}]
[null,null,{"$f":"'[2]Tasa de Falla'!C92","v":74},{"$f":"'[2]Tasa de Falla'!D92","v":"PAMPA GRANDE - TRANCAS"},{"$f":"'[2]Tasa de Falla'!E92","v":132},{"$f":"'[2]Tasa de Falla'!F92","v":55},{"$f":"IF('[2]Tasa de Falla'!IU92=0,\"\",'[2]Tasa de Falla'!IU92)","v":""},{"$f":"IF('[2]Tasa de Falla'!IV92=0,\"\",'[2]Tasa de Falla'!IV92)","v":""},{"$f":"IF('[2]Tasa de Falla'!IW92=0,\"\",'[2]Tasa de Falla'!IW92)","v":""},{"$f":"IF('[2]Tasa de Falla'!IX92=0,\"\",'[2]Tasa de Falla'!IX92)","v":""},{"$f":"IF('[2]Tasa de Falla'!IY92=0,\"\",'[2]Tasa de Falla'!IY92)","v":""},{"$f":"IF('[2]Tasa de Falla'!IZ92=0,\"\",'[2]Tasa de Falla'!IZ92)","v":""},{"$f":"IF('[2]Tasa de Falla'!JA92=0,\"\",'[2]Tasa de Falla'!JA92)","v":2},{"$f":"IF('[2]Tasa de Falla'!JB92=0,\"\",'[2]Tasa de Falla'!JB92)","v":""},{"$f":"IF('[2]Tasa de Falla'!JC92=0,\"\",'[2]Tasa de Falla'!JC92)","v":""},{"$f":"IF('[2]Tasa de Falla'!JD92=0,\"\",'[2]Tasa de Falla'!JD92)","v":1},{"$f":"IF('[2]Tasa de Falla'!JE92=0,\"\",'[2]Tasa de Falla'!JE92)","v":1},{"$f":"IF('[2]Tasa de Falla'!JF92=0,\"\",'[2]Tasa de Falla'!JF92)","v":1}]
[null,null,{"$f":"'[2]Tasa de Falla'!C93","v":75},{"$f":"'[2]Tasa de Falla'!D93","v":"SANTIAGO CENTRO - FERNANDEZ - SUNCHO CORRAL "},{"$f":"'[2]Tasa de Falla'!E93","v":132},{"$f":"'[2]Tasa de Falla'!F93","v":103},{"$f":"IF('[2]Tasa de Falla'!IU93=0,\"\",'[2]Tasa de Falla'!IU93)","v":""},{"$f":"IF('[2]Tasa de Falla'!IV93=0,\"\",'[2]Tasa de Falla'!IV93)","v":""},{"$f":"IF('[2]Tasa de Falla'!IW93=0,\"\",'[2]Tasa de Falla'!IW93)","v":""},{"$f":"IF('[2]Tasa de Falla'!IX93=0,\"\",'[2]Tasa de Falla'!IX93)","v":""},{"$f":"IF('[2]Tasa de Falla'!IY93=0,\"\",'[2]Tasa de Falla'!IY93)","v":""},{"$f":"IF('[2]Tasa de Falla'!IZ93=0,\"\",'[2]Tasa de Falla'!IZ93)","v":""},{"$f":"IF('[2]Tasa de Falla'!JA93=0,\"\",'[2]Tasa de Falla'!JA93)","v":""},{"$f":"IF('[2]Tasa de Falla'!JB93=0,\"\",'[2]Tasa de Falla'!JB93)","v":1},{"$f":"IF('[2]Tasa de Falla'!JC93=0,\"\",'[2]Tasa de Falla'!JC93)","v":""},{"$f":"IF('[2]Tasa de Falla'!JD93=0,\"\",'[2]Tasa de Falla'!JD93)","v":""},{"$f":"IF('[2]Tasa de Falla'!JE93=0,\"\",'[2]Tasa de Falla'!JE93)","v":""},{"$f":"IF('[2]Tasa de Falla'!JF93=0,\"\",'[2]Tasa de Falla'!JF93)","v":""}]
[null,null,{"$f":"'[2]Tasa de Falla'!C94","v":76},{"$f":"'[2]Tasa de Falla'!D94","v":"SUNCHO CORRAL - ANATUYA"},{"$f":"'[2]Tasa de Falla'!E94","v":132},{"$f":"'[2]Tasa de Falla'!F94","v":81},{"$f":"IF('[2]Tasa de Falla'!IU94=0,\"\",'[2]Tasa de Falla'!IU94)","v":""},{"$f":"IF('[2]Tasa de Falla'!IV94=0,\"\",'[2]Tasa de Falla'!IV94)","v":""},{"$f":"IF('[2]Tasa de Falla'!IW94=0,\"\",'[2]Tasa de Falla'!IW94)","v":""},{"$f":"IF('[2]Tasa de Falla'!IX94=0,\"\",'[2]Tasa de Falla'!IX94)","v":""},{"$f":"IF('[2]Tasa de Falla'!IY94=0,\"\",'[2]Tasa de Falla'!IY94)","v":""},{"$f":"IF('[2]Tasa de Falla'!IZ94=0,\"\",'[2]Tasa de Falla'!IZ94)","v":""},{"$f":"IF('[2]Tasa de Falla'!JA94=0,\"\",'[2]Tasa de Falla'!JA94)","v":""},{"$f":"IF('[2]Tasa de Falla'!JB94=0,\"\",'[2]Tasa de Falla'!JB94)","v":""},{"$f":"IF('[2]Tasa de Falla'!JC94=0,\"\",'[2]Tasa de Falla'!JC94)","v":""},{"$f":"IF('[2]Tasa de Falla'!JD94=0,\"\",'[2]Tasa de Falla'!JD94)","v":""},{"$f":"IF('[2]Tasa de Falla'!JE94=0,\"\",'[2]Tasa de Falla'!JE94)","v":1},{"$f":"IF('[2]Tasa de Falla'!JF94=0,\"\",'[2]Tasa de Falla'!JF94)","v":""}]
[null,null,{"$f":"'[2]Tasa de Falla'!C95","v":77},{"$f":"'[2]Tasa de Falla'!D95","v":"LAS MADERAS - GÜEMES SALTA"},{"$f":"'[2]Tasa de Falla'!E95","v":132},{"$f":"'[2]Tasa de Falla'!F95","v":42},{"$f":"IF('[2]Tasa de Falla'!IU95=0,\"\",'[2]Tasa de Falla'!IU95)","v":""},{"$f":"IF('[2]Tasa de Falla'!IV95=0,\"\",'[2]Tasa de Falla'!IV95)","v":""},{"$f":"IF('[2]Tasa de Falla'!IW95=0,\"\",'[2]Tasa de Falla'!IW95)","v":""},{"$f":"IF('[2]Tasa de Falla'!IX95=0,\"\",'[2]Tasa de Falla'!IX95)","v":""},{"$f":"IF('[2]Tasa de Falla'!IY95=0,\"\",'[2]Tasa de Falla'!IY95)","v":""},{"$f":"IF('[2]Tasa de Falla'!IZ95=0,\"\",'[2]Tasa de Falla'!IZ95)","v":""},{"$f":"IF('[2]Tasa de Falla'!JA95=0,\"\",'[2]Tasa de Falla'!JA95)","v":""},{"$f":"IF('[2]Tasa de Falla'!JB95=0,\"\",'[2]Tasa de Falla'!JB95)","v":""},{"$f":"IF('[2]Tasa de Falla'!JC95=0,\"\",'[2]Tasa de Falla'!JC95)","v":""},{"$f":"IF('[2]Tasa de Falla'!JD95=0,\"\",'[2]Tasa de Falla'!JD95)","v":""},{"$f":"IF('[2]Tasa de Falla'!JE95=0,\"\",'[2]Tasa de Falla'!JE95)","v":""},{"$f":"IF('[2]Tasa de Falla'!JF95=0,\"\",'[2]Tasa de Falla'!JF95)","v":""}]
[null,null,{"$f":"'[2]Tasa de Falla'!C96","v":78},{"$f":"'[2]Tasa de Falla'!D96","v":"INDEPENDENCIA - EL BRACHO 2"},{"$f":"'[2]Tasa de Falla'!E96","v":132},{"$f":"'[2]Tasa de Falla'!F96","v":17.100000000000001},{"$f":"IF('[2]Tasa de Falla'!IU96=0,\"\",'[2]Tasa de Falla'!IU96)","v":""},{"$f":"IF('[2]Tasa de Falla'!IV96=0,\"\",'[2]Tasa de Falla'!IV96)","v":1},{"$f":"IF('[2]Tasa de Falla'!IW96=0,\"\",'[2]Tasa de Falla'!IW96)","v":""},{"$f":"IF('[2]Tasa de Falla'!IX96=0,\"\",'[2]Tasa de Falla'!IX96)","v":""},{"$f":"IF('[2]Tasa de Falla'!IY96=0,\"\",'[2]Tasa de Falla'!IY96)","v":""},{"$f":"IF('[2]Tasa de Falla'!IZ96=0,\"\",'[2]Tasa de Falla'!IZ96)","v":1},{"$f":"IF('[2]Tasa de Falla'!JA96=0,\"\",'[2]Tasa de Falla'!JA96)","v":2},{"$f":"IF('[2]Tasa de Falla'!JB96=0,\"\",'[2]Tasa de Falla'!JB96)","v":""},{"$f":"IF('[2]Tasa de Falla'!JC96=0,\"\",'[2]Tasa de Falla'!JC96)","v":""},{"$f":"IF('[2]Tasa de Falla'!JD96=0,\"\",'[2]Tasa de Falla'!JD96)","v":""},{"$f":"IF('[2]Tasa de Falla'!JE96=0,\"\",'[2]Tasa de Falla'!JE96)","v":""},{"$f":"IF('[2]Tasa de Falla'!JF96=0,\"\",'[2]Tasa de Falla'!JF96)","v":1}]
[null,null,{"$f":"'[2]Tasa de Falla'!C97","v":79},{"$f":"'[2]Tasa de Falla'!D97","v":"GÜEMES - SALTA NORTE"},{"$f":"'[2]Tasa de Falla'!E97","v":132},{"$f":"'[2]Tasa de Falla'!F97","v":39},{"$f":"IF('[2]Tasa de Falla'!IU97=0,\"\",'[2]Tasa de Falla'!IU97)","v":"XXXX"},{"$f":"IF('[2]Tasa de Falla'!IV97=0,\"\",'[2]Tasa de Falla'!IV97)","v":"XXXX"},{"$f":"IF('[2]Tasa de Falla'!IW97=0,\"\",'[2]Tasa de Falla'!IW97)","v":"XXXX"},{"$f":"IF('[2]Tasa de Falla'!IX97=0,\"\",'[2]Tasa de Falla'!IX97)","v":"XXXX"},{"$f":"IF('[2]Tasa de Falla'!IY97=0,\"\",'[2]Tasa de Falla'!IY97)","v":"XXXX"},{"$f":"IF('[2]Tasa de Falla'!IZ97=0,\"\",'[2]Tasa de Falla'!IZ97)","v":"XXXX"},{"$f":"IF('[2]Tasa de Falla'!JA97=0,\"\",'[2]Tasa de Falla'!JA97)","v":"XXXX"},{"$f":"IF('[2]Tasa de Falla'!JB97=0,\"\",'[2]Tasa de Falla'!JB97)","v":"XXXX"},{"$f":"IF('[2]Tasa de Falla'!JC97=0,\"\",'[2]Tasa de Falla'!JC97)","v":"XXXX"},{"$f":"IF('[2]Tasa de Falla'!JD97=0,\"\",'[2]Tasa de Falla'!JD97)","v":"XXXX"},{"$f":"IF('[2]Tasa de Falla'!JE97=0,\"\",'[2]Tasa de Falla'!JE97)","v":"XXXX"},{"$f":"IF('[2]Tasa de Falla'!JF97=0,\"\",'[2]Tasa de Falla'!JF97)","v":"XXXX"}]
[null,null,{"$f":"'[2]Tasa de Falla'!C98","v":80},{"$f":"'[2]Tasa de Falla'!D98","v":"BURRUYACU - COBOS"},{"$f":"'[2]Tasa de Falla'!E98","v":132},{"$f":"'[2]Tasa de Falla'!F98","v":229.5},{"$f":"IF('[2]Tasa de Falla'!IU98=0,\"\",'[2]Tasa de Falla'!IU98)","v":"XXXX"},{"$f":"IF('[2]Tasa de Falla'!IV98=0,\"\",'[2]Tasa de Falla'!IV98)","v":"XXXX"},{"$f":"IF('[2]Tasa de Falla'!IW98=0,\"\",'[2]Tasa de Falla'!IW98)","v":"XXXX"},{"$f":"IF('[2]Tasa de Falla'!IX98=0,\"\",'[2]Tasa de Falla'!IX98)","v":"XXXX"},{"$f":"IF('[2]Tasa de Falla'!IY98=0,\"\",'[2]Tasa de Falla'!IY98)","v":"XXXX"},{"$f":"IF('[2]Tasa de Falla'!IZ98=0,\"\",'[2]Tasa de Falla'!IZ98)","v":"XXXX"},{"$f":"IF('[2]Tasa de Falla'!JA98=0,\"\",'[2]Tasa de Falla'!JA98)","v":"XXXX"},{"$f":"IF('[2]Tasa de Falla'!JB98=0,\"\",'[2]Tasa de Falla'!JB98)","v":"XXXX"},{"$f":"IF('[2]Tasa de Falla'!JC98=0,\"\",'[2]Tasa de Falla'!JC98)","v":"XXXX"},{"$f":"IF('[2]Tasa de Falla'!JD98=0,\"\",'[2]Tasa de Falla'!JD98)","v":"XXXX"},{"$f":"IF('[2]Tasa de Falla'!JE98=0,\"\",'[2]Tasa de Falla'!JE98)","v":"XXXX"},{"$f":"IF('[2]Tasa de Falla'!JF98=0,\"\",'[2]Tasa de Falla'!JF98)","v":"XXXX"}]
[null,null,{"$f":"'[2]Tasa de Falla'!C99","v":81},{"$f":"'[2]Tasa de Falla'!D99","v":"METAN - COBOS"},{"$f":"'[2]Tasa de Falla'!E99","v":132},{"$f":"'[2]Tasa de Falla'!F99","v":89.2},{"$f":"IF('[2]Tasa de Falla'!IU99=0,\"\",'[2]Tasa de Falla'!IU99)","v":""},{"$f":"IF('[2]Tasa de Falla'!IV99=0,\"\",'[2]Tasa de Falla'!IV99)","v":""},{"$f":"IF('[2]Tasa de Falla'!IW99=0,\"\",'[2]Tasa de Falla'!IW99)","v":""},{"$f":"IF('[2]Tasa de Falla'!IX99=0,\"\",'[2]Tasa de Falla'!IX99)","v":""},{"$f":"IF('[2]Tasa de Falla'!IY99=0,\"\",'[2]Tasa de Falla'!IY99)","v":""},{"$f":"IF('[2]Tasa de Falla'!IZ99=0,\"\",'[2]Tasa de Falla'!IZ99)","v":""},{"$f":"IF('[2]Tasa de Falla'!JA99=0,\"\",'[2]Tasa de Falla'!JA99)","v":""},{"$f":"IF('[2]Tasa de Falla'!JB99=0,\"\",'[2]Tasa de Falla'!JB99)","v":""},{"$f":"IF('[2]Tasa de Falla'!JC99=0,\"\",'[2]Tasa de Falla'!JC99)","v":""},{"$f":"IF('[2]Tasa de Falla'!JD99=0,\"\",'[2]Tasa de Falla'!JD99)","v":""},{"$f":"IF('[2]Tasa de Falla'!JE99=0,\"\",'[2]Tasa de Falla'!JE99)","v":""},{"$f":"IF('[2]Tasa de Falla'!JF99=0,\"\",'[2]Tasa de Falla'!JF99)","v":""}]
[null,null,{"$f":"'[2]Tasa de Falla'!C100","v":82},{"$f":"'[2]Tasa de Falla'!D100","v":"AÑATUYA - BANDERA"},{"$f":"'[2]Tasa de Falla'!E100","v":132},{"$f":"'[2]Tasa de Falla'!F100","v":76},{"$f":"IF('[2]Tasa de Falla'!IU100=0,\"\",'[2]Tasa de Falla'!IU100)","v":""},{"$f":"IF('[2]Tasa de Falla'!IV100=0,\"\",'[2]Tasa de Falla'!IV100)","v":1},{"$f":"IF('[2]Tasa de Falla'!IW100=0,\"\",'[2]Tasa de Falla'!IW100)","v":""},{"$f":"IF('[2]Tasa de Falla'!IX100=0,\"\",'[2]Tasa de Falla'!IX100)","v":""},{"$f":"IF('[2]Tasa de Falla'!IY100=0,\"\",'[2]Tasa de Falla'!IY100)","v":""},{"$f":"IF('[2]Tasa de Falla'!IZ100=0,\"\",'[2]Tasa de Falla'!IZ100)","v":""},{"$f":"IF('[2]Tasa de Falla'!JA100=0,\"\",'[2]Tasa de Falla'!JA100)","v":""},{"$f":"IF('[2]Tasa de Falla'!JB100=0,\"\",'[2]Tasa de Falla'!JB100)","v":""},{"$f":"IF('[2]Tasa de Falla'!JC100=0,\"\",'[2]Tasa de Falla'!JC100)","v":""},{"$f":"IF('[2]Tasa de Falla'!JD100=0,\"\",'[2]Tasa de Falla'!JD100)","v":""},{"$f":"IF('[2]Tasa de Falla'!JE100=0,\"\",'[2]Tasa de Falla'!JE100)","v":1},{"$f":"IF('[2]Tasa de Falla'!JF100=0,\"\",'[2]Tasa de Falla'!JF100)","v":""}]
[null,null,{"$f":"'[2]Tasa de Falla'!C101","v":84},{"$f":"'[2]Tasa de Falla'!D101","v":"GÜEMES SALTA - COBOS 1"},{"$f":"'[2]Tasa de Falla'!E101","v":132},{"$f":"'[2]Tasa de Falla'!F101","v":12.1},{"$f":"IF('[2]Tasa de Falla'!IU101=0,\"\",'[2]Tasa de Falla'!IU101)","v":""},{"$f":"IF('[2]Tasa de Falla'!IV101=0,\"\",'[2]Tasa de Falla'!IV101)","v":""},{"$f":"IF('[2]Tasa de Falla'!IW101=0,\"\",'[2]Tasa de Falla'!IW101)","v":""},{"$f":"IF('[2]Tasa de Falla'!IX101=0,\"\",'[2]Tasa de Falla'!IX101)","v":""},{"$f":"IF('[2]Tasa de Falla'!IY101=0,\"\",'[2]Tasa de Falla'!IY101)","v":""},{"$f":"IF('[2]Tasa de Falla'!IZ101=0,\"\",'[2]Tasa de Falla'!IZ101)","v":""},{"$f":"IF('[2]Tasa de Falla'!JA101=0,\"\",'[2]Tasa de Falla'!JA101)","v":""},{"$f":"IF('[2]Tasa de Falla'!JB101=0,\"\",'[2]Tasa de Falla'!JB101)","v":""},{"$f":"IF('[2]Tasa de Falla'!JC101=0,\"\",'[2]Tasa de Falla'!JC101)","v":""},{"$f":"IF('[2]Tasa de Falla'!JD101=0,\"\",'[2]Tasa de Falla'!JD101)","v":""},{"$f":"IF('[2]Tasa de Falla'!JE101=0,\"\",'[2]Tasa de Falla'!JE101)","v":1},{"$f":"IF('[2]Tasa de Falla'!JF101=0,\"\",'[2]Tasa de Falla'!JF101)","v":1}]
[null,null,{"$f":"'[2]Tasa de Falla'!C102","v":85},{"$f":"'[2]Tasa de Falla'!D102","v":"GÜEMES SALTA - COBOS 2"},{"$f":"'[2]Tasa de Falla'!E102","v":132},{"$f":"'[2]Tasa de Falla'!F102","v":12.1},{"$f":"IF('[2]Tasa de Falla'!IU102=0,\"\",'[2]Tasa de Falla'!IU102)","v":""},{"$f":"IF('[2]Tasa de Falla'!IV102=0,\"\",'[2]Tasa de Falla'!IV102)","v":""},{"$f":"IF('[2]Tasa de Falla'!IW102=0,\"\",'[2]Tasa de Falla'!IW102)","v":""},{"$f":"IF('[2]Tasa de Falla'!IX102=0,\"\",'[2]Tasa de Falla'!IX102)","v":""},{"$f":"IF('[2]Tasa de Falla'!IY102=0,\"\",'[2]Tasa de Falla'!IY102)","v":""},{"$f":"IF('[2]Tasa de Falla'!IZ102=0,\"\",'[2]Tasa de Falla'!IZ102)","v":1},{"$f":"IF('[2]Tasa de Falla'!JA102=0,\"\",'[2]Tasa de Falla'!JA102)","v":""},{"$f":"IF('[2]Tasa de Falla'!JB102=0,\"\",'[2]Tasa de Falla'!JB102)","v":""},{"$f":"IF('[2]Tasa de Falla'!JC102=0,\"\",'[2]Tasa de Falla'!JC102)","v":""},{"$f":"IF('[2]Tasa de Falla'!JD102=0,\"\",'[2]Tasa de Falla'!JD102)","v":""},{"$f":"IF('[2]Tasa de Falla'!JE102=0,\"\",'[2]Tasa de Falla'!JE102)","v":2},{"$f":"IF('[2]Tasa de Falla'!JF102=0,\"\",'[2]Tasa de Falla'!JF102)","v":""}]
[null,null,{"$f":"'[2]Tasa de Falla'!C103","v":86},{"$f":"'[2]Tasa de Falla'!D103","v":"EL BRACHO - LA BANDA"},{"$f":"'[2]Tasa de Falla'!E103","v":132},{"$f":"'[2]Tasa de Falla'!F103","v":133.5},{"$f":"IF('[2]Tasa de Falla'!IU103=0,\"\",'[2]Tasa de Falla'!IU103)","v":"XXXX"},{"$f":"IF('[2]Tasa de Falla'!IV103=0,\"\",'[2]Tasa de Falla'!IV103)","v":"XXXX"},{"$f":"IF('[2]Tasa de Falla'!IW103=0,\"\",'[2]Tasa de Falla'!IW103)","v":"XXXX"},{"$f":"IF('[2]Tasa de Falla'!IX103=0,\"\",'[2]Tasa de Falla'!IX103)","v":"XXXX"},{"$f":"IF('[2]Tasa de Falla'!IY103=0,\"\",'[2]Tasa de Falla'!IY103)","v":"XXXX"},{"$f":"IF('[2]Tasa de Falla'!IZ103=0,\"\",'[2]Tasa de Falla'!IZ103)","v":"XXXX"},{"$f":"IF('[2]Tasa de Falla'!JA103=0,\"\",'[2]Tasa de Falla'!JA103)","v":"XXXX"},{"$f":"IF('[2]Tasa de Falla'!JB103=0,\"\",'[2]Tasa de Falla'!JB103)","v":"XXXX"},{"$f":"IF('[2]Tasa de Falla'!JC103=0,\"\",'[2]Tasa de Falla'!JC103)","v":"XXXX"},{"$f":"IF('[2]Tasa de Falla'!JD103=0,\"\",'[2]Tasa de Falla'!JD103)","v":"XXXX"},{"$f":"IF('[2]Tasa de Falla'!JE103=0,\"\",'[2]Tasa de Falla'!JE103)","v":"XXXX"},{"$f":"IF('[2]Tasa de Falla'!JF103=0,\"\",'[2]Tasa de Falla'!JF103)","v":"XXXX"}]
[null,null,{"$f":"'[2]Tasa de Falla'!C104","v":87},{"$f":"'[2]Tasa de Falla'!D104","v":"SANTIAGO OESTE - SANTIAGO SUR "},{"$f":"'[2]Tasa de Falla'!E104","v":132},{"$f":"'[2]Tasa de Falla'!F104","v":10.6},{"$f":"IF('[2]Tasa de Falla'!IU104=0,\"\",'[2]Tasa de Falla'!IU104)","v":""},{"$f":"IF('[2]Tasa de Falla'!IV104=0,\"\",'[2]Tasa de Falla'!IV104)","v":""},{"$f":"IF('[2]Tasa de Falla'!IW104=0,\"\",'[2]Tasa de Falla'!IW104)","v":""},{"$f":"IF('[2]Tasa de Falla'!IX104=0,\"\",'[2]Tasa de Falla'!IX104)","v":""},{"$f":"IF('[2]Tasa de Falla'!IY104=0,\"\",'[2]Tasa de Falla'!IY104)","v":""},{"$f":"IF('[2]Tasa de Falla'!IZ104=0,\"\",'[2]Tasa de Falla'!IZ104)","v":""},{"$f":"IF('[2]Tasa de Falla'!JA104=0,\"\",'[2]Tasa de Falla'!JA104)","v":""},{"$f":"IF('[2]Tasa de Falla'!JB104=0,\"\",'[2]Tasa de Falla'!JB104)","v":""},{"$f":"IF('[2]Tasa de Falla'!JC104=0,\"\",'[2]Tasa de Falla'!JC104)","v":""},{"$f":"IF('[2]Tasa de Falla'!JD104=0,\"\",'[2]Tasa de Falla'!JD104)","v":""},{"$f":"IF('[2]Tasa de Falla'!JE104=0,\"\",'[2]Tasa de Falla'!JE104)","v":""},{"$f":"IF('[2]Tasa de Falla'!JF104=0,\"\",'[2]Tasa de Falla'!JF104)","v":""}]
[null,null,{"$f":"'[2]Tasa de Falla'!C105","v":88},{"$f":"'[2]Tasa de Falla'!D105","v":"SANTIAGO SUR - SANTIAGO CENTRO"},{"$f":"'[2]Tasa de Falla'!E105","v":132},{"$f":"'[2]Tasa de Falla'!F105","v":4},{"$f":"IF('[2]Tasa de Falla'!IU105=0,\"\",'[2]Tasa de Falla'!IU105)","v":""},{"$f":"IF('[2]Tasa de Falla'!IV105=0,\"\",'[2]Tasa de Falla'!IV105)","v":""},{"$f":"IF('[2]Tasa de Falla'!IW105=0,\"\",'[2]Tasa de Falla'!IW105)","v":""},{"$f":"IF('[2]Tasa de Falla'!IX105=0,\"\",'[2]Tasa de Falla'!IX105)","v":""},{"$f":"IF('[2]Tasa de Falla'!IY105=0,\"\",'[2]Tasa de Falla'!IY105)","v":""},{"$f":"IF('[2]Tasa de Falla'!IZ105=0,\"\",'[2]Tasa de Falla'!IZ105)","v":""},{"$f":"IF('[2]Tasa de Falla'!JA105=0,\"\",'[2]Tasa de Falla'!JA105)","v":""},{"$f":"IF('[2]Tasa de Falla'!JB105=0,\"\",'[2]Tasa de Falla'!JB105)","v":""},{"$f":"IF('[2]Tasa de Falla'!JC105=0,\"\",'[2]Tasa de Falla'!JC105)","v":""},{"$f":"IF('[2]Tasa de Falla'!JD105=0,\"\",'[2]Tasa de Falla'!JD105)","v":""},{"$f":"IF('[2]Tasa de Falla'!JE105=0,\"\",'[2]Tasa de Falla'!JE105)","v":""},{"$f":"IF('[2]Tasa de Falla'!JF105=0,\"\",'[2]Tasa de Falla'!JF105)","v":""}]
[null,null,{"$f":"'[2]Tasa de Falla'!C106","v":89},{"$f":"'[2]Tasa de Falla'!D106","v":"C.H. RIO HONDO - SANTIAGO OESTE"},{"$f":"'[2]Tasa de Falla'!E106","v":132},{"$f":"'[2]Tasa de Falla'!F106","v":69.8},{"$f":"IF('[2]Tasa de Falla'!IU106=0,\"\",'[2]Tasa de Falla'!IU106)","v":""},{"$f":"IF('[2]Tasa de Falla'!IV106=0,\"\",'[2]Tasa de Falla'!IV106)","v":""},{"$f":"IF('[2]Tasa de Falla'!IW106=0,\"\",'[2]Tasa de Falla'!IW106)","v":""},{"$f":"IF('[2]Tasa de Falla'!IX106=0,\"\",'[2]Tasa de Falla'!IX106)","v":""},{"$f":"IF('[2]Tasa de Falla'!IY106=0,\"\",'[2]Tasa de Falla'!IY106)","v":""},{"$f":"IF('[2]Tasa de Falla'!IZ106=0,\"\",'[2]Tasa de Falla'!IZ106)","v":""},{"$f":"IF('[2]Tasa de Falla'!JA106=0,\"\",'[2]Tasa de Falla'!JA106)","v":""},{"$f":"IF('[2]Tasa de Falla'!JB106=0,\"\",'[2]Tasa de Falla'!JB106)","v":""},{"$f":"IF('[2]Tasa de Falla'!JC106=0,\"\",'[2]Tasa de Falla'!JC106)","v":""},{"$f":"IF('[2]Tasa de Falla'!JD106=0,\"\",'[2]Tasa de Falla'!JD106)","v":""},{"$f":"IF('[2]Tasa de Falla'!JE106=0,\"\",'[2]Tasa de Falla'!JE106)","v":""},{"$f":"IF('[2]Tasa de Falla'!JF106=0,\"\",'[2]Tasa de Falla'!JF106)","v":""}]
[null,null,{"$f":"'[2]Tasa de Falla'!C107","v":90},{"$f":"'[2]Tasa de Falla'!D107","v":"GÜEMES - MINETTI"},{"$f":"'[2]Tasa de Falla'!E107","v":132},{"$f":"'[2]Tasa de Falla'!F107","v":36.1},{"$f":"IF('[2]Tasa de Falla'!IU107=0,\"\",'[2]Tasa de Falla'!IU107)","v":"XXXX"},{"$f":"IF('[2]Tasa de Falla'!IV107=0,\"\",'[2]Tasa de Falla'!IV107)","v":"XXXX"},{"$f":"IF('[2]Tasa de Falla'!IW107=0,\"\",'[2]Tasa de Falla'!IW107)","v":"XXXX"},{"$f":"IF('[2]Tasa de Falla'!IX107=0,\"\",'[2]Tasa de Falla'!IX107)","v":"XXXX"},{"$f":"IF('[2]Tasa de Falla'!IY107=0,\"\",'[2]Tasa de Falla'!IY107)","v":"XXXX"},{"$f":"IF('[2]Tasa de Falla'!IZ107=0,\"\",'[2]Tasa de Falla'!IZ107)","v":"XXXX"},{"$f":"IF('[2]Tasa de Falla'!JA107=0,\"\",'[2]Tasa de Falla'!JA107)","v":"XXXX"},{"$f":"IF('[2]Tasa de Falla'!JB107=0,\"\",'[2]Tasa de Falla'!JB107)","v":"XXXX"},{"$f":"IF('[2]Tasa de Falla'!JC107=0,\"\",'[2]Tasa de Falla'!JC107)","v":"XXXX"},{"$f":"IF('[2]Tasa de Falla'!JD107=0,\"\",'[2]Tasa de Falla'!JD107)","v":"XXXX"},{"$f":"IF('[2]Tasa de Falla'!JE107=0,\"\",'[2]Tasa de Falla'!JE107)","v":"XXXX"},{"$f":"IF('[2]Tasa de Falla'!JF107=0,\"\",'[2]Tasa de Falla'!JF107)","v":"XXXX"}]
[null,null,{"$f":"'[2]Tasa de Falla'!C108","v":91},{"$f":"'[2]Tasa de Falla'!D108","v":"GÜEMES - SALTA NORTE"},{"$f":"'[2]Tasa de Falla'!E108","v":132},{"$f":"'[2]Tasa de Falla'!F108","v":38.97},{"$f":"IF('[2]Tasa de Falla'!IU108=0,\"\",'[2]Tasa de Falla'!IU108)","v":""},{"$f":"IF('[2]Tasa de Falla'!IV108=0,\"\",'[2]Tasa de Falla'!IV108)","v":""},{"$f":"IF('[2]Tasa de Falla'!IW108=0,\"\",'[2]Tasa de Falla'!IW108)","v":""},{"$f":"IF('[2]Tasa de Falla'!IX108=0,\"\",'[2]Tasa de Falla'!IX108)","v":""},{"$f":"IF('[2]Tasa de Falla'!IY108=0,\"\",'[2]Tasa de Falla'!IY108)","v":""},{"$f":"IF('[2]Tasa de Falla'!IZ108=0,\"\",'[2]Tasa de Falla'!IZ108)","v":""},{"$f":"IF('[2]Tasa de Falla'!JA108=0,\"\",'[2]Tasa de Falla'!JA108)","v":""},{"$f":"IF('[2]Tasa de Falla'!JB108=0,\"\",'[2]Tasa de Falla'!JB108)","v":""},{"$f":"IF('[2]Tasa de Falla'!JC108=0,\"\",'[2]Tasa de Falla'!JC108)","v":""},{"$f":"IF('[2]Tasa de Falla'!JD108=0,\"\",'[2]Tasa de Falla'!JD108)","v":""},{"$f":"IF('[2]Tasa de Falla'!JE108=0,\"\",'[2]Tasa de Falla'!JE108)","v":""},{"$f":"IF('[2]Tasa de Falla'!JF108=0,\"\",'[2]Tasa de Falla'!JF108)","v":""}]
[null,null,{"$f":"'[2]Tasa de Falla'!C109","v":92},{"$f":"'[2]Tasa de Falla'!D109","v":"BURRUYACU - R. DE LA FRONTERA"},{"$f":"'[2]Tasa de Falla'!E109","v":132},{"$f":"'[2]Tasa de Falla'!F109","v":99.1},{"$f":"IF('[2]Tasa de Falla'!IU109=0,\"\",'[2]Tasa de Falla'!IU109)","v":""},{"$f":"IF('[2]Tasa de Falla'!IV109=0,\"\",'[2]Tasa de Falla'!IV109)","v":""},{"$f":"IF('[2]Tasa de Falla'!IW109=0,\"\",'[2]Tasa de Falla'!IW109)","v":""},{"$f":"IF('[2]Tasa de Falla'!IX109=0,\"\",'[2]Tasa de Falla'!IX109)","v":""},{"$f":"IF('[2]Tasa de Falla'!IY109=0,\"\",'[2]Tasa de Falla'!IY109)","v":""},{"$f":"IF('[2]Tasa de Falla'!IZ109=0,\"\",'[2]Tasa de Falla'!IZ109)","v":""},{"$f":"IF('[2]Tasa de Falla'!JA109=0,\"\",'[2]Tasa de Falla'!JA109)","v":1},{"$f":"IF('[2]Tasa de Falla'!JB109=0,\"\",'[2]Tasa de Falla'!JB109)","v":""},{"$f":"IF('[2]Tasa de Falla'!JC109=0,\"\",'[2]Tasa de Falla'!JC109)","v":""},{"$f":"IF('[2]Tasa de Falla'!JD109=0,\"\",'[2]Tasa de Falla'!JD109)","v":""},{"$f":"IF('[2]Tasa de Falla'!JE109=0,\"\",'[2]Tasa de Falla'!JE109)","v":""},{"$f":"IF('[2]Tasa de Falla'!JF109=0,\"\",'[2]Tasa de Falla'!JF109)","v":""}]
[null,null,{"$f":"'[2]Tasa de Falla'!C110","v":93},{"$f":"'[2]Tasa de Falla'!D110","v":"R. DE LA FRONTERA - COBOS"},{"$f":"'[2]Tasa de Falla'!E110","v":132},{"$f":"'[2]Tasa de Falla'!F110","v":130.4},{"$f":"IF('[2]Tasa de Falla'!IU110=0,\"\",'[2]Tasa de Falla'!IU110)","v":""},{"$f":"IF('[2]Tasa de Falla'!IV110=0,\"\",'[2]Tasa de Falla'!IV110)","v":""},{"$f":"IF('[2]Tasa de Falla'!IW110=0,\"\",'[2]Tasa de Falla'!IW110)","v":""},{"$f":"IF('[2]Tasa de Falla'!IX110=0,\"\",'[2]Tasa de Falla'!IX110)","v":""},{"$f":"IF('[2]Tasa de Falla'!IY110=0,\"\",'[2]Tasa de Falla'!IY110)","v":""},{"$f":"IF('[2]Tasa de Falla'!IZ110=0,\"\",'[2]Tasa de Falla'!IZ110)","v":""},{"$f":"IF('[2]Tasa de Falla'!JA110=0,\"\",'[2]Tasa de Falla'!JA110)","v":1},{"$f":"IF('[2]Tasa de Falla'!JB110=0,\"\",'[2]Tasa de Falla'!JB110)","v":""},{"$f":"IF('[2]Tasa de Falla'!JC110=0,\"\",'[2]Tasa de Falla'!JC110)","v":""},{"$f":"IF('[2]Tasa de Falla'!JD110=0,\"\",'[2]Tasa de Falla'!JD110)","v":""},{"$f":"IF('[2]Tasa de Falla'!JE110=0,\"\",'[2]Tasa de Falla'!JE110)","v":""},{"$f":"IF('[2]Tasa de Falla'!JF110=0,\"\",'[2]Tasa de Falla'!JF110)","v":1}]
[null,null,{"$f":"'[2]Tasa de Falla'!C111","v":94},{"$f":"'[2]Tasa de Falla'!D111","v":"J.V. GONZALEZ - APOLINARIO SARAVIA"},{"$f":"'[2]Tasa de Falla'!E111","v":132},{"$f":"'[2]Tasa de Falla'!F111","v":94},{"$f":"IF('[2]Tasa de Falla'!IU111=0,\"\",'[2]Tasa de Falla'!IU111)","v":""},{"$f":"IF('[2]Tasa de Falla'!IV111=0,\"\",'[2]Tasa de Falla'!IV111)","v":""},{"$f":"IF('[2]Tasa de Falla'!IW111=0,\"\",'[2]Tasa de Falla'!IW111)","v":""},{"$f":"IF('[2]Tasa de Falla'!IX111=0,\"\",'[2]Tasa de Falla'!IX111)","v":""},{"$f":"IF('[2]Tasa de Falla'!IY111=0,\"\",'[2]Tasa de Falla'!IY111)","v":""},{"$f":"IF('[2]Tasa de Falla'!IZ111=0,\"\",'[2]Tasa de Falla'!IZ111)","v":""},{"$f":"IF('[2]Tasa de Falla'!JA111=0,\"\",'[2]Tasa de Falla'!JA111)","v":""},{"$f":"IF('[2]Tasa de Falla'!JB111=0,\"\",'[2]Tasa de Falla'!JB111)","v":""},{"$f":"IF('[2]Tasa de Falla'!JC111=0,\"\",'[2]Tasa de Falla'!JC111)","v":1},{"$f":"IF('[2]Tasa de Falla'!JD111=0,\"\",'[2]Tasa de Falla'!JD111)","v":""},{"$f":"IF('[2]Tasa de Falla'!JE111=0,\"\",'[2]Tasa de Falla'!JE111)","v":""},{"$f":"IF('[2]Tasa de Falla'!JF111=0,\"\",'[2]Tasa de Falla'!JF111)","v":""}]
[null,null,{"$f":"'[2]Tasa de Falla'!C112","v":95},{"$f":"'[2]Tasa de Falla'!D112","v":"ANDALGALA - SAULIL"},{"$f":"'[2]Tasa de Falla'!E112","v":132},{"$f":"'[2]Tasa de Falla'!F112","v":76},{"$f":"IF('[2]Tasa de Falla'!IU112=0,\"\",'[2]Tasa de Falla'!IU112)","v":""},{"$f":"IF('[2]Tasa de Falla'!IV112=0,\"\",'[2]Tasa de Falla'!IV112)","v":""},{"$f":"IF('[2]Tasa de Falla'!IW112=0,\"\",'[2]Tasa de Falla'!IW112)","v":""},{"$f":"IF('[2]Tasa de Falla'!IX112=0,\"\",'[2]Tasa de Falla'!IX112)","v":""},{"$f":"IF('[2]Tasa de Falla'!IY112=0,\"\",'[2]Tasa de Falla'!IY112)","v":""},{"$f":"IF('[2]Tasa de Falla'!IZ112=0,\"\",'[2]Tasa de Falla'!IZ112)","v":""},{"$f":"IF('[2]Tasa de Falla'!JA112=0,\"\",'[2]Tasa de Falla'!JA112)","v":""},{"$f":"IF('[2]Tasa de Falla'!JB112=0,\"\",'[2]Tasa de Falla'!JB112)","v":""},{"$f":"IF('[2]Tasa de Falla'!JC112=0,\"\",'[2]Tasa de Falla'!JC112)","v":1},{"$f":"IF('[2]Tasa de Falla'!JD112=0,\"\",'[2]Tasa de Falla'!JD112)","v":""},{"$f":"IF('[2]Tasa de Falla'!JE112=0,\"\",'[2]Tasa de Falla'!JE112)","v":1},{"$f":"IF('[2]Tasa de Falla'!JF112=0,\"\",'[2]Tasa de Falla'!JF112)","v":""}]
[null,null,{"$f":"'[2]Tasa de Falla'!C113","v":96},{"$f":"'[2]Tasa de Falla'!D113","v":"SANTIAGO OESTE - SANT. SUR  - SANT. CENTRO"},{"$f":"'[2]Tasa de Falla'!E113","v":132},{"$f":"'[2]Tasa de Falla'!F113","v":14.6},{"$f":"IF('[2]Tasa de Falla'!IU113=0,\"\",'[2]Tasa de Falla'!IU113)","v":"XXXX"},{"$f":"IF('[2]Tasa de Falla'!IV113=0,\"\",'[2]Tasa de Falla'!IV113)","v":"XXXX"},{"$f":"IF('[2]Tasa de Falla'!IW113=0,\"\",'[2]Tasa de Falla'!IW113)","v":"XXXX"},{"$f":"IF('[2]Tasa de Falla'!IX113=0,\"\",'[2]Tasa de Falla'!IX113)","v":"XXXX"},{"$f":"IF('[2]Tasa de Falla'!IY113=0,\"\",'[2]Tasa de Falla'!IY113)","v":"XXXX"},{"$f":"IF('[2]Tasa de Falla'!IZ113=0,\"\",'[2]Tasa de Falla'!IZ113)","v":"XXXX"},{"$f":"IF('[2]Tasa de Falla'!JA113=0,\"\",'[2]Tasa de Falla'!JA113)","v":"XXXX"},{"$f":"IF('[2]Tasa de Falla'!JB113=0,\"\",'[2]Tasa de Falla'!JB113)","v":"XXXX"},{"$f":"IF('[2]Tasa de Falla'!JC113=0,\"\",'[2]Tasa de Falla'!JC113)","v":"XXXX"},{"$f":"IF('[2]Tasa de Falla'!JD113=0,\"\",'[2]Tasa de Falla'!JD113)","v":"XXXX"},{"$f":"IF('[2]Tasa de Falla'!JE113=0,\"\",'[2]Tasa de Falla'!JE113)","v":"XXXX"},{"$f":"IF('[2]Tasa de Falla'!JF113=0,\"\",'[2]Tasa de Falla'!JF113)","v":"XXXX"}]
[null,null,{"$f":"'[2]Tasa de Falla'!C114","v":97},{"$f":"'[2]Tasa de Falla'!D114","v":"SUNCHO CORRAL - QUIMILI"},{"$f":"'[2]Tasa de Falla'!E114","v":132},{"$f":"'[2]Tasa de Falla'!F114","v":108},{"$f":"IF('[2]Tasa de Falla'!IU114=0,\"\",'[2]Tasa de Falla'!IU114)","v":""},{"$f":"IF('[2]Tasa de Falla'!IV114=0,\"\",'[2]Tasa de Falla'!IV114)","v":""},{"$f":"IF('[2]Tasa de Falla'!IW114=0,\"\",'[2]Tasa de Falla'!IW114)","v":""},{"$f":"IF('[2]Tasa de Falla'!IX114=0,\"\",'[2]Tasa de Falla'!IX114)","v":""},{"$f":"IF('[2]Tasa de Falla'!IY114=0,\"\",'[2]Tasa de Falla'!IY114)","v":""},{"$f":"IF('[2]Tasa de Falla'!IZ114=0,\"\",'[2]Tasa de Falla'!IZ114)","v":""},{"$f":"IF('[2]Tasa de Falla'!JA114=0,\"\",'[2]Tasa de Falla'!JA114)","v":""},{"$f":"IF('[2]Tasa de Falla'!JB114=0,\"\",'[2]Tasa de Falla'!JB114)","v":""},{"$f":"IF('[2]Tasa de Falla'!JC114=0,\"\",'[2]Tasa de Falla'!JC114)","v":""},{"$f":"IF('[2]Tasa de Falla'!JD114=0,\"\",'[2]Tasa de Falla'!JD114)","v":""},{"$f":"IF('[2]Tasa de Falla'!JE114=0,\"\",'[2]Tasa de Falla'!JE114)","v":""},{"$f":"IF('[2]Tasa de Falla'!JF114=0,\"\",'[2]Tasa de Falla'!JF114)","v":""}]
[null,null,{"$f":"'[2]Tasa de Falla'!C115","v":98},{"$f":"'[2]Tasa de Falla'!D115","v":"EL BRACHO - LA BANDA ESTE"},{"$f":"'[2]Tasa de Falla'!E115","v":132},{"$f":"'[2]Tasa de Falla'!F115","v":140.9},{"$f":"IF('[2]Tasa de Falla'!IU115=0,\"\",'[2]Tasa de Falla'!IU115)","v":""},{"$f":"IF('[2]Tasa de Falla'!IV115=0,\"\",'[2]Tasa de Falla'!IV115)","v":1},{"$f":"IF('[2]Tasa de Falla'!IW115=0,\"\",'[2]Tasa de Falla'!IW115)","v":""},{"$f":"IF('[2]Tasa de Falla'!IX115=0,\"\",'[2]Tasa de Falla'!IX115)","v":""},{"$f":"IF('[2]Tasa de Falla'!IY115=0,\"\",'[2]Tasa de Falla'!IY115)","v":""},{"$f":"IF('[2]Tasa de Falla'!IZ115=0,\"\",'[2]Tasa de Falla'!IZ115)","v":""},{"$f":"IF('[2]Tasa de Falla'!JA115=0,\"\",'[2]Tasa de Falla'!JA115)","v":""},{"$f":"IF('[2]Tasa de Falla'!JB115=0,\"\",'[2]Tasa de Falla'!JB115)","v":""},{"$f":"IF('[2]Tasa de Falla'!JC115=0,\"\",'[2]Tasa de Falla'!JC115)","v":1},{"$f":"IF('[2]Tasa de Falla'!JD115=0,\"\",'[2]Tasa de Falla'!JD115)","v":""},{"$f":"IF('[2]Tasa de Falla'!JE115=0,\"\",'[2]Tasa de Falla'!JE115)","v":""},{"$f":"IF('[2]Tasa de Falla'!JF115=0,\"\",'[2]Tasa de Falla'!JF115)","v":1}]
[null,null,{"$f":"'[2]Tasa de Falla'!C116","v":99},{"$f":"'[2]Tasa de Falla'!D116","v":"LA BANDA ESTE - LA BANDA"},{"$f":"'[2]Tasa de Falla'!E116","v":132},{"$f":"'[2]Tasa de Falla'!F116","v":16.2},{"$f":"IF('[2]Tasa de Falla'!IU116=0,\"\",'[2]Tasa de Falla'!IU116)","v":""},{"$f":"IF('[2]Tasa de Falla'!IV116=0,\"\",'[2]Tasa de Falla'!IV116)","v":""},{"$f":"IF('[2]Tasa de Falla'!IW116=0,\"\",'[2]Tasa de Falla'!IW116)","v":""},{"$f":"IF('[2]Tasa de Falla'!IX116=0,\"\",'[2]Tasa de Falla'!IX116)","v":""},{"$f":"IF('[2]Tasa de Falla'!IY116=0,\"\",'[2]Tasa de Falla'!IY116)","v":""},{"$f":"IF('[2]Tasa de Falla'!IZ116=0,\"\",'[2]Tasa de Falla'!IZ116)","v":""},{"$f":"IF('[2]Tasa de Falla'!JA116=0,\"\",'[2]Tasa de Falla'!JA116)","v":""},{"$f":"IF('[2]Tasa de Falla'!JB116=0,\"\",'[2]Tasa de Falla'!JB116)","v":""},{"$f":"IF('[2]Tasa de Falla'!JC116=0,\"\",'[2]Tasa de Falla'!JC116)","v":""},{"$f":"IF('[2]Tasa de Falla'!JD116=0,\"\",'[2]Tasa de Falla'!JD116)","v":""},{"$f":"IF('[2]Tasa de Falla'!JE116=0,\"\",'[2]Tasa de Falla'!JE116)","v":""},{"$f":"IF('[2]Tasa de Falla'!JF116=0,\"\",'[2]Tasa de Falla'!JF116)","v":""}]
[null,null,{"$f":"'[2]Tasa de Falla'!C117","v":100},{"$f":"'[2]Tasa de Falla'!D117","v":"TABACAL - PICHANAL"},{"$f":"'[2]Tasa de Falla'!E117","v":132},{"$f":"'[2]Tasa de Falla'!F117","v":9.0399999999999991},{"$f":"IF('[2]Tasa de Falla'!IU117=0,\"\",'[2]Tasa de Falla'!IU117)","v":""},{"$f":"IF('[2]Tasa de Falla'!IV117=0,\"\",'[2]Tasa de Falla'!IV117)","v":""},{"$f":"IF('[2]Tasa de Falla'!IW117=0,\"\",'[2]Tasa de Falla'!IW117)","v":""},{"$f":"IF('[2]Tasa de Falla'!IX117=0,\"\",'[2]Tasa de Falla'!IX117)","v":""},{"$f":"IF('[2]Tasa de Falla'!IY117=0,\"\",'[2]Tasa de Falla'!IY117)","v":""},{"$f":"IF('[2]Tasa de Falla'!IZ117=0,\"\",'[2]Tasa de Falla'!IZ117)","v":""},{"$f":"IF('[2]Tasa de Falla'!JA117=0,\"\",'[2]Tasa de Falla'!JA117)","v":""},{"$f":"IF('[2]Tasa de Falla'!JB117=0,\"\",'[2]Tasa de Falla'!JB117)","v":""},{"$f":"IF('[2]Tasa de Falla'!JC117=0,\"\",'[2]Tasa de Falla'!JC117)","v":""},{"$f":"IF('[2]Tasa de Falla'!JD117=0,\"\",'[2]Tasa de Falla'!JD117)","v":""},{"$f":"IF('[2]Tasa de Falla'!JE117=0,\"\",'[2]Tasa de Falla'!JE117)","v":1},{"$f":"IF('[2]Tasa de Falla'!JF117=0,\"\",'[2]Tasa de Falla'!JF117)","v":""}]
[null,null,{"$f":"'[2]Tasa de Falla'!C118","v":101},{"$f":"'[2]Tasa de Falla'!D118","v":"ORAN - TABACAL"},{"$f":"'[2]Tasa de Falla'!E118","v":132},{"$f":"'[2]Tasa de Falla'!F118","v":10},{"$f":"IF('[2]Tasa de Falla'!IU118=0,\"\",'[2]Tasa de Falla'!IU118)","v":""},{"$f":"IF('[2]Tasa de Falla'!IV118=0,\"\",'[2]Tasa de Falla'!IV118)","v":""},{"$f":"IF('[2]Tasa de Falla'!IW118=0,\"\",'[2]Tasa de Falla'!IW118)","v":""},{"$f":"IF('[2]Tasa de Falla'!IX118=0,\"\",'[2]Tasa de Falla'!IX118)","v":""},{"$f":"IF('[2]Tasa de Falla'!IY118=0,\"\",'[2]Tasa de Falla'!IY118)","v":1},{"$f":"IF('[2]Tasa de Falla'!IZ118=0,\"\",'[2]Tasa de Falla'!IZ118)","v":""},{"$f":"IF('[2]Tasa de Falla'!JA118=0,\"\",'[2]Tasa de Falla'!JA118)","v":""},{"$f":"IF('[2]Tasa de Falla'!JB118=0,\"\",'[2]Tasa de Falla'!JB118)","v":""},{"$f":"IF('[2]Tasa de Falla'!JC118=0,\"\",'[2]Tasa de Falla'!JC118)","v":""},{"$f":"IF('[2]Tasa de Falla'!JD118=0,\"\",'[2]Tasa de Falla'!JD118)","v":"XXXX"},{"$f":"IF('[2]Tasa de Falla'!JE118=0,\"\",'[2]Tasa de Falla'!JE118)","v":"XXXX"},{"$f":"IF('[2]Tasa de Falla'!JF118=0,\"\",'[2]Tasa de Falla'!JF118)","v":"XXXX"}]
[null,null,{"$f":"'[2]Tasa de Falla'!C119","v":102},{"$f":"'[2]Tasa de Falla'!D119","v":"MONTE QUEMADO -COPO - QUIMILI"},{"$f":"'[2]Tasa de Falla'!E119","v":132},{"$f":"'[2]Tasa de Falla'!F119","v":218},{"$f":"IF('[2]Tasa de Falla'!IU119=0,\"\",'[2]Tasa de Falla'!IU119)","v":""},{"$f":"IF('[2]Tasa de Falla'!IV119=0,\"\",'[2]Tasa de Falla'!IV119)","v":""},{"$f":"IF('[2]Tasa de Falla'!IW119=0,\"\",'[2]Tasa de Falla'!IW119)","v":""},{"$f":"IF('[2]Tasa de Falla'!IX119=0,\"\",'[2]Tasa de Falla'!IX119)","v":""},{"$f":"IF('[2]Tasa de Falla'!IY119=0,\"\",'[2]Tasa de Falla'!IY119)","v":""},{"$f":"IF('[2]Tasa de Falla'!IZ119=0,\"\",'[2]Tasa de Falla'!IZ119)","v":""},{"$f":"IF('[2]Tasa de Falla'!JA119=0,\"\",'[2]Tasa de Falla'!JA119)","v":""},{"$f":"IF('[2]Tasa de Falla'!JB119=0,\"\",'[2]Tasa de Falla'!JB119)","v":""},{"$f":"IF('[2]Tasa de Falla'!JC119=0,\"\",'[2]Tasa de Falla'!JC119)","v":""},{"$f":"IF('[2]Tasa de Falla'!JD119=0,\"\",'[2]Tasa de Falla'!JD119)","v":""},{"$f":"IF('[2]Tasa de Falla'!JE119=0,\"\",'[2]Tasa de Falla'!JE119)","v":""},{"$f":"IF('[2]Tasa de Falla'!JF119=0,\"\",'[2]Tasa de Falla'!JF119)","v":""}]
[null,null,{"$f":"'[2]Tasa de Falla'!C120","v":103},{"$f":"'[2]Tasa de Falla'!D120","v":"PI. CIRCUNVALACIÓN - LARIOJA N. 1"},{"$f":"'[2]Tasa de Falla'!E120","v":132},{"$f":"'[2]Tasa de Falla'!F120","v":16.649999999999999},{"$f":"IF('[2]Tasa de Falla'!IU120=0,\"\",'[2]Tasa de Falla'!IU120)","v":""},{"$f":"IF('[2]Tasa de Falla'!IV120=0,\"\",'[2]Tasa de Falla'!IV120)","v":""},{"$f":"IF('[2]Tasa de Falla'!IW120=0,\"\",'[2]Tasa de Falla'!IW120)","v":""},{"$f":"IF('[2]Tasa de Falla'!IX120=0,\"\",'[2]Tasa de Falla'!IX120)","v":""},{"$f":"IF('[2]Tasa de Falla'!IY120=0,\"\",'[2]Tasa de Falla'!IY120)","v":""},{"$f":"IF('[2]Tasa de Falla'!IZ120=0,\"\",'[2]Tasa de Falla'!IZ120)","v":""},{"$f":"IF('[2]Tasa de Falla'!JA120=0,\"\",'[2]Tasa de Falla'!JA120)","v":""},{"$f":"IF('[2]Tasa de Falla'!JB120=0,\"\",'[2]Tasa de Falla'!JB120)","v":""},{"$f":"IF('[2]Tasa de Falla'!JC120=0,\"\",'[2]Tasa de Falla'!JC120)","v":""},{"$f":"IF('[2]Tasa de Falla'!JD120=0,\"\",'[2]Tasa de Falla'!JD120)","v":""},{"$f":"IF('[2]Tasa de Falla'!JE120=0,\"\",'[2]Tasa de Falla'!JE120)","v":""},{"$f":"IF('[2]Tasa de Falla'!JF120=0,\"\",'[2]Tasa de Falla'!JF120)","v":1}]
[null,null,{"$f":"'[2]Tasa de Falla'!C121","v":104},{"$f":"'[2]Tasa de Falla'!D121","v":"PATQUIA NONOGASTA 132 1"},{"$f":"'[2]Tasa de Falla'!E121","v":132},{"$f":"'[2]Tasa de Falla'!F121","v":108.3},{"$f":"IF('[2]Tasa de Falla'!IU121=0,\"\",'[2]Tasa de Falla'!IU121)","v":""},{"$f":"IF('[2]Tasa de Falla'!IV121=0,\"\",'[2]Tasa de Falla'!IV121)","v":""},{"$f":"IF('[2]Tasa de Falla'!IW121=0,\"\",'[2]Tasa de Falla'!IW121)","v":""},{"$f":"IF('[2]Tasa de Falla'!IX121=0,\"\",'[2]Tasa de Falla'!IX121)","v":""},{"$f":"IF('[2]Tasa de Falla'!IY121=0,\"\",'[2]Tasa de Falla'!IY121)","v":""},{"$f":"IF('[2]Tasa de Falla'!IZ121=0,\"\",'[2]Tasa de Falla'!IZ121)","v":""},{"$f":"IF('[2]Tasa de Falla'!JA121=0,\"\",'[2]Tasa de Falla'!JA121)","v":""},{"$f":"IF('[2]Tasa de Falla'!JB121=0,\"\",'[2]Tasa de Falla'!JB121)","v":""},{"$f":"IF('[2]Tasa de Falla'!JC121=0,\"\",'[2]Tasa de Falla'!JC121)","v":""},{"$f":"IF('[2]Tasa de Falla'!JD121=0,\"\",'[2]Tasa de Falla'!JD121)","v":""},{"$f":"IF('[2]Tasa de Falla'!JE121=0,\"\",'[2]Tasa de Falla'!JE121)","v":""},{"$f":"IF('[2]Tasa de Falla'!JF121=0,\"\",'[2]Tasa de Falla'!JF121)","v":""}]
[null,null,{"$f":"'[2]Tasa de Falla'!C122","v":105},{"$f":"'[2]Tasa de Falla'!D122","v":"NONOGASTA - VILLA UNION 132 1"},{"$f":"'[2]Tasa de Falla'!E122","v":132},{"$f":"'[2]Tasa de Falla'!F122","v":82.1},{"$f":"IF('[2]Tasa de Falla'!IU122=0,\"\",'[2]Tasa de Falla'!IU122)","v":""},{"$f":"IF('[2]Tasa de Falla'!IV122=0,\"\",'[2]Tasa de Falla'!IV122)","v":""},{"$f":"IF('[2]Tasa de Falla'!IW122=0,\"\",'[2]Tasa de Falla'!IW122)","v":""},{"$f":"IF('[2]Tasa de Falla'!IX122=0,\"\",'[2]Tasa de Falla'!IX122)","v":""},{"$f":"IF('[2]Tasa de Falla'!IY122=0,\"\",'[2]Tasa de Falla'!IY122)","v":""},{"$f":"IF('[2]Tasa de Falla'!IZ122=0,\"\",'[2]Tasa de Falla'!IZ122)","v":""},{"$f":"IF('[2]Tasa de Falla'!JA122=0,\"\",'[2]Tasa de Falla'!JA122)","v":""},{"$f":"IF('[2]Tasa de Falla'!JB122=0,\"\",'[2]Tasa de Falla'!JB122)","v":""},{"$f":"IF('[2]Tasa de Falla'!JC122=0,\"\",'[2]Tasa de Falla'!JC122)","v":""},{"$f":"IF('[2]Tasa de Falla'!JD122=0,\"\",'[2]Tasa de Falla'!JD122)","v":""},{"$f":"IF('[2]Tasa de Falla'!JE122=0,\"\",'[2]Tasa de Falla'!JE122)","v":""},{"$f":"IF('[2]Tasa de Falla'!JF122=0,\"\",'[2]Tasa de Falla'!JF122)","v":""}]
[null,null,{"$f":"'[2]Tasa de Falla'!C123","v":106},{"$f":"'[2]Tasa de Falla'!D123","v":"ARAUCO - AIMOGASTA 132 1"},{"$f":"'[2]Tasa de Falla'!E123","v":132},{"$f":"'[2]Tasa de Falla'!F123","v":20},{"$f":"IF('[2]Tasa de Falla'!IU123=0,\"\",'[2]Tasa de Falla'!IU123)","v":""},{"$f":"IF('[2]Tasa de Falla'!IV123=0,\"\",'[2]Tasa de Falla'!IV123)","v":""},{"$f":"IF('[2]Tasa de Falla'!IW123=0,\"\",'[2]Tasa de Falla'!IW123)","v":""},{"$f":"IF('[2]Tasa de Falla'!IX123=0,\"\",'[2]Tasa de Falla'!IX123)","v":""},{"$f":"IF('[2]Tasa de Falla'!IY123=0,\"\",'[2]Tasa de Falla'!IY123)","v":""},{"$f":"IF('[2]Tasa de Falla'!IZ123=0,\"\",'[2]Tasa de Falla'!IZ123)","v":""},{"$f":"IF('[2]Tasa de Falla'!JA123=0,\"\",'[2]Tasa de Falla'!JA123)","v":""},{"$f":"IF('[2]Tasa de Falla'!JB123=0,\"\",'[2]Tasa de Falla'!JB123)","v":""},{"$f":"IF('[2]Tasa de Falla'!JC123=0,\"\",'[2]Tasa de Falla'!JC123)","v":""},{"$f":"IF('[2]Tasa de Falla'!JD123=0,\"\",'[2]Tasa de Falla'!JD123)","v":""},{"$f":"IF('[2]Tasa de Falla'!JE123=0,\"\",'[2]Tasa de Falla'!JE123)","v":""},{"$f":"IF('[2]Tasa de Falla'!JF123=0,\"\",'[2]Tasa de Falla'!JF123)","v":""}]
[null,null,{"$f":"'[2]Tasa de Falla'!C124","v":107},{"$f":"'[2]Tasa de Falla'!D124","v":"PATQUIA - CHAMICAL 132 1"},{"$f":"'[2]Tasa de Falla'!E124","v":132},{"$f":"'[2]Tasa de Falla'!F124","v":67.400000000000006},{"$f":"IF('[2]Tasa de Falla'!IU124=0,\"\",'[2]Tasa de Falla'!IU124)","v":""},{"$f":"IF('[2]Tasa de Falla'!IV124=0,\"\",'[2]Tasa de Falla'!IV124)","v":""},{"$f":"IF('[2]Tasa de Falla'!IW124=0,\"\",'[2]Tasa de Falla'!IW124)","v":""},{"$f":"IF('[2]Tasa de Falla'!IX124=0,\"\",'[2]Tasa de Falla'!IX124)","v":""},{"$f":"IF('[2]Tasa de Falla'!IY124=0,\"\",'[2]Tasa de Falla'!IY124)","v":""},{"$f":"IF('[2]Tasa de Falla'!IZ124=0,\"\",'[2]Tasa de Falla'!IZ124)","v":""},{"$f":"IF('[2]Tasa de Falla'!JA124=0,\"\",'[2]Tasa de Falla'!JA124)","v":""},{"$f":"IF('[2]Tasa de Falla'!JB124=0,\"\",'[2]Tasa de Falla'!JB124)","v":""},{"$f":"IF('[2]Tasa de Falla'!JC124=0,\"\",'[2]Tasa de Falla'!JC124)","v":""},{"$f":"IF('[2]Tasa de Falla'!JD124=0,\"\",'[2]Tasa de Falla'!JD124)","v":""},{"$f":"IF('[2]Tasa de Falla'!JE124=0,\"\",'[2]Tasa de Falla'!JE124)","v":2},{"$f":"IF('[2]Tasa de Falla'!JF124=0,\"\",'[2]Tasa de Falla'!JF124)","v":""}]
[null,null,{"$f":"'[2]Tasa de Falla'!C125","v":108},{"$f":"'[2]Tasa de Falla'!D125","v":"LA RIOJA - ARAUCO 132 1"},{"$f":"'[2]Tasa de Falla'!E125","v":132},{"$f":"'[2]Tasa de Falla'!F125","v":84.3},{"$f":"IF('[2]Tasa de Falla'!IU125=0,\"\",'[2]Tasa de Falla'!IU125)","v":""},{"$f":"IF('[2]Tasa de Falla'!IV125=0,\"\",'[2]Tasa de Falla'!IV125)","v":""},{"$f":"IF('[2]Tasa de Falla'!IW125=0,\"\",'[2]Tasa de Falla'!IW125)","v":1},{"$f":"IF('[2]Tasa de Falla'!IX125=0,\"\",'[2]Tasa de Falla'!IX125)","v":""},{"$f":"IF('[2]Tasa de Falla'!IY125=0,\"\",'[2]Tasa de Falla'!IY125)","v":""},{"$f":"IF('[2]Tasa de Falla'!IZ125=0,\"\",'[2]Tasa de Falla'!IZ125)","v":""},{"$f":"IF('[2]Tasa de Falla'!JA125=0,\"\",'[2]Tasa de Falla'!JA125)","v":""},{"$f":"IF('[2]Tasa de Falla'!JB125=0,\"\",'[2]Tasa de Falla'!JB125)","v":""},{"$f":"IF('[2]Tasa de Falla'!JC125=0,\"\",'[2]Tasa de Falla'!JC125)","v":""},{"$f":"IF('[2]Tasa de Falla'!JD125=0,\"\",'[2]Tasa de Falla'!JD125)","v":1},{"$f":"IF('[2]Tasa de Falla'!JE125=0,\"\",'[2]Tasa de Falla'!JE125)","v":5},{"$f":"IF('[2]Tasa de Falla'!JF125=0,\"\",'[2]Tasa de Falla'!JF125)","v":1}]
[null,null,{"$f":"'[2]Tasa de Falla'!C126","v":109},{"$f":"'[2]Tasa de Falla'!D126","v":"PI PATQUIA - PATQUIA 132 1"},{"$f":"'[2]Tasa de Falla'!E126","v":132},{"$f":"'[2]Tasa de Falla'!F126","v":58.65},{"$f":"IF('[2]Tasa de Falla'!IU126=0,\"\",'[2]Tasa de Falla'!IU126)","v":""},{"$f":"IF('[2]Tasa de Falla'!IV126=0,\"\",'[2]Tasa de Falla'!IV126)","v":""},{"$f":"IF('[2]Tasa de Falla'!IW126=0,\"\",'[2]Tasa de Falla'!IW126)","v":""},{"$f":"IF('[2]Tasa de Falla'!IX126=0,\"\",'[2]Tasa de Falla'!IX126)","v":""},{"$f":"IF('[2]Tasa de Falla'!IY126=0,\"\",'[2]Tasa de Falla'!IY126)","v":""},{"$f":"IF('[2]Tasa de Falla'!IZ126=0,\"\",'[2]Tasa de Falla'!IZ126)","v":""},{"$f":"IF('[2]Tasa de Falla'!JA126=0,\"\",'[2]Tasa de Falla'!JA126)","v":""},{"$f":"IF('[2]Tasa de Falla'!JB126=0,\"\",'[2]Tasa de Falla'!JB126)","v":""},{"$f":"IF('[2]Tasa de Falla'!JC126=0,\"\",'[2]Tasa de Falla'!JC126)","v":""},{"$f":"IF('[2]Tasa de Falla'!JD126=0,\"\",'[2]Tasa de Falla'!JD126)","v":""},{"$f":"IF('[2]Tasa de Falla'!JE126=0,\"\",'[2]Tasa de Falla'!JE126)","v":""},{"$f":"IF('[2]Tasa de Falla'!JF126=0,\"\",'[2]Tasa de Falla'!JF126)","v":""}]
[null,null,{"$f":"'[2]Tasa de Falla'!C127","v":110},{"$f":"'[2]Tasa de Falla'!D127","v":"RIO HONDO - TERMAS NORTE"},{"$f":"'[2]Tasa de Falla'!E127","v":132},{"$f":"'[2]Tasa de Falla'!F127","v":5.8},{"$f":"IF('[2]Tasa de Falla'!IU127=0,\"\",'[2]Tasa de Falla'!IU127)","v":""},{"$f":"IF('[2]Tasa de Falla'!IV127=0,\"\",'[2]Tasa de Falla'!IV127)","v":""},{"$f":"IF('[2]Tasa de Falla'!IW127=0,\"\",'[2]Tasa de Falla'!IW127)","v":""},{"$f":"IF('[2]Tasa de Falla'!IX127=0,\"\",'[2]Tasa de Falla'!IX127)","v":""},{"$f":"IF('[2]Tasa de Falla'!IY127=0,\"\",'[2]Tasa de Falla'!IY127)","v":""},{"$f":"IF('[2]Tasa de Falla'!IZ127=0,\"\",'[2]Tasa de Falla'!IZ127)","v":""},{"$f":"IF('[2]Tasa de Falla'!JA127=0,\"\",'[2]Tasa de Falla'!JA127)","v":""},{"$f":"IF('[2]Tasa de Falla'!JB127=0,\"\",'[2]Tasa de Falla'!JB127)","v":""},{"$f":"IF('[2]Tasa de Falla'!JC127=0,\"\",'[2]Tasa de Falla'!JC127)","v":""},{"$f":"IF('[2]Tasa de Falla'!JD127=0,\"\",'[2]Tasa de Falla'!JD127)","v":""},{"$f":"IF('[2]Tasa de Falla'!JE127=0,\"\",'[2]Tasa de Falla'!JE127)","v":""},{"$f":"IF('[2]Tasa de Falla'!JF127=0,\"\",'[2]Tasa de Falla'!JF127)","v":""}]
[null,null,{"$f":"'[2]Tasa de Falla'!C128","v":111},{"$f":"'[2]Tasa de Falla'!D128","v":"EL BRACHO - TETRMAS NORTE"},{"$f":"'[2]Tasa de Falla'!E128","v":132},{"$f":"'[2]Tasa de Falla'!F128","v":78.400000000000006},{"$f":"IF('[2]Tasa de Falla'!IU128=0,\"\",'[2]Tasa de Falla'!IU128)","v":""},{"$f":"IF('[2]Tasa de Falla'!IV128=0,\"\",'[2]Tasa de Falla'!IV128)","v":""},{"$f":"IF('[2]Tasa de Falla'!IW128=0,\"\",'[2]Tasa de Falla'!IW128)","v":""},{"$f":"IF('[2]Tasa de Falla'!IX128=0,\"\",'[2]Tasa de Falla'!IX128)","v":""},{"$f":"IF('[2]Tasa de Falla'!IY128=0,\"\",'[2]Tasa de Falla'!IY128)","v":""},{"$f":"IF('[2]Tasa de Falla'!IZ128=0,\"\",'[2]Tasa de Falla'!IZ128)","v":1},{"$f":"IF('[2]Tasa de Falla'!JA128=0,\"\",'[2]Tasa de Falla'!JA128)","v":1},{"$f":"IF('[2]Tasa de Falla'!JB128=0,\"\",'[2]Tasa de Falla'!JB128)","v":""},{"$f":"IF('[2]Tasa de Falla'!JC128=0,\"\",'[2]Tasa de Falla'!JC128)","v":""},{"$f":"IF('[2]Tasa de Falla'!JD128=0,\"\",'[2]Tasa de Falla'!JD128)","v":""},{"$f":"IF('[2]Tasa de Falla'!JE128=0,\"\",'[2]Tasa de Falla'!JE128)","v":""},{"$f":"IF('[2]Tasa de Falla'!JF128=0,\"\",'[2]Tasa de Falla'!JF128)","v":""}]
[null,null,{"$f":"'[2]Tasa de Falla'!C129","v":112},{"$f":"'[2]Tasa de Falla'!D129","v":"PI 150 NORTE - LA RIOJA ESTE"},{"$f":"'[2]Tasa de Falla'!E129","v":132},{"$f":"'[2]Tasa de Falla'!F129","v":4},{"$f":"IF('[2]Tasa de Falla'!IU129=0,\"\",'[2]Tasa de Falla'!IU129)","v":""},{"$f":"IF('[2]Tasa de Falla'!IV129=0,\"\",'[2]Tasa de Falla'!IV129)","v":""},{"$f":"IF('[2]Tasa de Falla'!IW129=0,\"\",'[2]Tasa de Falla'!IW129)","v":""},{"$f":"IF('[2]Tasa de Falla'!IX129=0,\"\",'[2]Tasa de Falla'!IX129)","v":""},{"$f":"IF('[2]Tasa de Falla'!IY129=0,\"\",'[2]Tasa de Falla'!IY129)","v":""},{"$f":"IF('[2]Tasa de Falla'!IZ129=0,\"\",'[2]Tasa de Falla'!IZ129)","v":""},{"$f":"IF('[2]Tasa de Falla'!JA129=0,\"\",'[2]Tasa de Falla'!JA129)","v":""},{"$f":"IF('[2]Tasa de Falla'!JB129=0,\"\",'[2]Tasa de Falla'!JB129)","v":""},{"$f":"IF('[2]Tasa de Falla'!JC129=0,\"\",'[2]Tasa de Falla'!JC129)","v":""},{"$f":"IF('[2]Tasa de Falla'!JD129=0,\"\",'[2]Tasa de Falla'!JD129)","v":""},{"$f":"IF('[2]Tasa de Falla'!JE129=0,\"\",'[2]Tasa de Falla'!JE129)","v":""},{"$f":"IF('[2]Tasa de Falla'!JF129=0,\"\",'[2]Tasa de Falla'!JF129)","v":""}]
[null,null,{"$f":"'[2]Tasa de Falla'!C130","v":113},{"$f":"'[2]Tasa de Falla'!D130","v":"PI 150 SUR - LA RIOJA ESTE"},{"$f":"'[2]Tasa de Falla'!E130","v":132},{"$f":"'[2]Tasa de Falla'!F130","v":4},{"$f":"IF('[2]Tasa de Falla'!IU130=0,\"\",'[2]Tasa de Falla'!IU130)","v":""},{"$f":"IF('[2]Tasa de Falla'!IV130=0,\"\",'[2]Tasa de Falla'!IV130)","v":""},{"$f":"IF('[2]Tasa de Falla'!IW130=0,\"\",'[2]Tasa de Falla'!IW130)","v":""},{"$f":"IF('[2]Tasa de Falla'!IX130=0,\"\",'[2]Tasa de Falla'!IX130)","v":""},{"$f":"IF('[2]Tasa de Falla'!IY130=0,\"\",'[2]Tasa de Falla'!IY130)","v":""},{"$f":"IF('[2]Tasa de Falla'!IZ130=0,\"\",'[2]Tasa de Falla'!IZ130)","v":""},{"$f":"IF('[2]Tasa de Falla'!JA130=0,\"\",'[2]Tasa de Falla'!JA130)","v":""},{"$f":"IF('[2]Tasa de Falla'!JB130=0,\"\",'[2]Tasa de Falla'!JB130)","v":""},{"$f":"IF('[2]Tasa de Falla'!JC130=0,\"\",'[2]Tasa de Falla'!JC130)","v":""},{"$f":"IF('[2]Tasa de Falla'!JD130=0,\"\",'[2]Tasa de Falla'!JD130)","v":""},{"$f":"IF('[2]Tasa de Falla'!JE130=0,\"\",'[2]Tasa de Falla'!JE130)","v":""},{"$f":"IF('[2]Tasa de Falla'!JF130=0,\"\",'[2]Tasa de Falla'!JF130)","v":""}]
[null,null,{"$f":"'[2]Tasa de Falla'!C131","v":114},{"$f":"'[2]Tasa de Falla'!D131","v":"QUIMILI - CAMPO GALLO 132 1"},{"$f":"'[2]Tasa de Falla'!E131","v":132},{"$f":"'[2]Tasa de Falla'!F131","v":140},{"$f":"IF('[2]Tasa de Falla'!IU131=0,\"\",'[2]Tasa de Falla'!IU131)","v":""},{"$f":"IF('[2]Tasa de Falla'!IV131=0,\"\",'[2]Tasa de Falla'!IV131)","v":""},{"$f":"IF('[2]Tasa de Falla'!IW131=0,\"\",'[2]Tasa de Falla'!IW131)","v":""},{"$f":"IF('[2]Tasa de Falla'!IX131=0,\"\",'[2]Tasa de Falla'!IX131)","v":""},{"$f":"IF('[2]Tasa de Falla'!IY131=0,\"\",'[2]Tasa de Falla'!IY131)","v":""},{"$f":"IF('[2]Tasa de Falla'!IZ131=0,\"\",'[2]Tasa de Falla'!IZ131)","v":""},{"$f":"IF('[2]Tasa de Falla'!JA131=0,\"\",'[2]Tasa de Falla'!JA131)","v":""},{"$f":"IF('[2]Tasa de Falla'!JB131=0,\"\",'[2]Tasa de Falla'!JB131)","v":""},{"$f":"IF('[2]Tasa de Falla'!JC131=0,\"\",'[2]Tasa de Falla'!JC131)","v":""},{"$f":"IF('[2]Tasa de Falla'!JD131=0,\"\",'[2]Tasa de Falla'!JD131)","v":""},{"$f":"IF('[2]Tasa de Falla'!JE131=0,\"\",'[2]Tasa de Falla'!JE131)","v":""},{"$f":"IF('[2]Tasa de Falla'!JF131=0,\"\",'[2]Tasa de Falla'!JF131)","v":1}]
[null,null,{"$f":"'[2]Tasa de Falla'!C132","v":115},{"$f":"'[2]Tasa de Falla'!D132","v":"CAMPO GALLO - COPO 132 1"},{"$f":"'[2]Tasa de Falla'!E132","v":132},{"$f":"'[2]Tasa de Falla'!F132","v":90},{"$f":"IF('[2]Tasa de Falla'!IU132=0,\"\",'[2]Tasa de Falla'!IU132)","v":""},{"$f":"IF('[2]Tasa de Falla'!IV132=0,\"\",'[2]Tasa de Falla'!IV132)","v":""},{"$f":"IF('[2]Tasa de Falla'!IW132=0,\"\",'[2]Tasa de Falla'!IW132)","v":""},{"$f":"IF('[2]Tasa de Falla'!IX132=0,\"\",'[2]Tasa de Falla'!IX132)","v":""},{"$f":"IF('[2]Tasa de Falla'!IY132=0,\"\",'[2]Tasa de Falla'!IY132)","v":""},{"$f":"IF('[2]Tasa de Falla'!IZ132=0,\"\",'[2]Tasa de Falla'!IZ132)","v":""},{"$f":"IF('[2]Tasa de Falla'!JA132=0,\"\",'[2]Tasa de Falla'!JA132)","v":""},{"$f":"IF('[2]Tasa de Falla'!JB132=0,\"\",'[2]Tasa de Falla'!JB132)","v":""},{"$f":"IF('[2]Tasa de Falla'!JC132=0,\"\",'[2]Tasa de Falla'!JC132)","v":""},{"$f":"IF('[2]Tasa de Falla'!JD132=0,\"\",'[2]Tasa de Falla'!JD132)","v":""},{"$f":"IF('[2]Tasa de Falla'!JE132=0,\"\",'[2]Tasa de Falla'!JE132)","v":""},{"$f":"IF('[2]Tasa de Falla'!JF132=0,\"\",'[2]Tasa de Falla'!JF132)","v":""}]
[null,null,{"$f":"'[2]Tasa de Falla'!C133","v":116},{"$f":"'[2]Tasa de Falla'!D133","v":"PICHANAL - SENDA HACHADA 132 1"},{"$f":"'[2]Tasa de Falla'!E133","v":132},{"$f":"'[2]Tasa de Falla'!F133","v":46.5},{"$f":"IF('[2]Tasa de Falla'!IU133=0,\"\",'[2]Tasa de Falla'!IU133)","v":"XXXX"},{"$f":"IF('[2]Tasa de Falla'!IV133=0,\"\",'[2]Tasa de Falla'!IV133)","v":""},{"$f":"IF('[2]Tasa de Falla'!IW133=0,\"\",'[2]Tasa de Falla'!IW133)","v":""},{"$f":"IF('[2]Tasa de Falla'!IX133=0,\"\",'[2]Tasa de Falla'!IX133)","v":""},{"$f":"IF('[2]Tasa de Falla'!IY133=0,\"\",'[2]Tasa de Falla'!IY133)","v":""},{"$f":"IF('[2]Tasa de Falla'!IZ133=0,\"\",'[2]Tasa de Falla'!IZ133)","v":""},{"$f":"IF('[2]Tasa de Falla'!JA133=0,\"\",'[2]Tasa de Falla'!JA133)","v":""},{"$f":"IF('[2]Tasa de Falla'!JB133=0,\"\",'[2]Tasa de Falla'!JB133)","v":""},{"$f":"IF('[2]Tasa de Falla'!JC133=0,\"\",'[2]Tasa de Falla'!JC133)","v":""},{"$f":"IF('[2]Tasa de Falla'!JD133=0,\"\",'[2]Tasa de Falla'!JD133)","v":""},{"$f":"IF('[2]Tasa de Falla'!JE133=0,\"\",'[2]Tasa de Falla'!JE133)","v":""},{"$f":"IF('[2]Tasa de Falla'!JF133=0,\"\",'[2]Tasa de Falla'!JF133)","v":""}]
[null,null,{"$f":"'[2]Tasa de Falla'!C134","v":117},{"$f":"'[2]Tasa de Falla'!D134","v":"SENDA HACHADA - TARTAGAL 132 1"},{"$f":"'[2]Tasa de Falla'!E134","v":132},{"$f":"'[2]Tasa de Falla'!F134","v":58.5},{"$f":"IF('[2]Tasa de Falla'!IU134=0,\"\",'[2]Tasa de Falla'!IU134)","v":"XXXX"},{"$f":"IF('[2]Tasa de Falla'!IV134=0,\"\",'[2]Tasa de Falla'!IV134)","v":""},{"$f":"IF('[2]Tasa de Falla'!IW134=0,\"\",'[2]Tasa de Falla'!IW134)","v":""},{"$f":"IF('[2]Tasa de Falla'!IX134=0,\"\",'[2]Tasa de Falla'!IX134)","v":""},{"$f":"IF('[2]Tasa de Falla'!IY134=0,\"\",'[2]Tasa de Falla'!IY134)","v":""},{"$f":"IF('[2]Tasa de Falla'!IZ134=0,\"\",'[2]Tasa de Falla'!IZ134)","v":""},{"$f":"IF('[2]Tasa de Falla'!JA134=0,\"\",'[2]Tasa de Falla'!JA134)","v":""},{"$f":"IF('[2]Tasa de Falla'!JB134=0,\"\",'[2]Tasa de Falla'!JB134)","v":""},{"$f":"IF('[2]Tasa de Falla'!JC134=0,\"\",'[2]Tasa de Falla'!JC134)","v":""},{"$f":"IF('[2]Tasa de Falla'!JD134=0,\"\",'[2]Tasa de Falla'!JD134)","v":""},{"$f":"IF('[2]Tasa de Falla'!JE134=0,\"\",'[2]Tasa de Falla'!JE134)","v":""},{"$f":"IF('[2]Tasa de Falla'!JF134=0,\"\",'[2]Tasa de Falla'!JF134)","v":""}]
[null,null,{"$f":"'[2]Tasa de Falla'!C135","v":118},{"$f":"'[2]Tasa de Falla'!D135","v":"ESTATICA - INDEPENDENCIA.TUC. 132 2"},{"$f":"'[2]Tasa de Falla'!E135","v":132},{"$f":"'[2]Tasa de Falla'!F135","v":3.1},{"$f":"IF('[2]Tasa de Falla'!IU135=0,\"\",'[2]Tasa de Falla'!IU135)","v":"XXXX"},{"$f":"IF('[2]Tasa de Falla'!IV135=0,\"\",'[2]Tasa de Falla'!IV135)","v":"XXXX"},{"$f":"IF('[2]Tasa de Falla'!IW135=0,\"\",'[2]Tasa de Falla'!IW135)","v":"XXXX"},{"$f":"IF('[2]Tasa de Falla'!IX135=0,\"\",'[2]Tasa de Falla'!IX135)","v":""},{"$f":"IF('[2]Tasa de Falla'!IY135=0,\"\",'[2]Tasa de Falla'!IY135)","v":""},{"$f":"IF('[2]Tasa de Falla'!IZ135=0,\"\",'[2]Tasa de Falla'!IZ135)","v":1},{"$f":"IF('[2]Tasa de Falla'!JA135=0,\"\",'[2]Tasa de Falla'!JA135)","v":""},{"$f":"IF('[2]Tasa de Falla'!JB135=0,\"\",'[2]Tasa de Falla'!JB135)","v":""},{"$f":"IF('[2]Tasa de Falla'!JC135=0,\"\",'[2]Tasa de Falla'!JC135)","v":""},{"$f":"IF('[2]Tasa de Falla'!JD135=0,\"\",'[2]Tasa de Falla'!JD135)","v":""},{"$f":"IF('[2]Tasa de Falla'!JE135=0,\"\",'[2]Tasa de Falla'!JE135)","v":""},{"$f":"IF('[2]Tasa de Falla'!JF135=0,\"\",'[2]Tasa de Falla'!JF135)","v":""}]
[null,null,{"$f":"'[2]Tasa de Falla'!C136","v":119},{"$f":"'[2]Tasa de Falla'!D136","v":"SENDA HACHADA - DRAGONES 132 1"},{"$f":"'[2]Tasa de Falla'!E136","v":132},{"$f":"'[2]Tasa de Falla'!F136","v":65},{"$f":"IF('[2]Tasa de Falla'!IU136=0,\"\",'[2]Tasa de Falla'!IU136)","v":"XXXX"},{"$f":"IF('[2]Tasa de Falla'!IV136=0,\"\",'[2]Tasa de Falla'!IV136)","v":"XXXX"},{"$f":"IF('[2]Tasa de Falla'!IW136=0,\"\",'[2]Tasa de Falla'!IW136)","v":"XXXX"},{"$f":"IF('[2]Tasa de Falla'!IX136=0,\"\",'[2]Tasa de Falla'!IX136)","v":"XXXX"},{"$f":"IF('[2]Tasa de Falla'!IY136=0,\"\",'[2]Tasa de Falla'!IY136)","v":"XXXX"},{"$f":"IF('[2]Tasa de Falla'!IZ136=0,\"\",'[2]Tasa de Falla'!IZ136)","v":"XXXX"},{"$f":"IF('[2]Tasa de Falla'!JA136=0,\"\",'[2]Tasa de Falla'!JA136)","v":"XXXX"},{"$f":"IF('[2]Tasa de Falla'!JB136=0,\"\",'[2]Tasa de Falla'!JB136)","v":"XXXX"},{"$f":"IF('[2]Tasa de Falla'!JC136=0,\"\",'[2]Tasa de Falla'!JC136)","v":"XXXX"},{"$f":"IF('[2]Tasa de Falla'!JD136=0,\"\",'[2]Tasa de Falla'!JD136)","v":"XXXX"},{"$f":"IF('[2]Tasa de Falla'!JE136=0,\"\",'[2]Tasa de Falla'!JE136)","v":"XXXX"},{"$f":"IF('[2]Tasa de Falla'!JF136=0,\"\",'[2]Tasa de Falla'!JF136)","v":"XXXX"}]
[null,null,{"$f":"'[2]Tasa de Falla'!C137","v":120},{"$f":"'[2]Tasa de Falla'!D137","v":"COBOS - SALTA ESTE 132 1"},{"$f":"'[2]Tasa de Falla'!E137","v":132},{"$f":"'[2]Tasa de Falla'!F137","v":45.6},{"$f":"IF('[2]Tasa de Falla'!IU137=0,\"\",'[2]Tasa de Falla'!IU137)","v":"XXXX"},{"$f":"IF('[2]Tasa de Falla'!IV137=0,\"\",'[2]Tasa de Falla'!IV137)","v":"XXXX"},{"$f":"IF('[2]Tasa de Falla'!IW137=0,\"\",'[2]Tasa de Falla'!IW137)","v":"XXXX"},{"$f":"IF('[2]Tasa de Falla'!IX137=0,\"\",'[2]Tasa de Falla'!IX137)","v":""},{"$f":"IF('[2]Tasa de Falla'!IY137=0,\"\",'[2]Tasa de Falla'!IY137)","v":1},{"$f":"IF('[2]Tasa de Falla'!IZ137=0,\"\",'[2]Tasa de Falla'!IZ137)","v":""},{"$f":"IF('[2]Tasa de Falla'!JA137=0,\"\",'[2]Tasa de Falla'!JA137)","v":""},{"$f":"IF('[2]Tasa de Falla'!JB137=0,\"\",'[2]Tasa de Falla'!JB137)","v":""},{"$f":"IF('[2]Tasa de Falla'!JC137=0,\"\",'[2]Tasa de Falla'!JC137)","v":""},{"$f":"IF('[2]Tasa de Falla'!JD137=0,\"\",'[2]Tasa de Falla'!JD137)","v":""},{"$f":"IF('[2]Tasa de Falla'!JE137=0,\"\",'[2]Tasa de Falla'!JE137)","v":""},{"$f":"IF('[2]Tasa de Falla'!JF137=0,\"\",'[2]Tasa de Falla'!JF137)","v":""}]
[null,null,{"$f":"'[2]Tasa de Falla'!C138","v":121},{"$f":"'[2]Tasa de Falla'!D138","v":"SANTIAGO - SANTIAGO SUR "},{"$f":"'[2]Tasa de Falla'!E138","v":132},{"$f":"'[2]Tasa de Falla'!F138","v":8.4},{"$f":"IF('[2]Tasa de Falla'!IU138=0,\"\",'[2]Tasa de Falla'!IU138)","v":"XXXX"},{"$f":"IF('[2]Tasa de Falla'!IV138=0,\"\",'[2]Tasa de Falla'!IV138)","v":"XXXX"},{"$f":"IF('[2]Tasa de Falla'!IW138=0,\"\",'[2]Tasa de Falla'!IW138)","v":"XXXX"},{"$f":"IF('[2]Tasa de Falla'!IX138=0,\"\",'[2]Tasa de Falla'!IX138)","v":"XXXX"},{"$f":"IF('[2]Tasa de Falla'!IY138=0,\"\",'[2]Tasa de Falla'!IY138)","v":""},{"$f":"IF('[2]Tasa de Falla'!IZ138=0,\"\",'[2]Tasa de Falla'!IZ138)","v":""},{"$f":"IF('[2]Tasa de Falla'!JA138=0,\"\",'[2]Tasa de Falla'!JA138)","v":""},{"$f":"IF('[2]Tasa de Falla'!JB138=0,\"\",'[2]Tasa de Falla'!JB138)","v":""},{"$f":"IF('[2]Tasa de Falla'!JC138=0,\"\",'[2]Tasa de Falla'!JC138)","v":1},{"$f":"IF('[2]Tasa de Falla'!JD138=0,\"\",'[2]Tasa de Falla'!JD138)","v":""},{"$f":"IF('[2]Tasa de Falla'!JE138=0,\"\",'[2]Tasa de Falla'!JE138)","v":""},{"$f":"IF('[2]Tasa de Falla'!JF138=0,\"\",'[2]Tasa de Falla'!JF138)","v":1}]
[null,null,{"$f":"'[2]Tasa de Falla'!C139","v":122},{"$f":"'[2]Tasa de Falla'!D139","v":"SANTIAGO OESTE - SANTIAGO"},{"$f":"'[2]Tasa de Falla'!E139","v":132},{"$f":"'[2]Tasa de Falla'!F139","v":8.4},{"$f":"IF('[2]Tasa de Falla'!IU139=0,\"\",'[2]Tasa de Falla'!IU139)","v":"XXXX"},{"$f":"IF('[2]Tasa de Falla'!IV139=0,\"\",'[2]Tasa de Falla'!IV139)","v":"XXXX"},{"$f":"IF('[2]Tasa de Falla'!IW139=0,\"\",'[2]Tasa de Falla'!IW139)","v":"XXXX"},{"$f":"IF('[2]Tasa de Falla'!IX139=0,\"\",'[2]Tasa de Falla'!IX139)","v":"XXXX"},{"$f":"IF('[2]Tasa de Falla'!IY139=0,\"\",'[2]Tasa de Falla'!IY139)","v":"XXXX"},{"$f":"IF('[2]Tasa de Falla'!IZ139=0,\"\",'[2]Tasa de Falla'!IZ139)","v":"XXXX"},{"$f":"IF('[2]Tasa de Falla'!JA139=0,\"\",'[2]Tasa de Falla'!JA139)","v":"XXXX"},{"$f":"IF('[2]Tasa de Falla'!JB139=0,\"\",'[2]Tasa de Falla'!JB139)","v":"XXXX"},{"$f":"IF('[2]Tasa de Falla'!JC139=0,\"\",'[2]Tasa de Falla'!JC139)","v":"XXXX"},{"$f":"IF('[2]Tasa de Falla'!JD139=0,\"\",'[2]Tasa de Falla'!JD139)","v":"XXXX"},{"$f":"IF('[2]Tasa de Falla'!JE139=0,\"\",'[2]Tasa de Falla'!JE139)","v":"XXXX"},{"$f":"IF('[2]Tasa de Falla'!JF139=0,\"\",'[2]Tasa de Falla'!JF139)","v":"XXXX"}]
[null,null,{"$f":"'[2]Tasa de Falla'!C140","v":123},{"$f":"'[2]Tasa de Falla'!D140","v":"LA BANDA - MISQUI MAYU II - SANTIAGO ESTE"},{"$f":"'[2]Tasa de Falla'!E140","v":132},{"$f":"'[2]Tasa de Falla'!F140","v":4.92},{"$f":"IF('[2]Tasa de Falla'!IU140=0,\"\",'[2]Tasa de Falla'!IU140)","v":"XXXX"},{"$f":"IF('[2]Tasa de Falla'!IV140=0,\"\",'[2]Tasa de Falla'!IV140)","v":"XXXX"},{"$f":"IF('[2]Tasa de Falla'!IW140=0,\"\",'[2]Tasa de Falla'!IW140)","v":"XXXX"},{"$f":"IF('[2]Tasa de Falla'!IX140=0,\"\",'[2]Tasa de Falla'!IX140)","v":"XXXX"},{"$f":"IF('[2]Tasa de Falla'!IY140=0,\"\",'[2]Tasa de Falla'!IY140)","v":""},{"$f":"IF('[2]Tasa de Falla'!IZ140=0,\"\",'[2]Tasa de Falla'!IZ140)","v":""},{"$f":"IF('[2]Tasa de Falla'!JA140=0,\"\",'[2]Tasa de Falla'!JA140)","v":""},{"$f":"IF('[2]Tasa de Falla'!JB140=0,\"\",'[2]Tasa de Falla'!JB140)","v":1},{"$f":"IF('[2]Tasa de Falla'!JC140=0,\"\",'[2]Tasa de Falla'!JC140)","v":""},{"$f":"IF('[2]Tasa de Falla'!JD140=0,\"\",'[2]Tasa de Falla'!JD140)","v":""},{"$f":"IF('[2]Tasa de Falla'!JE140=0,\"\",'[2]Tasa de Falla'!JE140)","v":""},{"$f":"IF('[2]Tasa de Falla'!JF140=0,\"\",'[2]Tasa de Falla'!JF140)","v":1}]
[null,null,{"$f":"'[2]Tasa de Falla'!C141","v":124},{"$f":"'[2]Tasa de Falla'!D141","v":"CABRA CORRAL - GUACHIPAS - PAMPA GRANDE"},{"$f":"'[2]Tasa de Falla'!E141","v":132},{"$f":"'[2]Tasa de Falla'!F141","v":72.099999999999994},{"$f":"IF('[2]Tasa de Falla'!IU141=0,\"\",'[2]Tasa de Falla'!IU141)","v":"XXXX"},{"$f":"IF('[2]Tasa de Falla'!IV141=0,\"\",'[2]Tasa de Falla'!IV141)","v":"XXXX"},{"$f":"IF('[2]Tasa de Falla'!IW141=0,\"\",'[2]Tasa de Falla'!IW141)","v":"XXXX"},{"$f":"IF('[2]Tasa de Falla'!IX141=0,\"\",'[2]Tasa de Falla'!IX141)","v":"XXXX"},{"$f":"IF('[2]Tasa de Falla'!IY141=0,\"\",'[2]Tasa de Falla'!IY141)","v":"XXXX"},{"$f":"IF('[2]Tasa de Falla'!IZ141=0,\"\",'[2]Tasa de Falla'!IZ141)","v":"XXXX"},{"$f":"IF('[2]Tasa de Falla'!JA141=0,\"\",'[2]Tasa de Falla'!JA141)","v":"XXXX"},{"$f":"IF('[2]Tasa de Falla'!JB141=0,\"\",'[2]Tasa de Falla'!JB141)","v":"XXXX"},{"$f":"IF('[2]Tasa de Falla'!JC141=0,\"\",'[2]Tasa de Falla'!JC141)","v":"XXXX"},{"$f":"IF('[2]Tasa de Falla'!JD141=0,\"\",'[2]Tasa de Falla'!JD141)","v":1},{"$f":"IF('[2]Tasa de Falla'!JE141=0,\"\",'[2]Tasa de Falla'!JE141)","v":2},{"$f":"IF('[2]Tasa de Falla'!JF141=0,\"\",'[2]Tasa de Falla'!JF141)","v":8}]
[null,null,{"$f":"'[2]Tasa de Falla'!C142","v":125},{"$f":"'[2]Tasa de Falla'!D142","v":"EL TABACAL - PI. TABACAL II - ORAN"},{"$f":"'[2]Tasa de Falla'!E142","v":132},{"$f":"'[2]Tasa de Falla'!F142","v":12.04},{"$f":"IF('[2]Tasa de Falla'!IU142=0,\"\",'[2]Tasa de Falla'!IU142)","v":"XXXX"},{"$f":"IF('[2]Tasa de Falla'!IV142=0,\"\",'[2]Tasa de Falla'!IV142)","v":"XXXX"},{"$f":"IF('[2]Tasa de Falla'!IW142=0,\"\",'[2]Tasa de Falla'!IW142)","v":"XXXX"},{"$f":"IF('[2]Tasa de Falla'!IX142=0,\"\",'[2]Tasa de Falla'!IX142)","v":"XXXX"},{"$f":"IF('[2]Tasa de Falla'!IY142=0,\"\",'[2]Tasa de Falla'!IY142)","v":"XXXX"},{"$f":"IF('[2]Tasa de Falla'!IZ142=0,\"\",'[2]Tasa de Falla'!IZ142)","v":"XXXX"},{"$f":"IF('[2]Tasa de Falla'!JA142=0,\"\",'[2]Tasa de Falla'!JA142)","v":"XXXX"},{"$f":"IF('[2]Tasa de Falla'!JB142=0,\"\",'[2]Tasa de Falla'!JB142)","v":"XXXX"},{"$f":"IF('[2]Tasa de Falla'!JC142=0,\"\",'[2]Tasa de Falla'!JC142)","v":"XXXX"},{"$f":"IF('[2]Tasa de Falla'!JD142=0,\"\",'[2]Tasa de Falla'!JD142)","v":1},{"$f":"IF('[2]Tasa de Falla'!JE142=0,\"\",'[2]Tasa de Falla'!JE142)","v":1},{"$f":"IF('[2]Tasa de Falla'!JF142=0,\"\",'[2]Tasa de Falla'!JF142)","v":1}]
[null,null,{"$f":"'[2]Tasa de Falla'!C143","v":126},{"$f":"'[2]Tasa de Falla'!D143","v":"GUEMES - CAMPO SANTO - MINETTI"},{"$f":"'[2]Tasa de Falla'!E143","v":132},{"$f":"'[2]Tasa de Falla'!F143","v":41.8},{"$f":"IF('[2]Tasa de Falla'!IU143=0,\"\",'[2]Tasa de Falla'!IU143)","v":""},{"$f":"IF('[2]Tasa de Falla'!IV143=0,\"\",'[2]Tasa de Falla'!IV143)","v":""},{"$f":"IF('[2]Tasa de Falla'!IW143=0,\"\",'[2]Tasa de Falla'!IW143)","v":2},{"$f":"IF('[2]Tasa de Falla'!IX143=0,\"\",'[2]Tasa de Falla'!IX143)","v":3},{"$f":"IF('[2]Tasa de Falla'!IY143=0,\"\",'[2]Tasa de Falla'!IY143)","v":""},{"$f":"IF('[2]Tasa de Falla'!IZ143=0,\"\",'[2]Tasa de Falla'!IZ143)","v":""},{"$f":"IF('[2]Tasa de Falla'!JA143=0,\"\",'[2]Tasa de Falla'!JA143)","v":1},{"$f":"IF('[2]Tasa de Falla'!JB143=0,\"\",'[2]Tasa de Falla'!JB143)","v":1},{"$f":"IF('[2]Tasa de Falla'!JC143=0,\"\",'[2]Tasa de Falla'!JC143)","v":""},{"$f":"IF('[2]Tasa de Falla'!JD143=0,\"\",'[2]Tasa de Falla'!JD143)","v":""},{"$f":"IF('[2]Tasa de Falla'!JE143=0,\"\",'[2]Tasa de Falla'!JE143)","v":""},{"$f":"IF('[2]Tasa de Falla'!JF143=0,\"\",'[2]Tasa de Falla'!JF143)","v":1}]
[null,null,{"$f":"'[2]Tasa de Falla'!C144","v":127},{"$f":"'[2]Tasa de Falla'!D144","v":"GUEMES - CAMPO SANTO - PARQUE IND."},{"$f":"'[2]Tasa de Falla'!E144","v":132},{"$f":"'[2]Tasa de Falla'!F144","v":38.86},{"$f":"IF('[2]Tasa de Falla'!IU144=0,\"\",'[2]Tasa de Falla'!IU144)","v":""},{"$f":"IF('[2]Tasa de Falla'!IV144=0,\"\",'[2]Tasa de Falla'!IV144)","v":""},{"$f":"IF('[2]Tasa de Falla'!IW144=0,\"\",'[2]Tasa de Falla'!IW144)","v":""},{"$f":"IF('[2]Tasa de Falla'!IX144=0,\"\",'[2]Tasa de Falla'!IX144)","v":""},{"$f":"IF('[2]Tasa de Falla'!IY144=0,\"\",'[2]Tasa de Falla'!IY144)","v":""},{"$f":"IF('[2]Tasa de Falla'!IZ144=0,\"\",'[2]Tasa de Falla'!IZ144)","v":""},{"$f":"IF('[2]Tasa de Falla'!JA144=0,\"\",'[2]Tasa de Falla'!JA144)","v":""},{"$f":"IF('[2]Tasa de Falla'!JB144=0,\"\",'[2]Tasa de Falla'!JB144)","v":""},{"$f":"IF('[2]Tasa de Falla'!JC144=0,\"\",'[2]Tasa de Falla'!JC144)","v":""},{"$f":"IF('[2]Tasa de Falla'!JD144=0,\"\",'[2]Tasa de Falla'!JD144)","v":""},{"$f":"IF('[2]Tasa de Falla'!JE144=0,\"\",'[2]Tasa de Falla'!JE144)","v":1},{"$f":"IF('[2]Tasa de Falla'!JF144=0,\"\",'[2]Tasa de Falla'!JF144)","v":""}]
[null,null,{"$f":"'[2]Tasa de Falla'!C145","v":128},{"$f":"'[2]Tasa de Falla'!D145","v":"SANTIAGO CENTRO - MISQUI MAYU I - SANTIAGO ESTE"},{"$f":"'[2]Tasa de Falla'!E145","v":132},{"$f":"'[2]Tasa de Falla'!F145","v":10.66},{"$f":"IF('[2]Tasa de Falla'!IU145=0,\"\",'[2]Tasa de Falla'!IU145)","v":"XXXX"},{"$f":"IF('[2]Tasa de Falla'!IV145=0,\"\",'[2]Tasa de Falla'!IV145)","v":"XXXX"},{"$f":"IF('[2]Tasa de Falla'!IW145=0,\"\",'[2]Tasa de Falla'!IW145)","v":"XXXX"},{"$f":"IF('[2]Tasa de Falla'!IX145=0,\"\",'[2]Tasa de Falla'!IX145)","v":"XXXX"},{"$f":"IF('[2]Tasa de Falla'!IY145=0,\"\",'[2]Tasa de Falla'!IY145)","v":""},{"$f":"IF('[2]Tasa de Falla'!IZ145=0,\"\",'[2]Tasa de Falla'!IZ145)","v":""},{"$f":"IF('[2]Tasa de Falla'!JA145=0,\"\",'[2]Tasa de Falla'!JA145)","v":""},{"$f":"IF('[2]Tasa de Falla'!JB145=0,\"\",'[2]Tasa de Falla'!JB145)","v":""},{"$f":"IF('[2]Tasa de Falla'!JC145=0,\"\",'[2]Tasa de Falla'!JC145)","v":""},{"$f":"IF('[2]Tasa de Falla'!JD145=0,\"\",'[2]Tasa de Falla'!JD145)","v":""},{"$f":"IF('[2]Tasa de Falla'!JE145=0,\"\",'[2]Tasa de Falla'!JE145)","v":""},{"$f":"IF('[2]Tasa de Falla'!JF145=0,\"\",'[2]Tasa de Falla'!JF145)","v":1}]
[null,null,{"$f":"'[2]Tasa de Falla'!C146","v":129},{"$f":"'[2]Tasa de Falla'!D146","v":"LA RIOJA SUR - PI. PATQUIA   2"},{"$f":"'[2]Tasa de Falla'!E146","v":132},{"$f":"'[2]Tasa de Falla'!F146","v":40},{"$f":"IF('[2]Tasa de Falla'!IU146=0,\"\",'[2]Tasa de Falla'!IU146)","v":""},{"$f":"IF('[2]Tasa de Falla'!IV146=0,\"\",'[2]Tasa de Falla'!IV146)","v":""},{"$f":"IF('[2]Tasa de Falla'!IW146=0,\"\",'[2]Tasa de Falla'!IW146)","v":""},{"$f":"IF('[2]Tasa de Falla'!IX146=0,\"\",'[2]Tasa de Falla'!IX146)","v":""},{"$f":"IF('[2]Tasa de Falla'!IY146=0,\"\",'[2]Tasa de Falla'!IY146)","v":""},{"$f":"IF('[2]Tasa de Falla'!IZ146=0,\"\",'[2]Tasa de Falla'!IZ146)","v":""},{"$f":"IF('[2]Tasa de Falla'!JA146=0,\"\",'[2]Tasa de Falla'!JA146)","v":""},{"$f":"IF('[2]Tasa de Falla'!JB146=0,\"\",'[2]Tasa de Falla'!JB146)","v":""},{"$f":"IF('[2]Tasa de Falla'!JC146=0,\"\",'[2]Tasa de Falla'!JC146)","v":""},{"$f":"IF('[2]Tasa de Falla'!JD146=0,\"\",'[2]Tasa de Falla'!JD146)","v":""},{"$f":"IF('[2]Tasa de Falla'!JE146=0,\"\",'[2]Tasa de Falla'!JE146)","v":""},{"$f":"IF('[2]Tasa de Falla'!JF146=0,\"\",'[2]Tasa de Falla'!JF146)","v":1}]
[null,null,{"$f":"'[2]Tasa de Falla'!C147","v":130},{"$f":"'[2]Tasa de Falla'!D147","v":"LA RIOJA SUR - PI. CIRCUNVALACION   1"},{"$f":"'[2]Tasa de Falla'!E147","v":132},{"$f":"'[2]Tasa de Falla'!F147","v":41.35},{"$f":"IF('[2]Tasa de Falla'!IU147=0,\"\",'[2]Tasa de Falla'!IU147)","v":""},{"$f":"IF('[2]Tasa de Falla'!IV147=0,\"\",'[2]Tasa de Falla'!IV147)","v":""},{"$f":"IF('[2]Tasa de Falla'!IW147=0,\"\",'[2]Tasa de Falla'!IW147)","v":""},{"$f":"IF('[2]Tasa de Falla'!IX147=0,\"\",'[2]Tasa de Falla'!IX147)","v":""},{"$f":"IF('[2]Tasa de Falla'!IY147=0,\"\",'[2]Tasa de Falla'!IY147)","v":""},{"$f":"IF('[2]Tasa de Falla'!IZ147=0,\"\",'[2]Tasa de Falla'!IZ147)","v":""},{"$f":"IF('[2]Tasa de Falla'!JA147=0,\"\",'[2]Tasa de Falla'!JA147)","v":""},{"$f":"IF('[2]Tasa de Falla'!JB147=0,\"\",'[2]Tasa de Falla'!JB147)","v":""},{"$f":"IF('[2]Tasa de Falla'!JC147=0,\"\",'[2]Tasa de Falla'!JC147)","v":""},{"$f":"IF('[2]Tasa de Falla'!JD147=0,\"\",'[2]Tasa de Falla'!JD147)","v":""},{"$f":"IF('[2]Tasa de Falla'!JE147=0,\"\",'[2]Tasa de Falla'!JE147)","v":""},{"$f":"IF('[2]Tasa de Falla'!JF147=0,\"\",'[2]Tasa de Falla'!JF147)","v":""}]
[]
[null,null,null,null,"Longitud Total    ",{"$f":"SUM(F16:F148)-F19-F21-F22-F26-F27-F37-F39-F40-F43-F44-F47-F48-F49-F53-F60-F65-F78-F82-F96-F101-F111","v":6071.3800000000028}]
[null,null,null,null,null,"Indisponibilidades Forzadas  ",{"$f":"SUM(G17:G148)","v":12},{"$f":"SUM(H17:H148)","v":14},{"$f":"SUM(I17:I148)","v":15},10,4,11,15,6,9,14,29,32]
[null,null,null,null,null,"TASA DE FALLA  ",{"$f":"+'[2]Tasa de Falla'!IU154","v":2.57},{"$f":"+'[2]Tasa de Falla'!IV154","v":2.31},{"$f":"+'[2]Tasa de Falla'!IW154","v":2.39},{"$f":"+'[2]Tasa de Falla'!IX154","v":2.4},{"$f":"+'[2]Tasa de Falla'!IY154","v":2.5099999999999998},{"$f":"+'[2]Tasa de Falla'!IZ154","v":2.2599999999999998},{"$f":"+'[2]Tasa de Falla'!JA154","v":2.44},{"$f":"+'[2]Tasa de Falla'!JB154","v":2.61},{"$f":"+'[2]Tasa de Falla'!JC154","v":2.67},{"$f":"+'[2]Tasa de Falla'!JD154","v":2.74},{"$f":"+'[2]Tasa de Falla'!JE154","v":2.68},{"$f":"+'[2]Tasa de Falla'!JF154","v":3.05},{"$f":"+'[2]Tasa de Falla'!JG154","v":3.3}]
[]
[null,null,"XXX","  Línea no computada en el mes",null,null,null,null,"TASA DE FALLA",null,null,{"$f":"S151","v":3.3},null,"SALIDAS x AÑO / 100 km"]

{"sheet":"DATO","index":10,"n_rows":25,"n_cols":29,"rows_kept":25,"cut":false,"hidden":false,"merged":[]}
["Mes","Mes","Dia","Año"]
["enero","01",31,2006]
["febrero","02",{"$f":"IF(MOD(E14,4)=0,29,28)","v":29},{"$f":"+D2+1","v":2007}]
["marzo","03",31,2008]
["abril","04",30,2009]
["mayo","05",31,2010]
["junio","06",30,2011]
["julio","07",31,2012]
["agosto","08",31,2013]
["septiembre","09",30,2014]
["octubre","10",31,2015]
["noviembre","11",30,2016]
["diciembre","12",31,null,null,null,null,null,"Total"]
[11,2,{"$f":"CELL(\"CONTENIDO\",OFFSET(A1,B14,0))","v":"febrero"},{"$f":"CELL(\"CONTENIDO\",OFFSET(C1,B14,0))","v":29},{"$f":"CELL(\"CONTENIDO\",OFFSET(D1,A14,0))","v":2016},{"$f":"\"Desde el 01 al \" & D14 & \" de \" & C14 & \" de \" & E14","v":"Desde el 01 al 29 de febrero de 2016"},{"$f":"CELL(\"CONTENIDO\",OFFSET(B1,B14,0))","v":"02"},{"$f":"RIGHT(E14,2)","v":"16"},"B14"]
[null,{"$f":"\"\\\\rugor\\files\\Transporte\\Transporte\\AA PROCESO AUT ARCHIVOS J\\TRANSNOA\\\" &E14","v":"\\\\rugor\\files\\Transporte\\Transporte\\AA PROCESO AUT ARCHIVOS J\\TRANSNOA\\2016"},null,null,null,null,{"$f":"\"J\"&G14&H14&\"NOA\"","v":"J0216NOA"}]
[null,{"$f":"\"\\\\rugor\\files\\Transporte\\transporte\\AA PROCESO AUT\\INTERCAMBIO\\\" &H14&G14","v":"\\\\rugor\\files\\Transporte\\transporte\\AA PROCESO AUT\\INTERCAMBIO\\1602"}]
["Hoja","FilaInicio","FilasPlantilla","Columnas","NombreHoja","OrigenDeDatos","Col00","Col01","Col02","Col03","Col04","Col05","Col06","Col07","Col08","Col09","Col10","Col11","Col12","Col13","Col14","Col15","FILHTOTAL","COLHTOTAL","FILHCALC","COLHCALC","FILTRANSP","COLTRANSP","COL TSAL"]
["MODELO L",21,20,11,{"$f":"\"LI-\" & $G$14","v":"LI-02"},"TRANSNOA_INDISPONIBILIDADES_LINEAS_TRANSNOA.XLS",3,5,4,6,7,8,0,10,11,14,0,26,0,0,0,0,19,10,42,27,19,27,14]
["MODELO T",24,20,13,{"$f":"\"T-\" & $G$14","v":"T-02"},"TRANSNOA_INDISPONIBILIDADES_TRAFOS_TRANSNOA.XLS",3,5,4,6,7,8,9,11,12,15,16,18,28,17,0,0,25,10,45,29,22,29,15]
["MODELO S",23,20,10,{"$f":"\"SA-\" & $G$14","v":"SA-02"},"TRANSNOA_INDISPONIBILIDADES_SALIDAS_TRANSNOA.XLS",3,5,4,6,7,8,10,11,14,15,21,0,0,0,0,0,29,10,44,22,21,22,14]
["MODELO L RIOJA",21,20,11,{"$f":"\"LI-RIOJA-\" & $G$14","v":"LI-RIOJA-02"},"TRANSNOA_INDISPONIBILIDADES_LINEAS_RIOJA.XLS",3,5,4,6,7,8,0,10,11,14,2,26,0,0,0,0,21,10,42,27,19,27,14]
["MODELO L EDESA",21,20,11,{"$f":"\"LI-EDESA-\" & $G$14","v":"LI-EDESA-02"},"TRANSNOA_INDISPONIBILIDADES_LINEAS_EDESA.XLS",3,5,4,6,7,8,0,10,11,14,2,26,0,0,0,0,20,10,42,27,19,27,14]
["MODELO T EDESA",24,20,13,{"$f":"\"T-EDESA-\" & $G$14","v":"T-EDESA-02"},"TRANSNOA_INDISPONIBILIDADES_TRAFOS_EDESA.XLS",3,5,4,6,7,8,9,11,12,15,16,18,28,17,0,0,26,10,45,29,22,29,15]
["MODELO S EDESA",23,20,10,{"$f":"\"SA-EDESA-\" & $G$14","v":"SA-EDESA-02"},"TRANSNOA_INDISPONIBILIDADES_SALIDAS_EDESA.XLS",3,5,4,6,7,8,10,11,14,15,21,0,0,0,0,0,30,10,44,22,21,22,14]
["MODELO VST",19,24,4,{"$f":"\"CAUSAS-VST-\" & $G$14","v":"CAUSAS-VST-02"},"TRANSNOA_CAUSAS_VST.XLS",3,4,5,6,7,0,0,0,0,0,0,0,0,0,0,0,999,999,0,0,0,0,0]