{"text_format":"1","workbook":"xlsx","n_sheets":10,"sheets":["TOT-1115","LI-11 (1)","LI-11 (2)","T-11 (1)","T-11 (2)","T-11 (3)","T-EDESA-11 (1)","SUP-EDESA","Tasa de Falla","DATO"],"not_rendered":{"charts":0,"images":3,"macros":1,"external_links":1,"defined_names":1,"comments":0,"pivot_tables":0},"unopened":[],"bounds":{"document_bytes":16777216,"sheet_cells":100000,"rows_first":2000,"rows_last":500,"rows_between":2000,"halvings":0,"cell_chars":16384,"cell_head_chars":4096},"cells_cut":0,"cells_raw":0,"read":"whole","date_system":"1900"}

{"sheet":"TOT-1115","index":0,"n_rows":31,"n_cols":10,"rows_kept":31,"cut":false,"hidden":false,"merged":[]}
[]
[null,"ANEXO II  al Memorandum  D.T.E.E. N°      356     / 2017"]
[]
["ENTE NACIONAL REGULADOR "]
["DE LA ELECTRICIDAD"]
[]
[null,"SISTEMA DE TRANSPORTE DE ENERGÍA ELÉCTRICA POR DISTRIBUCIÓN TRONCAL"]
[]
[null,"TRANSNOA S.A."]
[]
[null,"TOTAL DE PENALIZACIONES"]
[]
[null,1]
[null,"Desde el 01 al 30 de noviembre de 2015"]
[]
[null,"Sanciones duplicadas por tasa de falla > 4 Sal. x año/100km."]
[]
[null,null,"1.-","LÍNEAS"]
[null,null,null,"1.1.-","Equipamiento propio",null,null,null,null,{"$f":"'LI-11 (2)'!AA42","v":506370.41}]
[]
[null,null,"2.-","CONEXIÓN"]
[null,null,null,"2.1.-","Transformación"]
[null,null,null,null,"2.1.1.-","Equipamiento propio",null,null,null,{"$f":"'T-11 (3)'!AC45","v":55345.919999999998}]
[null,null,null,null,"2.1.2.-","Equipamiento del T.I. EDESA S.A.",null,null,null,{"$f":"'T-EDESA-11 (1)'!AC45","v":6.69}]
[]
[null,null,"3.1.-","SUPERVISIÓN del T.I. EDESA S.A.",null,null,null,null,null,{"$f":"'SUP-EDESA'!I54","v":1.7598853433647246}]
[]
[]
[null,null,null,null,null,null,"TOTAL ",{"$f":"SUM(J18:J27)","v":561724.77988534328}]
[]
[null,null,"Valores remuneratorios según Acuerdo SE - ENRE -TRANSNOA 2016-2017"]

{"sheet":"LI-11 (1)","index":1,"n_rows":40,"n_cols":27,"rows_kept":40,"cut":false,"hidden":false,"merged":[]}
[]
[null,{"$f":"+'TOT-1115'!B2","v":"ANEXO II  al Memorandum  D.T.E.E. N°      356     / 2017"}]
[]
[" ENTE NACIONAL REGULADOR "]
["       DE LA ELECTRICIDAD"]
[]
[]
[null,null,null,null,null,"SISTEMA DE TRANSPORTE DE ENERGÍA ELÉCTRICA POR DISTRIBUCIÓN TRONCAL - TRANSNOA S.A."]
[]
[null,null,null,null,null,"1.- LÍNEAS"]
[]
[null,null,null,null,null,"1.1.- Equipamiento propio"]
[]
[null,{"$f":"'TOT-1115'!B14","v":"Desde el 01 al 30 de noviembre de 2015"}]
[]
[null,null,null,null,null,"$/100 km-h : LINEAS 132 kV ",514.20399999999995,null,null,null,"FACTOR DE PENALIZACION  K =",{"$f":"30*'TOT-1115'!B13","v":30},{"$f":"IF(L16=30,\" \",IF(L16=60,\"Coeficiente duplicado por tasa de falla >4 Sal. x año/100 km.\",\"REVISAR COEFICIENTE\"))","v":" "}]
[null,null,3,4,5,6,7,8,9,10,11,12,13,14,15,16,17,18,19,20,21,22,23,24,25,26,27]
[null,null,"N°","INDISP","ID EQUIPO","LÍNEAS","U\n[kV]","Long.\n[km]","$/h","Salida","Entrada","Hs. \nIndisp","Minutos\nIndisp.","Tipo \nSal.(²)","C.R.\n%","PENALIZ.\nPROGRAM.","REDUCC.\nPROGRAM.","PENALIZACION FORZADA\nPor Salida    1ras. 3 hs.   hs. Restantes",null,null,"REDUCC. FORZADA\nPor Salida     1ras. 3 hs.     hs. Restantes",null,null,"RESTANTE\nFORZADA","REDUCC.\nRESTANTE","Informó\nen Térm.","TOTAL\nPENALIZAC."]
[]
[]
[null,null,1,294022,299,"PALPALA - SAN JUANCITO",132,23.899999618530273,{"$f":"$G$16/100*IF(H21>25,H21,25)","v":128.55099999999999},"2015-11-01T07:32:00","2015-11-01T13:41:00",{"$f":"IF(F21=\"\",\"\",(K21-J21)*24)","v":6.1500000001396984},{"$f":"IF(F21=\"\",\"\",ROUND((K21-J21)*24*60,0))","v":369},"P",{"$f":"IF(F21=\"\",\"\",\"--\")","v":"--"},{"$f":"IF(N21=\"P\",ROUND(M21/60,2)*I21*$L$16*0.01,\"--\")","v":237.17659499999999},{"$f":"IF(N21=\"RP\",I21*O21*ROUND(L21/60,2)*0.01*M21/100,\"--\")","v":"--"},{"$f":"IF(N21=\"F\",I21*$L$16,\"--\")","v":"--"},{"$f":"IF(AND(M21>10,N21=\"F\"),I21*$L$16*IF(M21>180,3,ROUND((M21)/60,2)),\"--\")","v":"--"},{"$f":"IF(AND(M21>180,N21=\"F\"),(ROUND(M21/60,2)-3)*I21*$L$16*0.1,\"--\")","v":"--"},{"$f":"IF(N21=\"R\",I21*$L$16*O21/100,\"--\")","v":"--"},{"$f":"IF(AND(M21>10,N21=\"R\"),I21*$L$16*O21/100*IF(M21>180,3,ROUND(M21/60,2)),\"--\")","v":"--"},{"$f":"IF(AND(M21>180,N21=\"R\"),(ROUND(M21/60,2)-3)*I21*$L$16*0.1*O21/100,\"--\")","v":"--"},{"$f":"IF(N21=\"RF\",ROUND(M21/60,2)*I21*$L$16*0.1,\"--\")","v":"--"},{"$f":"IF(N21=\"RR\",ROUND(M21/60,2)*I21*$L$16*0.1*O21/100,\"--\")","v":"--"},"SI",{"$f":"IF(F21=\"\",\"\",SUM(P21:Y21)*IF(Z21=\"SI\",1,2))","v":237.17659499999999}]
[null,null,2,294023,2623,"PALPALA - JUJUY ESTE",132,12.25,128.55099999999999,"2015-11-01T07:33:00","2015-11-01T13:41:00",6.1333333334187046,368,"P","--",236.40528899999998,"--","--","--","--","--","--","--","--","--","SI",236.40528899999998]
[null,null,3,294024,291,"LIBERTADOR NOA - PICHANAL",132,76,390.79503999999997,"2015-11-01T22:00:00","2015-11-02T00:01:00",2.0166666667792015,121,"F","--","--","--",11723.851199999999,23682.179423999998,"--","--","--","--","--","--","SI",35406.030623999999]
[null,null,4,294234,4249,"PAMPA GRANDE - CABRA CORRAL",132,60,308.5224,"2015-11-03T07:24:00","2015-11-03T17:38:00",10.233333333337214,614,"P","--",946.8552456000001,"--","--","--","--","--","--","--","--","--","SI",946.8552456000001]
[null,null,5,294235,5541,"SANTIAGO - SANTIAGO SUR",132,8.4,128.55099999999999,"2015-11-03T09:52:00","2015-11-03T17:45:00",7.8833333333604969,473,"P","--",303.894564,"--","--","--","--","--","--","--","--","--","SI",303.894564]
[null,null,6,294236,299,"PALPALA - SAN JUANCITO",132,23.899999618530273,128.55099999999999,"2015-11-03T11:53:00","2015-11-03T12:05:00",0.19999999995343387,12,"F","--","--","--",3856.5299999999997,771.30600000000004,"--","--","--","--","--","--","SI",4627.8359999999993]
[null,null,7,294243,3773,"LA RIOJA - RECREO 2",132,220,1131.2487999999998,"2015-11-03T22:37:00","2015-11-03T23:38:00",1.0166666666627862,61,"F","--","--","--",33937.463999999993,34616.213279999996,"--","--","--","--","--","--","SI",68553.677279999989]
[null,null,8,294288,3773,"LA RIOJA - RECREO 2",132,220,1131.2487999999998,"2015-11-04T01:33:00","2015-11-04T01:46:00",0.21666666667442769,13,"F","--","--","--",33937.463999999993,7466.2420799999982,"--","--","--","--","--","--","SI",41403.706079999989]
[null,null,9,294293,4249,"PAMPA GRANDE - CABRA CORRAL",132,60,308.5224,"2015-11-04T07:21:00","2015-11-04T17:29:00",10.133333333360497,608,"P","--",937.59957359999999,"--","--","--","--","--","--","--","--","--","SI",937.59957359999999]
[null,null,10,294294,4483,"SANTIAGO SUR - SANTIAGO CENTRO",132,4,128.55099999999999,"2015-11-04T08:44:00","2015-11-04T16:20:00",7.5999999999767169,456,"P","--",293.09627999999992,"--","--","--","--","--","--","--","--","--","SI",293.09627999999992]
[null,null,11,294317,5541,"SANTIAGO - SANTIAGO SUR",132,8.4,128.55099999999999,"2015-11-05T08:48:00","2015-11-05T11:35:00",2.7833333333255723,167,"P","--",107.211534,"--","--","--","--","--","--","--","--","--","SI",107.211534]
[null,null,12,294325,5678,"EL TABACAL - ORAN",132,12.04,128.55099999999999,"2015-11-06T06:25:00","2015-11-06T06:43:00",0.30000000010477379,18,"F","--","--","--",3856.5299999999997,1156.9589999999998,"--","--","--","--","--","--","SI",5013.4889999999996]
[null,null,13,294330,4249,"PAMPA GRANDE - CABRA CORRAL",132,60,308.5224,"2015-11-06T07:01:00","2015-11-06T10:25:00",3.4000000000814907,204,"P","--",314.69284799999997,"--","--","--","--","--","--","--","--","--","SI",314.69284799999997]
[null,null,14,294334,299,"PALPALA - SAN JUANCITO",132,23.899999618530273,128.55099999999999,"2015-11-07T05:06:00","2015-11-07T05:18:00",0.19999999995343387,12,"F","--","--","--",3856.5299999999997,771.30600000000004,"--","--","--","--","--","--","SI",4627.8359999999993]
[null,null,15,294354,309,"TUCUMAN OESTE - TUCUMAN NORTE",132,7,128.55099999999999,"2015-11-08T08:13:00","2015-11-08T15:07:00",6.8999999999650754,414,"P","--",266.10057,"--","--","--","--","--","--","--","--","--","SI",266.10057]
[null,null,16,294717,4249,"PAMPA GRANDE - CABRA CORRAL",132,60,308.5224,"2015-11-10T07:08:00","2015-11-10T16:03:00",{"$f":"IF(F36=\"\",\"\",(K36-J36)*24)","v":8.9166666665696539},{"$f":"IF(F36=\"\",\"\",ROUND((K36-J36)*24*60,0))","v":535},"P",{"$f":"IF(F36=\"\",\"\",\"--\")","v":"--"},{"$f":"IF(N36=\"P\",ROUND(M36/60,2)*I36*$L$16*0.01,\"--\")","v":825.60594240000012},{"$f":"IF(N36=\"RP\",I36*O36*ROUND(L36/60,2)*0.01*M36/100,\"--\")","v":"--"},{"$f":"IF(N36=\"F\",I36*$L$16,\"--\")","v":"--"},{"$f":"IF(AND(M36>10,N36=\"F\"),I36*$L$16*IF(M36>180,3,ROUND((M36)/60,2)),\"--\")","v":"--"},{"$f":"IF(AND(M36>180,N36=\"F\"),(ROUND(M36/60,2)-3)*I36*$L$16*0.1,\"--\")","v":"--"},{"$f":"IF(N36=\"R\",I36*$L$16*O36/100,\"--\")","v":"--"},{"$f":"IF(AND(M36>10,N36=\"R\"),I36*$L$16*O36/100*IF(M36>180,3,ROUND(M36/60,2)),\"--\")","v":"--"},{"$f":"IF(AND(M36>180,N36=\"R\"),(ROUND(M36/60,2)-3)*I36*$L$16*0.1*O36/100,\"--\")","v":"--"},{"$f":"IF(N36=\"RF\",ROUND(M36/60,2)*I36*$L$16*0.1,\"--\")","v":"--"},{"$f":"IF(N36=\"RR\",ROUND(M36/60,2)*I36*$L$16*0.1*O36/100,\"--\")","v":"--"},"SI",{"$f":"IF(F36=\"\",\"\",SUM(P36:Y36)*IF(Z36=\"SI\",1,2))","v":825.60594240000012}]
[null,null,17,294430,5512,"QUIMILI - CAMPO GALLO",132,140,719.88559999999995,"2015-11-10T08:41:00","2015-11-10T16:58:00",{"$f":"IF(F37=\"\",\"\",(K37-J37)*24)","v":8.2833333332673647},{"$f":"IF(F37=\"\",\"\",ROUND((K37-J37)*24*60,0))","v":497},"P",{"$f":"IF(F37=\"\",\"\",\"--\")","v":"--"},{"$f":"IF(N37=\"P\",ROUND(M37/60,2)*I37*$L$16*0.01,\"--\")","v":1788.1958303999997},{"$f":"IF(N37=\"RP\",I37*O37*ROUND(L37/60,2)*0.01*M37/100,\"--\")","v":"--"},{"$f":"IF(N37=\"F\",I37*$L$16,\"--\")","v":"--"},{"$f":"IF(AND(M37>10,N37=\"F\"),I37*$L$16*IF(M37>180,3,ROUND((M37)/60,2)),\"--\")","v":"--"},{"$f":"IF(AND(M37>180,N37=\"F\"),(ROUND(M37/60,2)-3)*I37*$L$16*0.1,\"--\")","v":"--"},{"$f":"IF(N37=\"R\",I37*$L$16*O37/100,\"--\")","v":"--"},{"$f":"IF(AND(M37>10,N37=\"R\"),I37*$L$16*O37/100*IF(M37>180,3,ROUND(M37/60,2)),\"--\")","v":"--"},{"$f":"IF(AND(M37>180,N37=\"R\"),(ROUND(M37/60,2)-3)*I37*$L$16*0.1*O37/100,\"--\")","v":"--"},{"$f":"IF(N37=\"RF\",ROUND(M37/60,2)*I37*$L$16*0.1,\"--\")","v":"--"},{"$f":"IF(N37=\"RR\",ROUND(M37/60,2)*I37*$L$16*0.1*O37/100,\"--\")","v":"--"},"SI",{"$f":"IF(F37=\"\",\"\",SUM(P37:Y37)*IF(Z37=\"SI\",1,2))","v":1788.1958303999997}]
[]
[]
[null,null,"(²)","P - PROGRAMADA  ; F - FORZADA",null,null,null,null,null,null,null,null,null,null,null,{"$f":"SUM(P19:P39)","v":6256.8342720000001},0,91168.369199999986,68464.205783999991,0,0,0,0,0,0,null,{"$f":"ROUND(SUM(AA19:AA39),2)","v":165889.41}]

{"sheet":"LI-11 (2)","index":2,"n_rows":42,"n_cols":27,"rows_kept":42,"cut":false,"hidden":false,"merged":[]}
[]
[null,{"$f":"+'TOT-1115'!B2","v":"ANEXO II  al Memorandum  D.T.E.E. N°      356     / 2017"}]
[]
[" ENTE NACIONAL REGULADOR "]
["       DE LA ELECTRICIDAD"]
[]
[]
[null,null,null,null,null,"SISTEMA DE TRANSPORTE DE ENERGÍA ELÉCTRICA POR DISTRIBUCIÓN TRONCAL - TRANSNOA S.A."]
[]
[null,null,null,null,null,"1.- LÍNEAS"]
[]
[null,null,null,null,null,"1.1.- Equipamiento propio"]
[]
[null,{"$f":"'TOT-1115'!B14","v":"Desde el 01 al 30 de noviembre de 2015"}]
[]
[null,null,null,null,null,"$/100 km-h : LINEAS 132 kV ",514.20399999999995,null,null,null,"FACTOR DE PENALIZACION  K =",{"$f":"30*'TOT-1115'!B13","v":30},{"$f":"IF(L16=30,\" \",IF(L16=60,\"Coeficiente duplicado por tasa de falla >4 Sal. x año/100 km.\",\"REVISAR COEFICIENTE\"))","v":" "}]
[null,null,3,4,5,6,7,8,9,10,11,12,13,14,15,16,17,18,19,20,21,22,23,24,25,26,27]
[null,null,"N°","INDISP","ID EQUIPO","LÍNEAS","U\n[kV]","Long.\n[km]","$/h","Salida","Entrada","Hs. \nIndisp","Minutos\nIndisp.","Tipo \nSal.(²)","C.R.\n%","PENALIZ.\nPROGRAM.","REDUCC.\nPROGRAM.","PENALIZACION FORZADA\nPor Salida    1ras. 3 hs.   hs. Restantes",null,null,"REDUCC. FORZADA\nPor Salida     1ras. 3 hs.     hs. Restantes",null,null,"RESTANTE\nFORZADA","REDUCC.\nRESTANTE","Informó\nen Térm.","TOTAL\nPENALIZAC."]
[null,null,null,null,null,null,null,null,null,null,null,null,null,null,null,null,null,null,null,null,null,null,null,null,null,null,{"$f":"'LI-11 (1)'!AA40","v":165889.41}]
[]
[null,null,19,294454,290,"LA RIOJA - RECREO 1",132,221,{"$f":"$G$16/100*IF(H21>25,H21,25)","v":1136.39084},"2015-11-10T21:32:00","2015-11-11T19:37:00",{"$f":"IF(F21=\"\",\"\",(K21-J21)*24)","v":22.083333333372138},{"$f":"IF(F21=\"\",\"\",ROUND((K21-J21)*24*60,0))","v":1325},"F",{"$f":"IF(F21=\"\",\"\",\"--\")","v":"--"},{"$f":"IF(N21=\"P\",ROUND(M21/60,2)*I21*$L$16*0.01,\"--\")","v":"--"},{"$f":"IF(N21=\"RP\",I21*O21*ROUND(L21/60,2)*0.01*M21/100,\"--\")","v":"--"},{"$f":"IF(N21=\"F\",I21*$L$16,\"--\")","v":34091.725200000001},{"$f":"IF(AND(M21>10,N21=\"F\"),I21*$L$16*IF(M21>180,3,ROUND((M21)/60,2)),\"--\")","v":102275.1756},{"$f":"IF(AND(M21>180,N21=\"F\"),(ROUND(M21/60,2)-3)*I21*$L$16*0.1,\"--\")","v":65047.011681600001},{"$f":"IF(N21=\"R\",I21*$L$16*O21/100,\"--\")","v":"--"},{"$f":"IF(AND(M21>10,N21=\"R\"),I21*$L$16*O21/100*IF(M21>180,3,ROUND(M21/60,2)),\"--\")","v":"--"},{"$f":"IF(AND(M21>180,N21=\"R\"),(ROUND(M21/60,2)-3)*I21*$L$16*0.1*O21/100,\"--\")","v":"--"},{"$f":"IF(N21=\"RF\",ROUND(M21/60,2)*I21*$L$16*0.1,\"--\")","v":"--"},{"$f":"IF(N21=\"RR\",ROUND(M21/60,2)*I21*$L$16*0.1*O21/100,\"--\")","v":"--"},"SI",{"$f":"IF(F21=\"\",\"\",SUM(P21:Y21)*IF(Z21=\"SI\",1,2))","v":201413.91248160001}]
[null,null,20,294456,5554,"STGO. CENTRO - FERNANDEZ - SUNCHO CORRAL",132,103,{"$f":"$G$16/100*IF(H22>25,H22,25)","v":529.63011999999992},"2015-11-11T08:26:00","2015-11-11T11:55:00",{"$f":"IF(F22=\"\",\"\",(K22-J22)*24)","v":3.4833333333372138},{"$f":"IF(F22=\"\",\"\",ROUND((K22-J22)*24*60,0))","v":209},"P",{"$f":"IF(F22=\"\",\"\",\"--\")","v":"--"},{"$f":"IF(N22=\"P\",ROUND(M22/60,2)*I22*$L$16*0.01,\"--\")","v":552.93384528000001},{"$f":"IF(N22=\"RP\",I22*O22*ROUND(L22/60,2)*0.01*M22/100,\"--\")","v":"--"},{"$f":"IF(N22=\"F\",I22*$L$16,\"--\")","v":"--"},{"$f":"IF(AND(M22>10,N22=\"F\"),I22*$L$16*IF(M22>180,3,ROUND((M22)/60,2)),\"--\")","v":"--"},{"$f":"IF(AND(M22>180,N22=\"F\"),(ROUND(M22/60,2)-3)*I22*$L$16*0.1,\"--\")","v":"--"},{"$f":"IF(N22=\"R\",I22*$L$16*O22/100,\"--\")","v":"--"},{"$f":"IF(AND(M22>10,N22=\"R\"),I22*$L$16*O22/100*IF(M22>180,3,ROUND(M22/60,2)),\"--\")","v":"--"},{"$f":"IF(AND(M22>180,N22=\"R\"),(ROUND(M22/60,2)-3)*I22*$L$16*0.1*O22/100,\"--\")","v":"--"},{"$f":"IF(N22=\"RF\",ROUND(M22/60,2)*I22*$L$16*0.1,\"--\")","v":"--"},{"$f":"IF(N22=\"RR\",ROUND(M22/60,2)*I22*$L$16*0.1*O22/100,\"--\")","v":"--"},"SI",{"$f":"IF(F22=\"\",\"\",SUM(P22:Y22)*IF(Z22=\"SI\",1,2))","v":552.93384528000001}]
[null,null,21,294457,305,"TUCUMAN NORTE - EL BRACHO",132,31.5,161.97425999999999,"2015-11-12T07:46:00","2015-11-12T17:40:00",9.8999999999650754,594,"P","--",481.0635522,"--","--","--","--","--","--","--","--","--","SI",481.0635522]
[null,null,22,294465,5436,"LA RIOJA - ARAUCO",132,84.3,433.47397199999995,"2015-11-14T17:12:00","2015-11-14T17:17:00",8.3333333255723119E-2,5,"F","--","--","--",13004.219159999999,"--","--","--","--","--","--","--","SI",13004.219159999999]
[null,null,23,294765,4250,"PAMPA GRANDE - TRANCAS",132,55,282.81219999999996,"2015-11-16T14:04:00","2015-11-16T14:15:00",0.18333333340706304,11,"F","--","--","--",8484.3659999999982,1527.1858799999995,"--","--","--","--","--","--","SI",10011.551879999997]
[null,null,24,294767,5512,"QUIMILI - CAMPO GALLO",132,140,719.88559999999995,"2015-11-17T08:17:00","2015-11-17T16:11:00",7.9000000000814907,474,"P","--",1706.128872,"--","--","--","--","--","--","--","--","--","SI",1706.128872]
[null,null,25,294773,5061,"SUNCHO CORRAL - QUIMILI",132,108,555.34032000000002,"2015-11-18T08:16:00","2015-11-18T17:16:00",9,540,"P","--",1499.4188640000002,"--","--","--","--","--","--","--","--","--","SI",1499.4188640000002]
[null,null,26,294775,5061,"SUNCHO CORRAL - QUIMILI",132,108,555.34032000000002,"2015-11-19T07:51:00","2015-11-19T12:01:00",4.1666666668024845,250,"P","--",694.73074032000011,"--","--","--","--","--","--","--","--","--","SI",694.73074032000011]
[null,null,27,294776,5482,"EL BRACHO - TERMAS NORTE",132,78.400000000000006,403.13593600000002,"2015-11-19T08:28:00","2015-11-19T13:02:00",4.5666666667093523,274,"P","--",552.69936825600007,"--","--","--","--","--","--","--","--","--","SI",552.69936825600007]
[null,null,28,294784,297,"C.H. RIO HONDO - LA BANDA",132,76.5,393.36606,"2015-11-19T17:33:00","2015-11-19T17:38:00",8.3333333430346102E-2,5,"F","--","--","--",11800.9818,"--","--","--","--","--","--","--","SI",11800.9818]
[null,null,29,295032,5689,"C.CORRAL - GUACHIPAS - PAMPA GRANDE",132,71.2,366.113248,"2015-11-23T01:03:00","2015-11-23T01:11:00",0.13333333341870457,8,"F","--","--","--",10983.397440000001,"--","--","--","--","--","--","--","SI",10983.397440000001]
[null,null,30,295033,5604,"SENDA HACHADA - DRAGONES",132,65,334.23259999999999,"2015-11-24T09:15:00","2015-11-24T17:19:00",8.0666666667675599,484,"P","--",809.17712460000007,"--","--","--","--","--","--","--","--","--","SI",809.17712460000007]
[null,null,31,295042,304,"SAN PEDRO JUJUY - LIBERTADOR NOA",132,49,251.95996,"2015-11-26T21:37:00","2015-11-26T23:03:00",1.4333333334652707,86,"F","--","--","--",7558.7987999999996,10809.082283999998,"--","--","--","--","--","--","SI",18367.881083999997]
[null,null,32,295082,5443,"NONOGASTA - VILLA UNIÓN",132,82.1,422.16148399999997,"2015-11-29T07:17:00","2015-11-29T11:49:00",4.5333333332673647,272,"P","--",573.71745675600005,"--","--","--","--","--","--","--","--","--","SI",573.71745675600005]
[null,null,33,295085,290,"LA RIOJA - RECREO 1",132,221,1136.39084,"2015-11-30T12:33:00","2015-11-30T12:37:00",6.6666666534729302E-2,4,"F","--","--","--",34091.725200000001,"--","--","--","--","--","--","--","SI",34091.725200000001]
[null,null,34,295086,3773,"LA RIOJA - RECREO 2",132,220,1131.2487999999998,"2015-11-30T12:33:00","2015-11-30T12:39:00",9.9999999976716936E-2,6,"F","--","--","--",33937.463999999993,"--","--","--","--","--","--","--","SI",33937.463999999993]
[null,null,null,null,null,null,null,null,128.55099999999999,null,null,"","",null,"","--","--","--","--","--","--","--","--","--","--",{"$f":"IF(F37=\"\",\"\",\"SI\")","v":""},""]
[null,null,null,null,null,null,null,null,128.55099999999999,null,null,{"$f":"IF(F38=\"\",\"\",(K38-J38)*24)","v":""},{"$f":"IF(F38=\"\",\"\",ROUND((K38-J38)*24*60,0))","v":""},null,{"$f":"IF(F38=\"\",\"\",\"--\")","v":""},{"$f":"IF(N38=\"P\",ROUND(M38/60,2)*I38*$L$16*0.01,\"--\")","v":"--"},{"$f":"IF(N38=\"RP\",I38*O38*ROUND(L38/60,2)*0.01*M38/100,\"--\")","v":"--"},{"$f":"IF(N38=\"F\",I38*$L$16,\"--\")","v":"--"},{"$f":"IF(AND(M38>10,N38=\"F\"),I38*$L$16*IF(M38>180,3,ROUND((M38)/60,2)),\"--\")","v":"--"},{"$f":"IF(AND(M38>180,N38=\"F\"),(ROUND(M38/60,2)-3)*I38*$L$16*0.1,\"--\")","v":"--"},{"$f":"IF(N38=\"R\",I38*$L$16*O38/100,\"--\")","v":"--"},{"$f":"IF(AND(M38>10,N38=\"R\"),I38*$L$16*O38/100*IF(M38>180,3,ROUND(M38/60,2)),\"--\")","v":"--"},{"$f":"IF(AND(M38>180,N38=\"R\"),(ROUND(M38/60,2)-3)*I38*$L$16*0.1*O38/100,\"--\")","v":"--"},{"$f":"IF(N38=\"RF\",ROUND(M38/60,2)*I38*$L$16*0.1,\"--\")","v":"--"},{"$f":"IF(N38=\"RR\",ROUND(M38/60,2)*I38*$L$16*0.1*O38/100,\"--\")","v":"--"},{"$f":"IF(F38=\"\",\"\",\"SI\")","v":""},{"$f":"IF(F38=\"\",\"\",SUM(P38:Y38)*IF(Z38=\"SI\",1,2))","v":""}]
[null,null,null,null,null,null,null,null,128.55099999999999,null,null,{"$f":"IF(F39=\"\",\"\",(K39-J39)*24)","v":""},{"$f":"IF(F39=\"\",\"\",ROUND((K39-J39)*24*60,0))","v":""},null,{"$f":"IF(F39=\"\",\"\",\"--\")","v":""},{"$f":"IF(N39=\"P\",ROUND(M39/60,2)*I39*$L$16*0.01,\"--\")","v":"--"},{"$f":"IF(N39=\"RP\",I39*O39*ROUND(L39/60,2)*0.01*M39/100,\"--\")","v":"--"},{"$f":"IF(N39=\"F\",I39*$L$16,\"--\")","v":"--"},{"$f":"IF(AND(M39>10,N39=\"F\"),I39*$L$16*IF(M39>180,3,ROUND((M39)/60,2)),\"--\")","v":"--"},{"$f":"IF(AND(M39>180,N39=\"F\"),(ROUND(M39/60,2)-3)*I39*$L$16*0.1,\"--\")","v":"--"},{"$f":"IF(N39=\"R\",I39*$L$16*O39/100,\"--\")","v":"--"},{"$f":"IF(AND(M39>10,N39=\"R\"),I39*$L$16*O39/100*IF(M39>180,3,ROUND(M39/60,2)),\"--\")","v":"--"},{"$f":"IF(AND(M39>180,N39=\"R\"),(ROUND(M39/60,2)-3)*I39*$L$16*0.1*O39/100,\"--\")","v":"--"},{"$f":"IF(N39=\"RF\",ROUND(M39/60,2)*I39*$L$16*0.1,\"--\")","v":"--"},{"$f":"IF(N39=\"RR\",ROUND(M39/60,2)*I39*$L$16*0.1*O39/100,\"--\")","v":"--"},{"$f":"IF(F39=\"\",\"\",\"SI\")","v":""},{"$f":"IF(F39=\"\",\"\",SUM(P39:Y39)*IF(Z39=\"SI\",1,2))","v":""}]
[null,null,null,null,null,null,null,null,128.55099999999999,null,null,{"$f":"IF(F40=\"\",\"\",(K40-J40)*24)","v":""},{"$f":"IF(F40=\"\",\"\",ROUND((K40-J40)*24*60,0))","v":""},null,{"$f":"IF(F40=\"\",\"\",\"--\")","v":""},{"$f":"IF(N40=\"P\",ROUND(M40/60,2)*I40*$L$16*0.01,\"--\")","v":"--"},{"$f":"IF(N40=\"RP\",I40*O40*ROUND(L40/60,2)*0.01*M40/100,\"--\")","v":"--"},{"$f":"IF(N40=\"F\",I40*$L$16,\"--\")","v":"--"},{"$f":"IF(AND(M40>10,N40=\"F\"),I40*$L$16*IF(M40>180,3,ROUND((M40)/60,2)),\"--\")","v":"--"},{"$f":"IF(AND(M40>180,N40=\"F\"),(ROUND(M40/60,2)-3)*I40*$L$16*0.1,\"--\")","v":"--"},{"$f":"IF(N40=\"R\",I40*$L$16*O40/100,\"--\")","v":"--"},{"$f":"IF(AND(M40>10,N40=\"R\"),I40*$L$16*O40/100*IF(M40>180,3,ROUND(M40/60,2)),\"--\")","v":"--"},{"$f":"IF(AND(M40>180,N40=\"R\"),(ROUND(M40/60,2)-3)*I40*$L$16*0.1*O40/100,\"--\")","v":"--"},{"$f":"IF(N40=\"RF\",ROUND(M40/60,2)*I40*$L$16*0.1,\"--\")","v":"--"},{"$f":"IF(N40=\"RR\",ROUND(M40/60,2)*I40*$L$16*0.1*O40/100,\"--\")","v":"--"},{"$f":"IF(F40=\"\",\"\",\"SI\")","v":""},{"$f":"IF(F40=\"\",\"\",SUM(P40:Y40)*IF(Z40=\"SI\",1,2))","v":""}]
[]
[null,null,"(²)","P - PROGRAMADA  ; F - FORZADA",null,null,null,null,null,null,null,null,null,null,null,{"$f":"SUM(P19:P41)","v":6869.8698234120002},0,153952.6776,114611.44376400001,65047.011681600001,0,0,0,0,0,null,{"$f":"ROUND(SUM(AA19:AA41),2)","v":506370.41}]

{"sheet":"T-11 (1)","index":3,"n_rows":47,"n_cols":29,"rows_kept":47,"cut":false,"hidden":false,"merged":[]}
[]
[null,{"$f":"+'TOT-1115'!B2","v":"ANEXO II  al Memorandum  D.T.E.E. N°      356     / 2017"}]
[]
[" ENTE NACIONAL REGULADOR "]
["        DE LA ELECTRICIDAD"]
[]
[]
[null,null,null,null,null,"SISTEMA DE TRANSPORTE DE ENERGÍA ELÉCTRICA POR DISTRIBUCIÓN TRONCAL - TRANSNOA S.A."]
[]
[null,null,null,null,null,"2.- CONEXIÓN"]
[]
[null,null,null,null,null,"2.1.- Transformación"]
[]
[null,null,null,null,null,"2.1.1.- Equipamiento propio"]
[]
[null,{"$f":"'TOT-1115'!B14","v":"Desde el 01 al 30 de noviembre de 2015"}]
[]
[null,null,null,null,null,"Por Transformador por MVA    $ =",null,null,1.79,null,0.67469999999999997,"Res. SE 1/03"]
[null,null,null,null,null,"Coeficiente de penalización por salida forzada   =",null,null,{"$f":"30*'TOT-1115'!B13","v":30},null,{"$f":"IF(I19=30,\" \",IF(I19=60,\"  Coeficiente duplicado por tasa de falla >4 Sal. x año/100 km.\",\"REVISAR COEFICIENTE\"))","v":" "}]
[null,null,3,4,5,6,7,8,9,10,11,12,13,14,15,16,17,18,19,20,21,22,23,24,25,26,27,28,29]
[null,null,"N°","INDISP","ID EQUIPO","ESTACIÓN\nTRANSFORMADORA","EQUIPO","POT.\n[MVA]","U\n[kV]","$/h","Salida","Entrada","Hs\nIndisp.","Mtos.\nIndisp.","Tipo \nSal.(²)","AUT.","C.R.\n%","E.N.S.","K (P;ENS)","PENALIZ.\nPROGRAM.","REDUCC.\nPROGRAM.","PENALIZAC. FORZADA\nPor Salida       hs. Restantes",null,"REDUCC. FORZADA\nPor Salida       hs. Restantes",null,"RESTANTE\nFORZADA","REDUCC.\nRESTANTE","Informó\nen Térm.","TOTAL\nPENALIZAC."]
[]
[null,null,35,291078,4228,"SUNCHO CORRAL","TRAFO 2",15,"132/33/13,2",{"$f":"H23*$I$18","v":26.85},"2015-11-01","2015-11-30T23:59:59",{"$f":"IF(F23=\"\",\"\",(L23-K23)*24)","v":719.99972222215729},{"$f":"IF(F23=\"\",\"\",ROUND((L23-K23)*24*60,0))","v":43200},"P",{"$f":"IF(F23=\"\",\"\",IF(OR(O23=\"P\",O23=\"RP\"),\"--\",\"NO\"))","v":"--"},"0,000","NO",{"$f":"$I$19*IF(R23=\"SI\",1,0.1)*IF(OR(O23=\"P\",O23=\"RP\"),0.1,1)","v":0.30000000000000004},{"$f":"IF(O23=\"P\",J23*S23*ROUND(N23/60,2),\"--\")","v":5799.6000000000013},{"$f":"IF(O23=\"RP\",J23*S23*Q23/100*ROUND(N23/60,2),\"--\")","v":"--"},{"$f":"IF(AND(O23=\"F\",P23=\"NO\"),J23*S23,\"--\")","v":"--"},{"$f":"IF(O23=\"F\",J23*S23*ROUND(N23/60,2),\"--\")","v":"--"},{"$f":"IF(AND(O23=\"R\",P23=\"NO\"),J23*S23*Q23/100,\"--\")","v":"--"},{"$f":"IF(O23=\"R\",J23*S23*ROUND(N23/60,2)*Q23/100,\"--\")","v":"--"},{"$f":"IF(O23=\"RF\",J23*S23*ROUND(N23/60,2),\"--\")","v":"--"},{"$f":"IF(O23=\"RR\",J23*S23*ROUND(N23/60,2)*Q23/100,\"--\")","v":"--"},"SI",{"$f":"IF(F23=\"\",\"\",SUM(T23:AA23)*IF(AB23=\"SI\",1,2))","v":5799.6000000000013}]
[null,null,36,291878,562,"METAN","TRAFO 1",7.5,"132/33/13,2",{"$f":"H24*$I$18","v":13.425000000000001},"2015-11-01","2015-11-30T23:59:59",{"$f":"IF(F24=\"\",\"\",(L24-K24)*24)","v":719.99972222215729},{"$f":"IF(F24=\"\",\"\",ROUND((L24-K24)*24*60,0))","v":43200},"P",{"$f":"IF(F24=\"\",\"\",IF(OR(O24=\"P\",O24=\"RP\"),\"--\",\"NO\"))","v":"--"},"0,000","NO",{"$f":"$I$19*IF(R24=\"SI\",1,0.1)*IF(OR(O24=\"P\",O24=\"RP\"),0.1,1)","v":0.30000000000000004},{"$f":"IF(O24=\"P\",J24*S24*ROUND(N24/60,2),\"--\")","v":2899.8000000000006},{"$f":"IF(O24=\"RP\",J24*S24*Q24/100*ROUND(N24/60,2),\"--\")","v":"--"},{"$f":"IF(AND(O24=\"F\",P24=\"NO\"),J24*S24,\"--\")","v":"--"},{"$f":"IF(O24=\"F\",J24*S24*ROUND(N24/60,2),\"--\")","v":"--"},{"$f":"IF(AND(O24=\"R\",P24=\"NO\"),J24*S24*Q24/100,\"--\")","v":"--"},{"$f":"IF(O24=\"R\",J24*S24*ROUND(N24/60,2)*Q24/100,\"--\")","v":"--"},{"$f":"IF(O24=\"RF\",J24*S24*ROUND(N24/60,2),\"--\")","v":"--"},{"$f":"IF(O24=\"RR\",J24*S24*ROUND(N24/60,2)*Q24/100,\"--\")","v":"--"},"SI",{"$f":"IF(F24=\"\",\"\",SUM(T24:AA24)*IF(AB24=\"SI\",1,2))","v":2899.8000000000006}]
[null,null,37,294228,3581,"ANDALGALA","TRAFO 2",15,"132/33/13,2",{"$f":"H25*$I$18","v":26.85},"2015-11-05T00:05:00","2015-11-30T23:59:59",{"$f":"IF(F25=\"\",\"\",(L25-K25)*24)","v":623.91638888890157},{"$f":"IF(F25=\"\",\"\",ROUND((L25-K25)*24*60,0))","v":37435},"P",{"$f":"IF(F25=\"\",\"\",IF(OR(O25=\"P\",O25=\"RP\"),\"--\",\"NO\"))","v":"--"},"0,000","NO",{"$f":"$I$19*IF(R25=\"SI\",1,0.1)*IF(OR(O25=\"P\",O25=\"RP\"),0.1,1)","v":0.30000000000000004},{"$f":"IF(O25=\"P\",J25*S25*ROUND(N25/60,2),\"--\")","v":5025.6756000000005},{"$f":"IF(O25=\"RP\",J25*S25*Q25/100*ROUND(N25/60,2),\"--\")","v":"--"},{"$f":"IF(AND(O25=\"F\",P25=\"NO\"),J25*S25,\"--\")","v":"--"},{"$f":"IF(O25=\"F\",J25*S25*ROUND(N25/60,2),\"--\")","v":"--"},{"$f":"IF(AND(O25=\"R\",P25=\"NO\"),J25*S25*Q25/100,\"--\")","v":"--"},{"$f":"IF(O25=\"R\",J25*S25*ROUND(N25/60,2)*Q25/100,\"--\")","v":"--"},{"$f":"IF(O25=\"RF\",J25*S25*ROUND(N25/60,2),\"--\")","v":"--"},{"$f":"IF(O25=\"RR\",J25*S25*ROUND(N25/60,2)*Q25/100,\"--\")","v":"--"},"SI",{"$f":"IF(F25=\"\",\"\",SUM(T25:AA25)*IF(AB25=\"SI\",1,2))","v":5025.6756000000005}]
[null,null,38,294005,4993,"PALPALA ","TRAFO 2",15,"132/33/13,2",{"$f":"H26*$I$18","v":26.85},"2015-11-01","2015-11-02T15:36:00",{"$f":"IF(F26=\"\",\"\",(L26-K26)*24)","v":39.600000000034925},{"$f":"IF(F26=\"\",\"\",ROUND((L26-K26)*24*60,0))","v":2376},"P",{"$f":"IF(F26=\"\",\"\",IF(OR(O26=\"P\",O26=\"RP\"),\"--\",\"NO\"))","v":"--"},"0,000","NO",{"$f":"$I$19*IF(R26=\"SI\",1,0.1)*IF(OR(O26=\"P\",O26=\"RP\"),0.1,1)","v":0.30000000000000004},{"$f":"IF(O26=\"P\",J26*S26*ROUND(N26/60,2),\"--\")","v":318.97800000000007},{"$f":"IF(O26=\"RP\",J26*S26*Q26/100*ROUND(N26/60,2),\"--\")","v":"--"},{"$f":"IF(AND(O26=\"F\",P26=\"NO\"),J26*S26,\"--\")","v":"--"},{"$f":"IF(O26=\"F\",J26*S26*ROUND(N26/60,2),\"--\")","v":"--"},{"$f":"IF(AND(O26=\"R\",P26=\"NO\"),J26*S26*Q26/100,\"--\")","v":"--"},{"$f":"IF(O26=\"R\",J26*S26*ROUND(N26/60,2)*Q26/100,\"--\")","v":"--"},{"$f":"IF(O26=\"RF\",J26*S26*ROUND(N26/60,2),\"--\")","v":"--"},{"$f":"IF(O26=\"RR\",J26*S26*ROUND(N26/60,2)*Q26/100,\"--\")","v":"--"},"SI",{"$f":"IF(F26=\"\",\"\",SUM(T26:AA26)*IF(AB26=\"SI\",1,2))","v":318.97800000000007}]
[null,null,39,294021,565,"PALPALA ","TRAFO 1",30,"132/33/13,2",{"$f":"H27*$I$18","v":53.7},"2015-11-01T07:25:00","2015-11-01T13:52:00",{"$f":"IF(F27=\"\",\"\",(L27-K27)*24)","v":6.4499999998952262},{"$f":"IF(F27=\"\",\"\",ROUND((L27-K27)*24*60,0))","v":387},"P",{"$f":"IF(F27=\"\",\"\",IF(OR(O27=\"P\",O27=\"RP\"),\"--\",\"NO\"))","v":"--"},"0,000","NO",{"$f":"$I$19*IF(R27=\"SI\",1,0.1)*IF(OR(O27=\"P\",O27=\"RP\"),0.1,1)","v":0.30000000000000004},{"$f":"IF(O27=\"P\",J27*S27*ROUND(N27/60,2),\"--\")","v":103.90950000000002},{"$f":"IF(O27=\"RP\",J27*S27*Q27/100*ROUND(N27/60,2),\"--\")","v":"--"},{"$f":"IF(AND(O27=\"F\",P27=\"NO\"),J27*S27,\"--\")","v":"--"},{"$f":"IF(O27=\"F\",J27*S27*ROUND(N27/60,2),\"--\")","v":"--"},{"$f":"IF(AND(O27=\"R\",P27=\"NO\"),J27*S27*Q27/100,\"--\")","v":"--"},{"$f":"IF(O27=\"R\",J27*S27*ROUND(N27/60,2)*Q27/100,\"--\")","v":"--"},{"$f":"IF(O27=\"RF\",J27*S27*ROUND(N27/60,2),\"--\")","v":"--"},{"$f":"IF(O27=\"RR\",J27*S27*ROUND(N27/60,2)*Q27/100,\"--\")","v":"--"},"SI",{"$f":"IF(F27=\"\",\"\",SUM(T27:AA27)*IF(AB27=\"SI\",1,2))","v":103.90950000000002}]
[null,null,40,294045,5333,"COPO","TRAFO 2",15,"132/33/13,2",26.85,"2015-11-01T23:36:00","2015-11-01T23:55:00",0.31666666682576761,19,"F","NO","0,000","SI",30,"--","--",805.5,257.76,"--","--","--","--","SI",1063.26]
[null,null,41,294046,5333,"COPO","TRAFO 2",15,"132/33/13,2",26.85,"2015-11-01T23:56:00","2015-11-02T07:39:00",7.7166666666744277,463,"F","NO","0,000","NO",3,"--","--",80.550000000000011,621.84600000000012,"--","--","--","--","SI",702.39600000000019]
[null,null,42,294237,3618,"TINOGASTA","TRAFO 1",7.5,"132/33/13,2",13.425000000000001,"2015-11-03T19:58:00","2015-11-03T21:04:00",1.1000000000931323,66,"F","NO","0,000","SI",30,"--","--",402.75,443.02500000000003,"--","--","--","--","SI",845.77500000000009]
[null,null,43,294238,3619,"TINOGASTA","TRAFO 2",7.5,"132/33/13,2",13.425000000000001,"2015-11-03T20:02:00","2015-11-03T21:05:00",1.0499999999301508,63,"F","NO","0,000","SI",30,"--","--",402.75,422.88750000000005,"--","--","--","--","SI",825.63750000000005]
[null,null,44,294289,5446,"CHAMICAL","TRAFO 1",30,"132/33/13,2",53.7,"2015-11-04T03:19:00","2015-11-04T04:36:00",1.2833333333255723,77,"R","NO",40,"SI",30,"--","--","--","--",644.4,824.83199999999999,"--","--","SI",1469.232]
[null,null,45,294292,5446,"CHAMICAL","TRAFO 1",30,"132/33/13,2",53.7,"2015-11-04T04:37:00","2015-11-04T13:28:00",8.8500000000349246,531,"R","NO",40,"NO",3,"--","--","--","--",64.440000000000012,570.2940000000001,"--","--","SI",634.73400000000015]
[null,null,46,294295,4062,"JUJUY SUR ","TRAFO 2",30,"132/33/13,2",53.7,"2015-11-04T17:26:00","2015-11-04T17:32:00",9.9999999976716936E-2,6,"R","NO",60,"SI",30,"--","--","--","--",966.6,96.660000000000025,"--","--","SI",1063.26]
[null,null,47,294304,4062,"JUJUY SUR ","TRAFO 2",30,"132/33/13,2",53.7,"2015-11-04T17:44:00","2015-11-04T17:50:00",9.9999999976716936E-2,6,"F","NO","0,000","SI",30,"--","--",1611,161.10000000000002,"--","--","--","--","SI",1772.1]
[null,null,48,294315,5453,"CIRCUNVALACIÓN","TRAFO 1",30,"132/33/13,2",53.7,"2015-11-04T18:35:00","2015-11-04T19:14:00",0.65000000002328306,39,"R","NO",40,"SI",30,"--","--","--","--",644.4,418.86,"--","--","SI",1063.26]
[null,null,49,294229,4517,"CATAMARCA II","TRAFO 2 (Res. SE 1/03)",30,"132/33/13,2",{"$f":"H37*$K$18","v":20.241},"2015-11-05T08:35:00","2015-11-05T18:05:00",9.4999999998835847,570,"RP","--",40,"NO",0.30000000000000004,"--",23.074740000000006,"--","--","--","--","--","--","SI",23.074740000000006]
[null,null,50,294318,4575,"LA RIOJA","TRAFO 1",30,"132/33/13,2",53.7,"2015-11-05T23:10:00","2015-11-06T02:02:00",2.8666666665812954,172,"R","NO",60,"SI",30,"--","--","--","--",966.6,2774.1420000000003,"--","--","SI",3740.7420000000002]
[null,null,51,294331,5446,"CHAMICAL","TRAFO 1",30,"132/33/13,2",53.7,"2015-11-06T12:08:00","2015-11-06T13:47:00",1.6499999999650754,99,"R","NO",40,"SI",30,"--","--","--","--",644.4,1063.2599999999998,"--","--","SI",1707.6599999999999]
[null,null,52,294230,5266,"TUCUMAN OESTE","TRAFO 3",30,"132/33/13,2",53.7,"2015-11-08T08:03:00","2015-11-08T15:37:00",7.5666666665347293,454,"P","--","0,000","NO",0.30000000000000004,121.95270000000002,"--","--","--","--","--","--","--","SI",121.95270000000002]
[null,null,53,294231,2742,"TUCUMAN OESTE ","TRAFO 2",30,"132/33/13,2",53.7,"2015-11-08T08:10:00","2015-11-08T15:34:00",7.3999999998486601,444,"P","--","0,000","NO",0.30000000000000004,119.21400000000003,"--","--","--","--","--","--","--","SI",119.21400000000003]
[null,null,54,294232,2731,"TUCUMAN OESTE","TRAFO 1",30,"132/13,2",53.7,"2015-11-08T08:13:00","2015-11-08T15:09:00",6.9333333332324401,416,"P","--","0,000","NO",0.30000000000000004,111.64230000000002,"--","--","--","--","--","--","--","SI",111.64230000000002]
[null,null,55,294233,4962,"TUCUMAN NORTE","TRAFO 3",30,"132/33/13,2",53.7,"2015-11-08T08:13:00","2015-11-08T15:07:00",{"$f":"IF(F43=\"\",\"\",(L43-K43)*24)","v":6.8999999999650754},{"$f":"IF(F43=\"\",\"\",ROUND((L43-K43)*24*60,0))","v":414},"P","--","0,000","NO",{"$f":"$I$19*IF(R43=\"SI\",1,0.1)*IF(OR(O43=\"P\",O43=\"RP\"),0.1,1)","v":0.30000000000000004},{"$f":"IF(O43=\"P\",J43*S43*ROUND(N43/60,2),\"--\")","v":111.15900000000002},{"$f":"IF(O43=\"RP\",J43*S43*Q43/100*ROUND(N43/60,2),\"--\")","v":"--"},{"$f":"IF(AND(O43=\"F\",P43=\"NO\"),J43*S43,\"--\")","v":"--"},{"$f":"IF(O43=\"F\",J43*S43*ROUND(N43/60,2),\"--\")","v":"--"},{"$f":"IF(AND(O43=\"R\",P43=\"NO\"),J43*S43*Q43/100,\"--\")","v":"--"},{"$f":"IF(O43=\"R\",J43*S43*ROUND(N43/60,2)*Q43/100,\"--\")","v":"--"},{"$f":"IF(O43=\"RF\",J43*S43*ROUND(N43/60,2),\"--\")","v":"--"},{"$f":"IF(O43=\"RR\",J43*S43*ROUND(N43/60,2)*Q43/100,\"--\")","v":"--"},"SI",{"$f":"IF(F43=\"\",\"\",SUM(T43:AA43)*IF(AB43=\"SI\",1,2))","v":111.15900000000002}]
[null,null,56,294422,5410,"TERMAS NORTE","TRAFO 1",15,"132/33/13,2",26.85,"2015-11-09T20:12:00","2015-11-09T20:46:00",{"$f":"IF(F44=\"\",\"\",(L44-K44)*24)","v":0.56666666659293696},{"$f":"IF(F44=\"\",\"\",ROUND((L44-K44)*24*60,0))","v":34},"R","NO",60,"SI",{"$f":"$I$19*IF(R44=\"SI\",1,0.1)*IF(OR(O44=\"P\",O44=\"RP\"),0.1,1)","v":30},{"$f":"IF(O44=\"P\",J44*S44*ROUND(N44/60,2),\"--\")","v":"--"},{"$f":"IF(O44=\"RP\",J44*S44*Q44/100*ROUND(N44/60,2),\"--\")","v":"--"},{"$f":"IF(AND(O44=\"F\",P44=\"NO\"),J44*S44,\"--\")","v":"--"},{"$f":"IF(O44=\"F\",J44*S44*ROUND(N44/60,2),\"--\")","v":"--"},{"$f":"IF(AND(O44=\"R\",P44=\"NO\"),J44*S44*Q44/100,\"--\")","v":483.3},{"$f":"IF(O44=\"R\",J44*S44*ROUND(N44/60,2)*Q44/100,\"--\")","v":275.48099999999994},{"$f":"IF(O44=\"RF\",J44*S44*ROUND(N44/60,2),\"--\")","v":"--"},{"$f":"IF(O44=\"RR\",J44*S44*ROUND(N44/60,2)*Q44/100,\"--\")","v":"--"},"SI",{"$f":"IF(F44=\"\",\"\",SUM(T44:AA44)*IF(AB44=\"SI\",1,2))","v":758.78099999999995}]
[null,null,57,294423,3580,"ANDALGALA","TRAFO 1",15,"132/33/13,2",26.85,"2015-11-09T21:13:00","2015-11-09T23:03:00",{"$f":"IF(F45=\"\",\"\",(L45-K45)*24)","v":1.8333333333721384},{"$f":"IF(F45=\"\",\"\",ROUND((L45-K45)*24*60,0))","v":110},"F","NO","0,000","SI",{"$f":"$I$19*IF(R45=\"SI\",1,0.1)*IF(OR(O45=\"P\",O45=\"RP\"),0.1,1)","v":30},{"$f":"IF(O45=\"P\",J45*S45*ROUND(N45/60,2),\"--\")","v":"--"},{"$f":"IF(O45=\"RP\",J45*S45*Q45/100*ROUND(N45/60,2),\"--\")","v":"--"},{"$f":"IF(AND(O45=\"F\",P45=\"NO\"),J45*S45,\"--\")","v":805.5},{"$f":"IF(O45=\"F\",J45*S45*ROUND(N45/60,2),\"--\")","v":1474.0650000000001},{"$f":"IF(AND(O45=\"R\",P45=\"NO\"),J45*S45*Q45/100,\"--\")","v":"--"},{"$f":"IF(O45=\"R\",J45*S45*ROUND(N45/60,2)*Q45/100,\"--\")","v":"--"},{"$f":"IF(O45=\"RF\",J45*S45*ROUND(N45/60,2),\"--\")","v":"--"},{"$f":"IF(O45=\"RR\",J45*S45*ROUND(N45/60,2)*Q45/100,\"--\")","v":"--"},"SI",{"$f":"IF(F45=\"\",\"\",SUM(T45:AA45)*IF(AB45=\"SI\",1,2))","v":2279.5650000000001}]
[]
[null,null,"(²)","P - PROGRAMADA  ; F - FORZADA   ; R - REDUCCIÓN FORZADA  ; RP - REDUCCIÓN PROGRAMADA",null,null,null,null,null,null,null,null,null,null,null,null,null,null,null,{"$f":"SUM(T22:T46)","v":14611.931100000002},23.074740000000006,4108.05,3380.6835000000001,4414.1400000000003,6023.5290000000005,0,0,null,{"$f":"ROUND(SUM(AC22:AC46),2)","v":32561.41}]

{"sheet":"T-11 (2)","index":4,"n_rows":45,"n_cols":29,"rows_kept":45,"cut":false,"hidden":false,"merged":[]}
[]
[null,{"$f":"+'TOT-1115'!B2","v":"ANEXO II  al Memorandum  D.T.E.E. N°      356     / 2017"}]
[]
[" ENTE NACIONAL REGULADOR "]
["       DE LA ELECTRICIDAD"]
[]
[]
[null,null,null,null,null,"SISTEMA DE TRANSPORTE DE ENERGÍA ELÉCTRICA POR DISTRIBUCIÓN TRONCAL - TRANSNOA S.A."]
[]
[null,null,null,null,null,"2.- CONEXIÓN"]
[]
[null,null,null,null,null,"2.1.- Transformación"]
[]
[null,null,null,null,null,"2.1.1.- Equipamiento propio"]
[]
[null,{"$f":"'TOT-1115'!B14","v":"Desde el 01 al 30 de noviembre de 2015"}]
[]
[null,null,null,null,null,"Por Transformador por MVA    $ =",null,null,1.79]
[null,null,null,null,null,"Coeficiente de penalización por salida forzada   =",null,null,{"$f":"30*'TOT-1115'!B13","v":30},null,{"$f":"IF(I19=30,\" \",IF(I19=60,\"  Coeficiente duplicado por tasa de falla >4 Sal. x año/100 km.\",\"REVISAR COEFICIENTE\"))","v":" "}]
[null,null,3,4,5,6,7,8,9,10,11,12,13,14,15,16,17,18,19,20,21,22,23,24,25,26,27,28,29]
[null,null,"N°","INDISP","ID EQUIPO","ESTACIÓN\nTRANSFORMADORA","EQUIPO","POT.\n[MVA]","U\n[kV]","$/h","Salida","Entrada","Hs\nIndisp.","Mtos.\nIndisp.","Tipo \nSal.(²)","AUT.","C.R.\n%","E.N.S.","K (P;ENS)","PENALIZ.\nPROGRAM.","REDUCC.\nPROGRAM.","PENALIZAC. FORZADA\nPor Salida       hs. Restantes",null,"REDUCC. FORZADA\nPor Salida       hs. Restantes",null,"RESTANTE\nFORZADA","REDUCC.\nRESTANTE","Informó\nen Térm.","TOTAL\nPENALIZAC."]
[null,null,null,null,null,null,null,null,null,null,null,null,null,null,null,null,null,null,null,null,null,null,null,null,null,null,null,null,{"$f":"'T-11 (1)'!AC47","v":32561.41}]
[]
[null,null,58,294428,3580,"ANDALGALA","TRAFO 1",15,"132/33/13,2",{"$f":"H24*$I$18","v":26.85},"2015-11-09T23:04:00","2015-11-10T15:15:00",{"$f":"IF(F24=\"\",\"\",(L24-K24)*24)","v":16.183333333348855},{"$f":"IF(F24=\"\",\"\",ROUND((L24-K24)*24*60,0))","v":971},"R",{"$f":"IF(F24=\"\",\"\",IF(OR(O24=\"P\",O24=\"RP\"),\"--\",\"NO\"))","v":"NO"},60,"NO",{"$f":"$I$19*IF(R24=\"SI\",1,0.1)*IF(OR(O24=\"P\",O24=\"RP\"),0.1,1)","v":3},{"$f":"IF(O24=\"P\",J24*S24*ROUND(N24/60,2),\"--\")","v":"--"},{"$f":"IF(O24=\"RP\",J24*S24*Q24/100*ROUND(N24/60,2),\"--\")","v":"--"},{"$f":"IF(AND(O24=\"F\",P24=\"NO\"),J24*S24,\"--\")","v":"--"},{"$f":"IF(O24=\"F\",J24*S24*ROUND(N24/60,2),\"--\")","v":"--"},{"$f":"IF(AND(O24=\"R\",P24=\"NO\"),J24*S24*Q24/100,\"--\")","v":48.330000000000013},{"$f":"IF(O24=\"R\",J24*S24*ROUND(N24/60,2)*Q24/100,\"--\")","v":781.97940000000017},{"$f":"IF(O24=\"RF\",J24*S24*ROUND(N24/60,2),\"--\")","v":"--"},{"$f":"IF(O24=\"RR\",J24*S24*ROUND(N24/60,2)*Q24/100,\"--\")","v":"--"},"SI",{"$f":"IF(F24=\"\",\"\",SUM(T24:AA24)*IF(AB24=\"SI\",1,2))","v":830.30940000000021}]
[null,null,59,294429,5339,"LA BANDA ESTE","TRAFO 2",30,"132/33/13,2",{"$f":"H25*$I$18","v":53.7},"2015-11-10T08:26:00","2015-11-10T14:38:00",{"$f":"IF(F25=\"\",\"\",(L25-K25)*24)","v":6.1999999999534339},{"$f":"IF(F25=\"\",\"\",ROUND((L25-K25)*24*60,0))","v":372},"P",{"$f":"IF(F25=\"\",\"\",IF(OR(O25=\"P\",O25=\"RP\"),\"--\",\"NO\"))","v":"--"},"0,000","NO",{"$f":"$I$19*IF(R25=\"SI\",1,0.1)*IF(OR(O25=\"P\",O25=\"RP\"),0.1,1)","v":0.30000000000000004},{"$f":"IF(O25=\"P\",J25*S25*ROUND(N25/60,2),\"--\")","v":99.882000000000019},{"$f":"IF(O25=\"RP\",J25*S25*Q25/100*ROUND(N25/60,2),\"--\")","v":"--"},{"$f":"IF(AND(O25=\"F\",P25=\"NO\"),J25*S25,\"--\")","v":"--"},{"$f":"IF(O25=\"F\",J25*S25*ROUND(N25/60,2),\"--\")","v":"--"},{"$f":"IF(AND(O25=\"R\",P25=\"NO\"),J25*S25*Q25/100,\"--\")","v":"--"},{"$f":"IF(O25=\"R\",J25*S25*ROUND(N25/60,2)*Q25/100,\"--\")","v":"--"},{"$f":"IF(O25=\"RF\",J25*S25*ROUND(N25/60,2),\"--\")","v":"--"},{"$f":"IF(O25=\"RR\",J25*S25*ROUND(N25/60,2)*Q25/100,\"--\")","v":"--"},"SI",{"$f":"IF(F25=\"\",\"\",SUM(T25:AA25)*IF(AB25=\"SI\",1,2))","v":99.882000000000019}]
[null,null,60,294455,5584,"FERNANDEZ","TRAFO 1",15,"132/33/13,2",26.85,"2015-11-11T08:23:00","2015-11-11T11:56:00",3.5499999998719431,213,"P","--","0,000","NO",0.30000000000000004,28.595250000000004,"--","--","--","--","--","--","--","SI",28.595250000000004]
[null,null,61,294458,5339,"LA BANDA ESTE","TRAFO 2",30,"132/33/13,2",53.7,"2015-11-12T08:31:00","2015-11-12T15:02:00",6.5166666666045785,391,"RP","--",40,"NO",0.30000000000000004,"--",42.014880000000005,"--","--","--","--","--","--","SI",42.014880000000005]
[null,null,62,294459,5338,"LA BANDA ESTE","TRAFO 1",30,"132/33/13,2",53.7,"2015-11-13T08:35:00","2015-11-16T14:24:00",77.816666666592937,4669,"P","--","0,000","NO",0.30000000000000004,1253.6802,"--","--","--","--","--","--","--","SI",1253.6802]
[null,null,63,294464,5410,"TERMAS NORTE","TRAFO 1",15,"132/33/13,2",26.85,"2015-11-13T10:38:00","2015-11-13T10:43:00",8.3333333255723119E-2,5,"R","NO",60,"SI",30,"--","--","--","--",483.3,38.663999999999994,"--","--","SI",521.96400000000006]
[null,null,64,294476,4575,"LA RIOJA","TRAFO 1",30,"132/33/13,2",53.7,"2015-11-15T05:04:00","2015-11-15T10:00:00",4.9333333333488554,296,"P","--","0,000","NO",0.30000000000000004,79.422300000000007,"--","--","--","--","--","--","--","SI",79.422300000000007]
[null,null,65,294759,3618,"TINOGASTA","TRAFO 1",7.5,"132/33/13,2",13.425000000000001,"2015-11-16T00:13:00","2015-11-16T03:00:00",2.7833333333255723,167,"P","--","0,000","NO",0.30000000000000004,11.19645,"--","--","--","--","--","--","--","SI",11.19645]
[null,null,66,294760,3619,"TINOGASTA","TRAFO 2",7.5,"132/33/13,2",13.425000000000001,"2015-11-16T02:54:00","2015-11-16T05:12:00",2.2999999999883585,138,"P","--","0,000","NO",0.30000000000000004,9.2632500000000011,"--","--","--","--","--","--","--","SI",9.2632500000000011]
[null,null,67,294764,4897,"BANDERA","TRAFO 2",15,"132/33/13,2",26.85,"2015-11-16T11:31:00","2015-11-16T11:36:00",8.3333333255723119E-2,5,"R","NO",60,"SI",30,"--","--","--","--",483.3,38.663999999999994,"--","--","SI",521.96400000000006]
[null,null,68,294766,5338,"LA BANDA ESTE","TRAFO 1",30,"132/33/13,2",53.7,"2015-11-17T00:01:00","2015-11-17T09:34:00",9.5499999998719431,573,"RP","--",40,"NO",0.30000000000000004,"--",61.540200000000013,"--","--","--","--","--","--","SI",61.540200000000013]
[null,null,69,294769,5584,"FERNANDEZ","TRAFO 1",15,"132/33/13,2",26.85,"2015-11-17T21:32:00","2015-11-17T22:13:00",0.68333333329064772,41,"F","NO","0,000","SI",30,"--","--",805.5,547.74,"--","--","--","--","SI",1353.24]
[null,null,70,294771,3819,"BELEN","TRAFO 2",7.5,"132/33/13,2",13.425000000000001,"2015-11-18T07:43:00","2015-11-21T10:34:00",74.850000000034925,4491,"P","--","0,000","NO",0.30000000000000004,301.45837500000005,"--","--","--","--","--","--","--","SI",301.45837500000005]
[null,null,71,294772,4062,"JUJUY SUR ","TRAFO 2",30,"132/33/13,2",53.7,"2015-11-18T08:13:00","2015-11-18T12:38:00",4.4166666665696539,265,"P","--","0,000","NO",0.30000000000000004,71.20620000000001,"--","--","--","--","--","--","--","SI",71.20620000000001]
[null,null,72,294774,4897,"BANDERA","TRAFO 2",15,"132/33/13,2",26.85,"2015-11-18T11:06:00","2015-11-18T14:55:00",3.8166666667093523,229,"P","--","0,000","NO",0.30000000000000004,30.770100000000003,"--","--","--","--","--","--","--","SI",30.770100000000003]
[null,null,73,294781,5453,"CIRCUNVALACIÓN","TRAFO 1",30,"132/33/13,2",53.7,"2015-11-19T16:36:00","2015-11-19T20:12:00",3.6000000000349246,216,"F","NO","0,000","SI",30,"--","--",1611,5799.6,"--","--","--","--","SI",7410.6]
[null,null,74,294783,5454,"CIRCUNVALACIÓN","TRAFO 2",30,"132/33/13,2",53.7,"2015-11-19T16:36:00","2015-11-19T20:12:00",3.6000000000349246,216,"F","NO","0,000","SI",30,"--","--",1611,5799.6,"--","--","--","--","SI",7410.6]
[null,null,75,294785,5268,"INDEPEND.-TUCUMAN","TRAFO 3",30,"132/33/13,2",53.7,"2015-11-20T09:17:00","2015-11-20T11:00:00",{"$f":"IF(F41=\"\",\"\",(L41-K41)*24)","v":1.7166666666744277},{"$f":"IF(F41=\"\",\"\",ROUND((L41-K41)*24*60,0))","v":103},"P","--","0,000","NO",{"$f":"$I$19*IF(R41=\"SI\",1,0.1)*IF(OR(O41=\"P\",O41=\"RP\"),0.1,1)","v":0.30000000000000004},{"$f":"IF(O41=\"P\",J41*S41*ROUND(N41/60,2),\"--\")","v":27.709200000000006},{"$f":"IF(O41=\"RP\",J41*S41*Q41/100*ROUND(N41/60,2),\"--\")","v":"--"},{"$f":"IF(AND(O41=\"F\",P41=\"NO\"),J41*S41,\"--\")","v":"--"},{"$f":"IF(O41=\"F\",J41*S41*ROUND(N41/60,2),\"--\")","v":"--"},{"$f":"IF(AND(O41=\"R\",P41=\"NO\"),J41*S41*Q41/100,\"--\")","v":"--"},{"$f":"IF(O41=\"R\",J41*S41*ROUND(N41/60,2)*Q41/100,\"--\")","v":"--"},{"$f":"IF(O41=\"RF\",J41*S41*ROUND(N41/60,2),\"--\")","v":"--"},{"$f":"IF(O41=\"RR\",J41*S41*ROUND(N41/60,2)*Q41/100,\"--\")","v":"--"},"SI",{"$f":"IF(F41=\"\",\"\",SUM(T41:AA41)*IF(AB41=\"SI\",1,2))","v":27.709200000000006}]
[null,null,76,295034,5605,"DRAGONES","TRAFO 1",15,"132/33/13,2",26.85,"2015-11-24T09:15:00","2015-11-24T17:20:00",{"$f":"IF(F42=\"\",\"\",(L42-K42)*24)","v":8.0833333333139308},{"$f":"IF(F42=\"\",\"\",ROUND((L42-K42)*24*60,0))","v":485},"P","--","0,000","NO",{"$f":"$I$19*IF(R42=\"SI\",1,0.1)*IF(OR(O42=\"P\",O42=\"RP\"),0.1,1)","v":0.30000000000000004},{"$f":"IF(O42=\"P\",J42*S42*ROUND(N42/60,2),\"--\")","v":65.084400000000016},{"$f":"IF(O42=\"RP\",J42*S42*Q42/100*ROUND(N42/60,2),\"--\")","v":"--"},{"$f":"IF(AND(O42=\"F\",P42=\"NO\"),J42*S42,\"--\")","v":"--"},{"$f":"IF(O42=\"F\",J42*S42*ROUND(N42/60,2),\"--\")","v":"--"},{"$f":"IF(AND(O42=\"R\",P42=\"NO\"),J42*S42*Q42/100,\"--\")","v":"--"},{"$f":"IF(O42=\"R\",J42*S42*ROUND(N42/60,2)*Q42/100,\"--\")","v":"--"},{"$f":"IF(O42=\"RF\",J42*S42*ROUND(N42/60,2),\"--\")","v":"--"},{"$f":"IF(O42=\"RR\",J42*S42*ROUND(N42/60,2)*Q42/100,\"--\")","v":"--"},"SI",{"$f":"IF(F42=\"\",\"\",SUM(T42:AA42)*IF(AB42=\"SI\",1,2))","v":65.084400000000016}]
[null,null,77,295035,5602,"SENDA HACHADA","TRAFO 1",15,"132/33/13,2",26.85,"2015-11-25T08:08:00","2015-11-25T12:34:00",{"$f":"IF(F43=\"\",\"\",(L43-K43)*24)","v":4.4333333332906477},{"$f":"IF(F43=\"\",\"\",ROUND((L43-K43)*24*60,0))","v":266},"P","--","0,000","NO",{"$f":"$I$19*IF(R43=\"SI\",1,0.1)*IF(OR(O43=\"P\",O43=\"RP\"),0.1,1)","v":0.30000000000000004},{"$f":"IF(O43=\"P\",J43*S43*ROUND(N43/60,2),\"--\")","v":35.683650000000007},{"$f":"IF(O43=\"RP\",J43*S43*Q43/100*ROUND(N43/60,2),\"--\")","v":"--"},{"$f":"IF(AND(O43=\"F\",P43=\"NO\"),J43*S43,\"--\")","v":"--"},{"$f":"IF(O43=\"F\",J43*S43*ROUND(N43/60,2),\"--\")","v":"--"},{"$f":"IF(AND(O43=\"R\",P43=\"NO\"),J43*S43*Q43/100,\"--\")","v":"--"},{"$f":"IF(O43=\"R\",J43*S43*ROUND(N43/60,2)*Q43/100,\"--\")","v":"--"},{"$f":"IF(O43=\"RF\",J43*S43*ROUND(N43/60,2),\"--\")","v":"--"},{"$f":"IF(O43=\"RR\",J43*S43*ROUND(N43/60,2)*Q43/100,\"--\")","v":"--"},"SI",{"$f":"IF(F43=\"\",\"\",SUM(T43:AA43)*IF(AB43=\"SI\",1,2))","v":35.683650000000007}]
[]
[null,null,"(²)","P - PROGRAMADA  ; F - FORZADA  ; R - REDUCCIÓN FORZADA  ; RP - REDUCCIÓN PROGRAMADA",null,null,null,null,null,null,null,null,null,null,null,null,null,null,null,{"$f":"SUM(T22:T44)","v":2013.9513749999999},103.55508000000002,4027.5,12146.94,1014.9300000000001,859.30740000000014,0,0,null,{"$f":"ROUND(SUM(AC22:AC44),2)","v":52727.59}]

{"sheet":"T-11 (3)","index":5,"n_rows":45,"n_cols":29,"rows_kept":45,"cut":false,"hidden":false,"merged":[]}
[]
[null,{"$f":"+'TOT-1115'!B2","v":"ANEXO II  al Memorandum  D.T.E.E. N°      356     / 2017"}]
[]
[" ENTE NACIONAL REGULADOR "]
["       DE LA ELECTRICIDAD"]
[]
[]
[null,null,null,null,null,"SISTEMA DE TRANSPORTE DE ENERGÍA ELÉCTRICA POR DISTRIBUCIÓN TRONCAL - TRANSNOA S.A."]
[]
[null,null,null,null,null,"2.- CONEXIÓN"]
[]
[null,null,null,null,null,"2.1.- Transformación"]
[]
[null,null,null,null,null,"2.1.1.- Equipamiento propio"]
[]
[null,{"$f":"'TOT-1115'!B14","v":"Desde el 01 al 30 de noviembre de 2015"}]
[]
[null,null,null,null,null,"Por Transformador por MVA    $ =",null,null,1.79]
[null,null,null,null,null,"Coeficiente de penalización por salida forzada   =",null,null,{"$f":"30*'TOT-1115'!B13","v":30},null,{"$f":"IF(I19=30,\" \",IF(I19=60,\"  Coeficiente duplicado por tasa de falla >4 Sal. x año/100 km.\",\"REVISAR COEFICIENTE\"))","v":" "}]
[null,null,3,4,5,6,7,8,9,10,11,12,13,14,15,16,17,18,19,20,21,22,23,24,25,26,27,28,29]
[null,null,"N°","INDISP","ID EQUIPO","ESTACIÓN\nTRANSFORMADORA","EQUIPO","POT.\n[MVA]","U\n[kV]","$/h","Salida","Entrada","Hs\nIndisp.","Mtos.\nIndisp.","Tipo \nSal.(²)","AUT.","C.R.\n%","E.N.S.","K (P;ENS)","PENALIZ.\nPROGRAM.","REDUCC.\nPROGRAM.","PENALIZAC. FORZADA\nPor Salida       hs. Restantes",null,"REDUCC. FORZADA\nPor Salida       hs. Restantes",null,"RESTANTE\nFORZADA","REDUCC.\nRESTANTE","Informó\nen Térm.","TOTAL\nPENALIZAC."]
[null,null,null,null,null,null,null,null,null,null,null,null,null,null,null,null,null,null,null,null,null,null,null,null,null,null,null,null,{"$f":"'T-11 (2)'!AC45","v":52727.59}]
[]
[null,null,78,295036,5569,"SANTIAGO ESTE","TRAFO 1",30,"132/13,2",{"$f":"H24*$I$18","v":53.7},"2015-11-25T08:25:00","2015-11-25T11:38:00",{"$f":"IF(F24=\"\",\"\",(L24-K24)*24)","v":3.2166666666744277},{"$f":"IF(F24=\"\",\"\",ROUND((L24-K24)*24*60,0))","v":193},"P",{"$f":"IF(F24=\"\",\"\",IF(OR(O24=\"P\",O24=\"RP\"),\"--\",\"NO\"))","v":"--"},"0,000","NO",{"$f":"$I$19*IF(R24=\"SI\",1,0.1)*IF(OR(O24=\"P\",O24=\"RP\"),0.1,1)","v":0.30000000000000004},{"$f":"IF(O24=\"P\",J24*S24*ROUND(N24/60,2),\"--\")","v":51.874200000000016},{"$f":"IF(O24=\"RP\",J24*S24*Q24/100*ROUND(N24/60,2),\"--\")","v":"--"},{"$f":"IF(AND(O24=\"F\",P24=\"NO\"),J24*S24,\"--\")","v":"--"},{"$f":"IF(O24=\"F\",J24*S24*ROUND(N24/60,2),\"--\")","v":"--"},{"$f":"IF(AND(O24=\"R\",P24=\"NO\"),J24*S24*Q24/100,\"--\")","v":"--"},{"$f":"IF(O24=\"R\",J24*S24*ROUND(N24/60,2)*Q24/100,\"--\")","v":"--"},{"$f":"IF(O24=\"RF\",J24*S24*ROUND(N24/60,2),\"--\")","v":"--"},{"$f":"IF(O24=\"RR\",J24*S24*ROUND(N24/60,2)*Q24/100,\"--\")","v":"--"},"SI",{"$f":"IF(F24=\"\",\"\",SUM(T24:AA24)*IF(AB24=\"SI\",1,2))","v":51.874200000000016}]
[null,null,79,295037,5410,"TERMAS NORTE","TRAFO 1",15,"132/33/13,2",{"$f":"H25*$I$18","v":26.85},"2015-11-25T13:16:00","2015-11-25T13:46:00",{"$f":"IF(F25=\"\",\"\",(L25-K25)*24)","v":0.50000000005820766},{"$f":"IF(F25=\"\",\"\",ROUND((L25-K25)*24*60,0))","v":30},"P",{"$f":"IF(F25=\"\",\"\",IF(OR(O25=\"P\",O25=\"RP\"),\"--\",\"NO\"))","v":"--"},"0,000","NO",{"$f":"$I$19*IF(R25=\"SI\",1,0.1)*IF(OR(O25=\"P\",O25=\"RP\"),0.1,1)","v":0.30000000000000004},{"$f":"IF(O25=\"P\",J25*S25*ROUND(N25/60,2),\"--\")","v":4.0275000000000007},{"$f":"IF(O25=\"RP\",J25*S25*Q25/100*ROUND(N25/60,2),\"--\")","v":"--"},{"$f":"IF(AND(O25=\"F\",P25=\"NO\"),J25*S25,\"--\")","v":"--"},{"$f":"IF(O25=\"F\",J25*S25*ROUND(N25/60,2),\"--\")","v":"--"},{"$f":"IF(AND(O25=\"R\",P25=\"NO\"),J25*S25*Q25/100,\"--\")","v":"--"},{"$f":"IF(O25=\"R\",J25*S25*ROUND(N25/60,2)*Q25/100,\"--\")","v":"--"},{"$f":"IF(O25=\"RF\",J25*S25*ROUND(N25/60,2),\"--\")","v":"--"},{"$f":"IF(O25=\"RR\",J25*S25*ROUND(N25/60,2)*Q25/100,\"--\")","v":"--"},"NO",{"$f":"IF(F25=\"\",\"\",SUM(T25:AA25)*IF(AB25=\"SI\",1,2))","v":8.0550000000000015}]
[null,null,80,295041,4897,"BANDERA","TRAFO 2",15,"132/33/13,2",26.85,"2015-11-26T20:09:00","2015-11-26T20:49:00",0.6666666665696539,40,"R","NO",60,"SI",30,"--","--","--","--",483.3,323.81100000000004,"--","--","SI",807.1110000000001]
[null,null,81,295077,2040,"CATAMARCA ","TRAFO 1",30,"132/33/13,2",53.7,"2015-11-27T08:36:00","2015-11-27T14:58:00",6.3666666668141261,382,"P","--","0,000","NO",0.30000000000000004,102.62070000000003,"--","--","--","--","--","--","--","SI",102.62070000000003]
[null,null,82,295078,5446,"CHAMICAL","TRAFO 1",30,"132/33/13,2",53.7,"2015-11-29T07:02:00","2015-11-29T16:25:00",9.3833333333604969,563,"R","NO",40,"NO",3,"--","--","--","--",64.440000000000012,604.44720000000018,"--","--","SI",668.88720000000023]
[null,null,83,295079,5449,"VILLA UNIÓN","TRAFO 1",15,"132/33/13,2",26.85,"2015-11-29T07:11:00","2015-11-29T11:50:00",4.6499999999650754,279,"P","--","0,000","NO",0.30000000000000004,37.455750000000009,"--","--","--","--","--","--","--","SI",37.455750000000009]
[null,null,84,295080,5453,"CIRCUNVALACIÓN","TRAFO 1",30,"132/33/13,2",53.7,"2015-11-29T07:16:00","2015-11-29T15:04:00",7.8000000001047738,468,"P","--","0,000","NO",0.30000000000000004,125.65800000000002,"--","--","--","--","--","--","--","SI",125.65800000000002]
[null,null,85,295081,5454,"CIRCUNVALACIÓN","TRAFO 2",30,"132/33/13,2",53.7,"2015-11-29T07:16:00","2015-11-29T15:04:00",7.8000000001047738,468,"P","--","0,000","NO",0.30000000000000004,125.65800000000002,"--","--","--","--","--","--","--","SI",125.65800000000002]
[null,null,86,295083,5448,"NONOGASTA","TRAFO 2",40,"132/66/13,2",71.599999999999994,"2015-11-29T07:19:00","2015-11-29T11:44:00",4.4166666667442769,265,"P","--","0,000","NO",0.30000000000000004,94.941599999999994,"--","--","--","--","--","--","--","SI",94.941599999999994]
[null,null,87,295084,4993,"PALPALA","TRAFO 2",15,"132/33/13,2",26.85,"2015-11-29T13:31:00","2015-11-29T19:55:00",6.3999999999068677,384,"F","NO","0,000","NO",3,"--","--",80.550000000000011,515.5200000000001,"--","--","--","--","SI",596.07000000000016]
[null,null,null,null,null,null,null,null,null,0,null,null,"","",null,"",{"$f":"IF(F34=\"\",\"\",\"--\")","v":""},null,3,"--","--","--","--","--","--","--","--",{"$f":"IF(F34=\"\",\"\",\"SI\")","v":""},""]
[null,null,null,null,null,null,null,null,null,0,null,null,"","",null,"","",null,3,"--","--","--","--","--","--","--","--","",""]
[null,null,null,null,null,null,null,null,null,0,null,null,"","",null,"","",null,3,"--","--","--","--","--","--","--","--","",""]
[null,null,null,null,null,null,null,null,null,0,null,null,"","",null,"","",null,3,"--","--","--","--","--","--","--","--","",""]
[null,null,null,null,null,null,null,null,null,0,null,null,"","",null,"","",null,3,"--","--","--","--","--","--","--","--","",""]
[null,null,null,null,null,null,null,null,null,0,null,null,"","",null,"","",null,3,"--","--","--","--","--","--","--","--","",""]
[null,null,null,null,null,null,null,null,null,0,null,null,"","",null,"","",null,3,"--","--","--","--","--","--","--","--","",""]
[null,null,null,null,null,null,null,null,null,0,null,null,{"$f":"IF(F41=\"\",\"\",(L41-K41)*24)","v":""},{"$f":"IF(F41=\"\",\"\",ROUND((L41-K41)*24*60,0))","v":""},null,"","",null,{"$f":"$I$19*IF(R41=\"SI\",1,0.1)*IF(OR(O41=\"P\",O41=\"RP\"),0.1,1)","v":3},{"$f":"IF(O41=\"P\",J41*S41*ROUND(N41/60,2),\"--\")","v":"--"},{"$f":"IF(O41=\"RP\",J41*S41*Q41/100*ROUND(N41/60,2),\"--\")","v":"--"},{"$f":"IF(AND(O41=\"F\",P41=\"NO\"),J41*S41,\"--\")","v":"--"},{"$f":"IF(O41=\"F\",J41*S41*ROUND(N41/60,2),\"--\")","v":"--"},{"$f":"IF(AND(O41=\"R\",P41=\"NO\"),J41*S41*Q41/100,\"--\")","v":"--"},{"$f":"IF(O41=\"R\",J41*S41*ROUND(N41/60,2)*Q41/100,\"--\")","v":"--"},{"$f":"IF(O41=\"RF\",J41*S41*ROUND(N41/60,2),\"--\")","v":"--"},{"$f":"IF(O41=\"RR\",J41*S41*ROUND(N41/60,2)*Q41/100,\"--\")","v":"--"},"",{"$f":"IF(F41=\"\",\"\",SUM(T41:AA41)*IF(AB41=\"SI\",1,2))","v":""}]
[null,null,null,null,null,null,null,null,null,0,null,null,{"$f":"IF(F42=\"\",\"\",(L42-K42)*24)","v":""},{"$f":"IF(F42=\"\",\"\",ROUND((L42-K42)*24*60,0))","v":""},null,"","",null,{"$f":"$I$19*IF(R42=\"SI\",1,0.1)*IF(OR(O42=\"P\",O42=\"RP\"),0.1,1)","v":3},{"$f":"IF(O42=\"P\",J42*S42*ROUND(N42/60,2),\"--\")","v":"--"},{"$f":"IF(O42=\"RP\",J42*S42*Q42/100*ROUND(N42/60,2),\"--\")","v":"--"},{"$f":"IF(AND(O42=\"F\",P42=\"NO\"),J42*S42,\"--\")","v":"--"},{"$f":"IF(O42=\"F\",J42*S42*ROUND(N42/60,2),\"--\")","v":"--"},{"$f":"IF(AND(O42=\"R\",P42=\"NO\"),J42*S42*Q42/100,\"--\")","v":"--"},{"$f":"IF(O42=\"R\",J42*S42*ROUND(N42/60,2)*Q42/100,\"--\")","v":"--"},{"$f":"IF(O42=\"RF\",J42*S42*ROUND(N42/60,2),\"--\")","v":"--"},{"$f":"IF(O42=\"RR\",J42*S42*ROUND(N42/60,2)*Q42/100,\"--\")","v":"--"},"",{"$f":"IF(F42=\"\",\"\",SUM(T42:AA42)*IF(AB42=\"SI\",1,2))","v":""}]
[null,null,null,null,null,null,null,null,null,0,null,null,{"$f":"IF(F43=\"\",\"\",(L43-K43)*24)","v":""},{"$f":"IF(F43=\"\",\"\",ROUND((L43-K43)*24*60,0))","v":""},null,"","",null,{"$f":"$I$19*IF(R43=\"SI\",1,0.1)*IF(OR(O43=\"P\",O43=\"RP\"),0.1,1)","v":3},{"$f":"IF(O43=\"P\",J43*S43*ROUND(N43/60,2),\"--\")","v":"--"},{"$f":"IF(O43=\"RP\",J43*S43*Q43/100*ROUND(N43/60,2),\"--\")","v":"--"},{"$f":"IF(AND(O43=\"F\",P43=\"NO\"),J43*S43,\"--\")","v":"--"},{"$f":"IF(O43=\"F\",J43*S43*ROUND(N43/60,2),\"--\")","v":"--"},{"$f":"IF(AND(O43=\"R\",P43=\"NO\"),J43*S43*Q43/100,\"--\")","v":"--"},{"$f":"IF(O43=\"R\",J43*S43*ROUND(N43/60,2)*Q43/100,\"--\")","v":"--"},{"$f":"IF(O43=\"RF\",J43*S43*ROUND(N43/60,2),\"--\")","v":"--"},{"$f":"IF(O43=\"RR\",J43*S43*ROUND(N43/60,2)*Q43/100,\"--\")","v":"--"},"",{"$f":"IF(F43=\"\",\"\",SUM(T43:AA43)*IF(AB43=\"SI\",1,2))","v":""}]
[]
[null,null,"(²)","P - PROGRAMADA  ; F - FORZADA  ; R - REDUCCIÓN FORZADA",null,null,null,null,null,null,null,null,null,null,null,null,null,null,null,{"$f":"SUM(T22:T44)","v":542.23575000000005},0,80.550000000000011,515.5200000000001,547.74,928.25820000000022,0,0,null,{"$f":"ROUND(SUM(AC22:AC44),2)","v":55345.919999999998}]

{"sheet":"T-EDESA-11 (1)","index":6,"n_rows":45,"n_cols":29,"rows_kept":45,"cut":false,"hidden":false,"merged":[]}
[]
[null,{"$f":"+'TOT-1115'!B2","v":"ANEXO II  al Memorandum  D.T.E.E. N°      356     / 2017"}]
[]
[" ENTE NACIONAL REGULADOR"]
["       DE LA ELECTRICIDAD"]
[]
[]
[null,null,null,null,null,"SISTEMA DE TRANSPORTE DE ENERGÍA ELÉCTRICA POR DISTRIBUCIÓN TRONCAL - TRANSNOA S.A."]
[]
[null,null,null,null,null,"2.- CONEXIÓN"]
[]
[null,null,null,null,null,"2.1.- Transformación"]
[]
[null,null,null,null,null,"2.1.2.- Transportista Independiente EDESA S.A."]
[]
[null,{"$f":"'TOT-1115'!B14","v":"Desde el 01 al 30 de noviembre de 2015"}]
[]
[null,null,null,null,null,"Por Transformador por MVA    $ =",null,null,0.18099999999999999]
[null,null,null,null,null,"Coeficiente de penalización por salida forzada   =",null,null,{"$f":"30*'TOT-1115'!B13","v":30},null,{"$f":"IF(I19=30,\" \",IF(I19=60,\"  Coeficiente duplicado por tasa de falla >4 Sal. x año/100 km.\",\"REVISAR COEFICIENTE\"))","v":" "}]
[null,null,3,4,5,6,7,8,9,10,11,12,13,14,15,16,17,18,19,20,21,22,23,24,25,26,27,28,29]
[null,null,"N°","INDISP","ID EQUIPO","ESTACIÓN\nTRANSFORMADORA","EQUIPO","POT.\n[MVA]","U\n[kV]","$/h","Salida","Entrada","Hs\nIndisp.","Mtos.\nIndisp.","Tipo \nSal.(²)","AUT.","C.R.\n%","E.N.S.","K (P;ENS)","PENALIZ.\nPROGRAM.","REDUCC.\nPROGRAM.","PENALIZAC. FORZADA\nPor Salida       hs. Restantes",null,"REDUCC. FORZADA\nPor Salida       hs. Restantes",null,"RESTANTE\nFORZADA","REDUCC.\nRESTANTE","Informó\nen Térm.","TOTAL\nPENALIZAC."]
[]
[]
[null,null,88,294777,2716,"EL TUNAL","TRAFO 1",7.5,"132/13,2",{"$f":"H24*$I$18","v":1.3574999999999999},"2015-11-19T08:57:00","2015-11-19T18:16:00",{"$f":"IF(F24=\"\",\"\",(L24-K24)*24)","v":9.3166666666511446},{"$f":"IF(F24=\"\",\"\",ROUND((L24-K24)*24*60,0))","v":559},"P",{"$f":"IF(F24=\"\",\"\",IF(OR(O24=\"P\",O24=\"RP\"),\"--\",\"NO\"))","v":"--"},"0,000","NO",{"$f":"$I$19*IF(R24=\"SI\",1,0.1)*IF(OR(O24=\"P\",O24=\"RP\"),0.1,1)","v":0.30000000000000004},{"$f":"IF(O24=\"P\",J24*S24*ROUND(N24/60,2),\"--\")","v":3.7955700000000006},{"$f":"IF(O24=\"RP\",J24*S24*Q24/100*ROUND(N24/60,2),\"--\")","v":"--"},{"$f":"IF(AND(O24=\"F\",P24=\"NO\"),J24*S24,\"--\")","v":"--"},{"$f":"IF(O24=\"F\",J24*S24*ROUND(N24/60,2),\"--\")","v":"--"},{"$f":"IF(AND(O24=\"R\",P24=\"NO\"),J24*S24*Q24/100,\"--\")","v":"--"},{"$f":"IF(O24=\"R\",J24*S24*ROUND(N24/60,2)*Q24/100,\"--\")","v":"--"},{"$f":"IF(O24=\"RF\",J24*S24*ROUND(N24/60,2),\"--\")","v":"--"},{"$f":"IF(O24=\"RR\",J24*S24*ROUND(N24/60,2)*Q24/100,\"--\")","v":"--"},"SI",{"$f":"IF(F24=\"\",\"\",SUM(T24:AA24)*IF(AB24=\"SI\",1,2))","v":3.7955700000000006}]
[null,null,89,294786,2717,"EL TUNAL","TRAFO 2",7.5,"132/13,2",{"$f":"H25*$I$18","v":1.3574999999999999},"2015-11-20T09:28:00","2015-11-20T16:34:00",7.1000000000931323,426,"P",{"$f":"IF(F25=\"\",\"\",IF(OR(O25=\"P\",O25=\"RP\"),\"--\",\"NO\"))","v":"--"},"0,000","NO",0.30000000000000004,2.8914750000000002,"--","--","--","--","--","--","--","SI",2.8914750000000002]
[null,null,null,null,null,null,null,null,null,0,null,null,"","",null,"",{"$f":"IF(F26=\"\",\"\",\"--\")","v":""},null,3,"--","--","--","--","--","--","--","--",{"$f":"IF(F26=\"\",\"\",\"SI\")","v":""},""]
[null,null,null,null,null,null,null,null,null,0,null,null,"","",null,"","",null,3,"--","--","--","--","--","--","--","--","",""]
[null,null,null,null,null,null,null,null,null,0,null,null,"","",null,"","",null,3,"--","--","--","--","--","--","--","--","",""]
[null,null,null,null,null,null,null,null,null,0,null,null,"","",null,"","",null,3,"--","--","--","--","--","--","--","--","",""]
[null,null,null,null,null,null,null,null,null,0,null,null,"","",null,"","",null,3,"--","--","--","--","--","--","--","--","",""]
[null,null,null,null,null,null,null,null,null,0,null,null,"","",null,"","",null,3,"--","--","--","--","--","--","--","--","",""]
[null,null,null,null,null,null,null,null,null,0,null,null,"","",null,"","",null,3,"--","--","--","--","--","--","--","--","",""]
[null,null,null,null,null,null,null,null,null,0,null,null,"","",null,"","",null,3,"--","--","--","--","--","--","--","--","",""]
[null,null,null,null,null,null,null,null,null,0,null,null,"","",null,"","",null,3,"--","--","--","--","--","--","--","--","",""]
[null,null,null,null,null,null,null,null,null,0,null,null,"","",null,"","",null,3,"--","--","--","--","--","--","--","--","",""]
[null,null,null,null,null,null,null,null,null,0,null,null,"","",null,"","",null,3,"--","--","--","--","--","--","--","--","",""]
[null,null,null,null,null,null,null,null,null,0,null,null,"","",null,"","",null,3,"--","--","--","--","--","--","--","--","",""]
[null,null,null,null,null,null,null,null,null,0,null,null,"","",null,"","",null,3,"--","--","--","--","--","--","--","--","",""]
[null,null,null,null,null,null,null,null,null,0,null,null,"","",null,"","",null,3,"--","--","--","--","--","--","--","--","",""]
[null,null,null,null,null,null,null,null,null,0,null,null,"","",null,"","",null,3,"--","--","--","--","--","--","--","--","",""]
[null,null,null,null,null,null,null,null,null,0,null,null,"","",null,"","",null,3,"--","--","--","--","--","--","--","--","",""]
[null,null,null,null,null,null,null,null,null,0,null,null,"","",null,"","",null,3,"--","--","--","--","--","--","--","--","",""]
[null,null,null,null,null,null,null,null,null,0,null,null,"","",null,"","",null,3,"--","--","--","--","--","--","--","--","",""]
[]
[null,null,"(²)","P - PROGRAMADA",null,null,null,null,null,null,null,null,null,null,null,null,null,null,null,{"$f":"SUM(T22:T44)","v":6.6870450000000012},0,0,0,0,0,0,0,null,{"$f":"ROUND(SUM(AC22:AC44),2)","v":6.69}]

{"sheet":"SUP-EDESA","index":7,"n_rows":54,"n_cols":14,"rows_kept":54,"cut":false,"hidden":false,"merged":[]}
[]
[null,{"$f":"'TOT-1115'!B2","v":"ANEXO II  al Memorandum  D.T.E.E. N°      356     / 2017"}]
["ENTE NACIONAL REGULADOR "]
["DE LA ELECTRICIDAD"]
[]
[]
[null,null,null,"SISTEMA DE TRANSPORTE DE ENERGÍA ELÉCTRICA POR DISTRIBUCIÓN TRONCAL - TRANSNOA S.A."]
[]
[null,null,null,"3.1- SUPERVISIÓN - Transportista Independiente EDESA S.A."]
[]
[null,{"$f":"'TOT-1115'!B14","v":"Desde el 01 al 30 de noviembre de 2015"}]
[]
[]
[]
[null,null,"a) Datos"]
[null,null,null,null,null,null,null,null,"$/100 km-h : LÍNEAS 132 kV ",514.20399999999995,null,"Salida en 132 kV o 66 kV = "," - "]
[null,null,null,"Tiempo de servicio =",{"$f":"MID(B11,16,2)*24","v":720},"hs",null,null,"Cargo por Transformador por MVA = ",1.79,null,"Salida en 33 kV ",17.934999999999999]
[null,null,null,"Porcentaje por Supervisión  =",2.5000000000000001E-2,null,null,null,null,null,null,"Salida en 13,2 kV =",17.934999999999999]
[]
[null,null,"b) SM:  es la suma de las sanciones a que en cada mes se hiciere pasible el Transportista Independiente, valorizadas con idénticos criterios que los que se aplican a la Concesionaria."]
[]
[null,null,null,"SANCIÓN al T.I.",null,"LÍNEAS",null,null,0]
[null,null,null,null,null,"TRANSFORMACIÓN",null,null,59.74,null,null,"SEGÚN 2.1.2."]
[null,null,null,null,null,"SALIDAS",null,null,0]
[]
[null,null,null,null,null,null,null,"SM =",{"$f":"SUM(I22:I25)","v":59.74}]
[]
[null,null,"c) RM : es la remuneración que mensualmente recibiría el Transportista Independiente, si su servicio fuera valorizado conforme al régimen remuneratorio que se aplica a la Concesionaria."]
[]
[null,null,null,"Cargo por Capacidad de Transporte","U [kV]","Long [km]",null,"Cargo por C. T.",{"$f":"\"Cargo por E.E.T.\"","v":"Cargo por E.E.T."},null,null,"TOTAL"]
[null,null,null,"METAN - EL TUNAL",132,75.599999999999994,null,{"$f":"F31*$J$16*$E$17/100","v":279891.52127999993},2933,{"$f":"\"(DTE \"&DATO!$G$14&DATO!$H$14&\")\"","v":"(DTE 1115)"},null,{"$f":"SUM(H31:K31)","v":282824.52127999993}]
[null,null,null,"EL TUNAL - J.V.GONZALEZ",132,41.4,null,{"$f":"F32*$J$16*$E$17/100","v":153273.92831999998},7311,{"$f":"\"(DTE \"&DATO!$G$14&DATO!$H$14&\")\"","v":"(DTE 1115)"},null,{"$f":"SUM(H32:K32)","v":160584.92831999998}]
[null,null,null,null,null,null,null,null,null,null,null,{"$f":"SUM(L31:L32)","v":443409.44959999993}]
[]
[null,null,null,"Cargo por Capacidad de Transformación","Equipo","Pot [MVA]",null,"Cargo por C. T.",null,"E.T",null,"Salida","U [kV]","Cargo"]
[null,null,null,"J.V. GONZALEZ","T1",7.5,null,{"$f":"+F36*$J$17*$E$17","v":9666},null,"J.V. GONZALEZ",null,"Alimentador Tolloche",33,{"$f":"$M$17*$E$17","v":12913.199999999999}]
[null,null,null,"J.V. GONZALEZ","T2",7.5,null,{"$f":"+F37*$J$17*$E$17","v":9666},null,"J.V. GONZALEZ",null,"Alimentador Lajitas",33,{"$f":"$M$17*$E$17","v":12913.199999999999}]
[null,null,null,"EL TUNAL","T1",7.5,null,{"$f":"+F38*$J$17*$E$17","v":9666},null,"J.V. GONZALEZ",null,"Alimentador J. V. Gonzalez",13.2,{"$f":"$M$17*$E$17","v":12913.199999999999}]
[null,null,null,"EL TUNAL","T2",7.5,null,{"$f":"+F39*$J$17*$E$17","v":9666},null,"J.V. GONZALEZ",null,"Alimentador El Tunal",13.2,{"$f":"$M$17*$E$17","v":12913.199999999999}]
[null,null,null,null,null,null,null,{"$f":"SUM(H36:H39)","v":38664},null,"J.V. GONZALEZ",null,"Alimentador Quebrachal",13.2,{"$f":"$M$17*$E$17","v":12913.199999999999}]
[null,null,null,null,null,null,null,null,null,null,null,null,null,{"$f":"SUM(N36:N40)","v":64565.999999999993}]
[]
[null,null,null,null,null,null,null,"RM =",{"$f":"+H40+N41+L33","v":546639.44959999993},null,"RM * =",64413.977599999998]
[]
[null,null,"d) CS: Es el cargo por Supervisión de la Operación que la Transportista percibe por supervisar la operación y mantenimiento del Transportista Independiente."]
[]
[null,null,null,"Cargo por Supervisión afectado a la sanción ",null,null,null,"CS =",{"$f":"E18*L43","v":1610.34944}]
[]
[null,null,"e) SANCIÓN"]
[null,null,null,"Sanción Calculada",{"$f":"10*I26*I47/I43","v":1.7598853433647246}]
[]
[null,null,null,"TOTAL A PENALIZAR A TRANSNOA S.A. POR SUPERVISIÓN A  EDESA S.A."]
[]
[null,null,null,null,null,null,null,"SANCIÓN  =",{"$f":"IF($E$50>3*I47,3*I47,$E$50)","v":1.7598853433647246}]

{"sheet":"Tasa de Falla","index":8,"n_rows":153,"n_cols":19,"rows_kept":153,"cut":false,"hidden":false,"merged":[[2,0,2,2],[3,0,3,2],[152,11,152,12]]}
[]
[null,{"$f":"'TOT-1115'!B2","v":"ANEXO II  al Memorandum  D.T.E.E. N°      356     / 2017"}]
["ENTE NACIONAL REGULADOR "]
["DE LA ELECTRICIDAD"]
[]
[null,"SISTEMA DE TRANSPORTE DE ENERGÍA ELÉCTRICA POR DISTRIBUCIÓN TRONCAL "]
[]
[null,"TRANSNOA S.A."]
[]
[null,"INDISPONIBILIDADES FORZADAS DE LÍNEAS - TASA DE FALLA"]
[]
[]
[null,"y",null,{"$f":"'TOT-1115'!B14","v":"Desde el 01 al 30 de noviembre de 2015"}]
[]
[null,null,"N°","LÍNEAS","U\n[kV]","Long.\n[km]","2014-11-01","2014-12-01","2015-01-01","2015-02-01","2015-03-01","2015-04-01","2015-05-01","2015-06-01","2015-07-01","2015-08-01","2015-09-01","2015-10-01","2015-11-01"]
[]
[null,null,{"$f":"'[1]Tasa de Falla'!C17","v":1},{"$f":"'[1]Tasa de Falla'!D17","v":"AGUA BLANCA - VILLA QUINTEROS"},{"$f":"'[1]Tasa de Falla'!E17","v":132},{"$f":"'[1]Tasa de Falla'!F17","v":23.8},{"$f":"IF('[1]Tasa de Falla'!IR17=0,\"\",'[1]Tasa de Falla'!IR17)","v":""},{"$f":"IF('[1]Tasa de Falla'!IS17=0,\"\",'[1]Tasa de Falla'!IS17)","v":""},{"$f":"IF('[1]Tasa de Falla'!IT17=0,\"\",'[1]Tasa de Falla'!IT17)","v":""},{"$f":"IF('[1]Tasa de Falla'!IU17=0,\"\",'[1]Tasa de Falla'!IU17)","v":""},{"$f":"IF('[1]Tasa de Falla'!IV17=0,\"\",'[1]Tasa de Falla'!IV17)","v":""},{"$f":"IF('[1]Tasa de Falla'!IW17=0,\"\",'[1]Tasa de Falla'!IW17)","v":""},{"$f":"IF('[1]Tasa de Falla'!IX17=0,\"\",'[1]Tasa de Falla'!IX17)","v":""},{"$f":"IF('[1]Tasa de Falla'!IY17=0,\"\",'[1]Tasa de Falla'!IY17)","v":""},{"$f":"IF('[1]Tasa de Falla'!IZ17=0,\"\",'[1]Tasa de Falla'!IZ17)","v":""},{"$f":"IF('[1]Tasa de Falla'!JA17=0,\"\",'[1]Tasa de Falla'!JA17)","v":""},{"$f":"IF('[1]Tasa de Falla'!JB17=0,\"\",'[1]Tasa de Falla'!JB17)","v":""},{"$f":"IF('[1]Tasa de Falla'!JC17=0,\"\",'[1]Tasa de Falla'!JC17)","v":""}]
[null,null,{"$f":"'[1]Tasa de Falla'!C18","v":2},{"$f":"'[1]Tasa de Falla'!D18","v":"AGUILARES - ESCABA"},{"$f":"'[1]Tasa de Falla'!E18","v":132},{"$f":"'[1]Tasa de Falla'!F18","v":27},{"$f":"IF('[1]Tasa de Falla'!IR18=0,\"\",'[1]Tasa de Falla'!IR18)","v":""},{"$f":"IF('[1]Tasa de Falla'!IS18=0,\"\",'[1]Tasa de Falla'!IS18)","v":""},{"$f":"IF('[1]Tasa de Falla'!IT18=0,\"\",'[1]Tasa de Falla'!IT18)","v":""},{"$f":"IF('[1]Tasa de Falla'!IU18=0,\"\",'[1]Tasa de Falla'!IU18)","v":""},{"$f":"IF('[1]Tasa de Falla'!IV18=0,\"\",'[1]Tasa de Falla'!IV18)","v":""},{"$f":"IF('[1]Tasa de Falla'!IW18=0,\"\",'[1]Tasa de Falla'!IW18)","v":""},{"$f":"IF('[1]Tasa de Falla'!IX18=0,\"\",'[1]Tasa de Falla'!IX18)","v":""},{"$f":"IF('[1]Tasa de Falla'!IY18=0,\"\",'[1]Tasa de Falla'!IY18)","v":""},{"$f":"IF('[1]Tasa de Falla'!IZ18=0,\"\",'[1]Tasa de Falla'!IZ18)","v":""},{"$f":"IF('[1]Tasa de Falla'!JA18=0,\"\",'[1]Tasa de Falla'!JA18)","v":2},{"$f":"IF('[1]Tasa de Falla'!JB18=0,\"\",'[1]Tasa de Falla'!JB18)","v":""},{"$f":"IF('[1]Tasa de Falla'!JC18=0,\"\",'[1]Tasa de Falla'!JC18)","v":""}]
[null,null,{"$f":"'[1]Tasa de Falla'!C19","v":3},{"$f":"'[1]Tasa de Falla'!D19","v":"CABRA CORRAL - SALTA SUR"},{"$f":"'[1]Tasa de Falla'!E19","v":132},{"$f":"'[1]Tasa de Falla'!F19","v":62},{"$f":"IF('[1]Tasa de Falla'!IR19=0,\"\",'[1]Tasa de Falla'!IR19)","v":"XXXX"},{"$f":"IF('[1]Tasa de Falla'!IS19=0,\"\",'[1]Tasa de Falla'!IS19)","v":"XXXX"},{"$f":"IF('[1]Tasa de Falla'!IT19=0,\"\",'[1]Tasa de Falla'!IT19)","v":"XXXX"},{"$f":"IF('[1]Tasa de Falla'!IU19=0,\"\",'[1]Tasa de Falla'!IU19)","v":"XXXX"},{"$f":"IF('[1]Tasa de Falla'!IV19=0,\"\",'[1]Tasa de Falla'!IV19)","v":"XXXX"},{"$f":"IF('[1]Tasa de Falla'!IW19=0,\"\",'[1]Tasa de Falla'!IW19)","v":"XXXX"},{"$f":"IF('[1]Tasa de Falla'!IX19=0,\"\",'[1]Tasa de Falla'!IX19)","v":"XXXX"},{"$f":"IF('[1]Tasa de Falla'!IY19=0,\"\",'[1]Tasa de Falla'!IY19)","v":"XXXX"},{"$f":"IF('[1]Tasa de Falla'!IZ19=0,\"\",'[1]Tasa de Falla'!IZ19)","v":"XXXX"},{"$f":"IF('[1]Tasa de Falla'!JA19=0,\"\",'[1]Tasa de Falla'!JA19)","v":"XXXX"},{"$f":"IF('[1]Tasa de Falla'!JB19=0,\"\",'[1]Tasa de Falla'!JB19)","v":"XXXX"},{"$f":"IF('[1]Tasa de Falla'!JC19=0,\"\",'[1]Tasa de Falla'!JC19)","v":"XXXX"}]
[null,null,{"$f":"'[1]Tasa de Falla'!C20","v":4},{"$f":"'[1]Tasa de Falla'!D20","v":"CEVIL POZO - TUCUMAN NORTE"},{"$f":"'[1]Tasa de Falla'!E20","v":132},{"$f":"'[1]Tasa de Falla'!F20","v":14.5},{"$f":"IF('[1]Tasa de Falla'!IR20=0,\"\",'[1]Tasa de Falla'!IR20)","v":""},{"$f":"IF('[1]Tasa de Falla'!IS20=0,\"\",'[1]Tasa de Falla'!IS20)","v":""},{"$f":"IF('[1]Tasa de Falla'!IT20=0,\"\",'[1]Tasa de Falla'!IT20)","v":""},{"$f":"IF('[1]Tasa de Falla'!IU20=0,\"\",'[1]Tasa de Falla'!IU20)","v":""},{"$f":"IF('[1]Tasa de Falla'!IV20=0,\"\",'[1]Tasa de Falla'!IV20)","v":""},{"$f":"IF('[1]Tasa de Falla'!IW20=0,\"\",'[1]Tasa de Falla'!IW20)","v":""},{"$f":"IF('[1]Tasa de Falla'!IX20=0,\"\",'[1]Tasa de Falla'!IX20)","v":""},{"$f":"IF('[1]Tasa de Falla'!IY20=0,\"\",'[1]Tasa de Falla'!IY20)","v":""},{"$f":"IF('[1]Tasa de Falla'!IZ20=0,\"\",'[1]Tasa de Falla'!IZ20)","v":""},{"$f":"IF('[1]Tasa de Falla'!JA20=0,\"\",'[1]Tasa de Falla'!JA20)","v":""},{"$f":"IF('[1]Tasa de Falla'!JB20=0,\"\",'[1]Tasa de Falla'!JB20)","v":""},{"$f":"IF('[1]Tasa de Falla'!JC20=0,\"\",'[1]Tasa de Falla'!JC20)","v":""}]
[null,null,{"$f":"'[1]Tasa de Falla'!C21","v":5},{"$f":"'[1]Tasa de Falla'!D21","v":"CAMPO SANTO - MINETTI"},{"$f":"'[1]Tasa de Falla'!E21","v":132},{"$f":"'[1]Tasa de Falla'!F21","v":29.9},{"$f":"IF('[1]Tasa de Falla'!IR21=0,\"\",'[1]Tasa de Falla'!IR21)","v":"XXXX"},{"$f":"IF('[1]Tasa de Falla'!IS21=0,\"\",'[1]Tasa de Falla'!IS21)","v":"XXXX"},{"$f":"IF('[1]Tasa de Falla'!IT21=0,\"\",'[1]Tasa de Falla'!IT21)","v":"XXXX"},{"$f":"IF('[1]Tasa de Falla'!IU21=0,\"\",'[1]Tasa de Falla'!IU21)","v":"XXXX"},{"$f":"IF('[1]Tasa de Falla'!IV21=0,\"\",'[1]Tasa de Falla'!IV21)","v":"XXXX"},{"$f":"IF('[1]Tasa de Falla'!IW21=0,\"\",'[1]Tasa de Falla'!IW21)","v":"XXXX"},{"$f":"IF('[1]Tasa de Falla'!IX21=0,\"\",'[1]Tasa de Falla'!IX21)","v":"XXXX"},{"$f":"IF('[1]Tasa de Falla'!IY21=0,\"\",'[1]Tasa de Falla'!IY21)","v":"XXXX"},{"$f":"IF('[1]Tasa de Falla'!IZ21=0,\"\",'[1]Tasa de Falla'!IZ21)","v":"XXXX"},{"$f":"IF('[1]Tasa de Falla'!JA21=0,\"\",'[1]Tasa de Falla'!JA21)","v":"XXXX"},{"$f":"IF('[1]Tasa de Falla'!JB21=0,\"\",'[1]Tasa de Falla'!JB21)","v":"XXXX"},{"$f":"IF('[1]Tasa de Falla'!JC21=0,\"\",'[1]Tasa de Falla'!JC21)","v":"XXXX"}]
[null,null,{"$f":"'[1]Tasa de Falla'!C22","v":6},{"$f":"'[1]Tasa de Falla'!D22","v":"ESCABA - HUACRA"},{"$f":"'[1]Tasa de Falla'!E22","v":132},{"$f":"'[1]Tasa de Falla'!F22","v":49.9},{"$f":"IF('[1]Tasa de Falla'!IR22=0,\"\",'[1]Tasa de Falla'!IR22)","v":"XXXX"},{"$f":"IF('[1]Tasa de Falla'!IS22=0,\"\",'[1]Tasa de Falla'!IS22)","v":"XXXX"},{"$f":"IF('[1]Tasa de Falla'!IT22=0,\"\",'[1]Tasa de Falla'!IT22)","v":"XXXX"},{"$f":"IF('[1]Tasa de Falla'!IU22=0,\"\",'[1]Tasa de Falla'!IU22)","v":"XXXX"},{"$f":"IF('[1]Tasa de Falla'!IV22=0,\"\",'[1]Tasa de Falla'!IV22)","v":"XXXX"},{"$f":"IF('[1]Tasa de Falla'!IW22=0,\"\",'[1]Tasa de Falla'!IW22)","v":"XXXX"},{"$f":"IF('[1]Tasa de Falla'!IX22=0,\"\",'[1]Tasa de Falla'!IX22)","v":"XXXX"},{"$f":"IF('[1]Tasa de Falla'!IY22=0,\"\",'[1]Tasa de Falla'!IY22)","v":"XXXX"},{"$f":"IF('[1]Tasa de Falla'!IZ22=0,\"\",'[1]Tasa de Falla'!IZ22)","v":"XXXX"},{"$f":"IF('[1]Tasa de Falla'!JA22=0,\"\",'[1]Tasa de Falla'!JA22)","v":"XXXX"},{"$f":"IF('[1]Tasa de Falla'!JB22=0,\"\",'[1]Tasa de Falla'!JB22)","v":"XXXX"},{"$f":"IF('[1]Tasa de Falla'!JC22=0,\"\",'[1]Tasa de Falla'!JC22)","v":"XXXX"}]
[null,null,{"$f":"'[1]Tasa de Falla'!C23","v":7},{"$f":"'[1]Tasa de Falla'!D23","v":"ESTATICA SUR - EL BRACHO"},{"$f":"'[1]Tasa de Falla'!E23","v":132},{"$f":"'[1]Tasa de Falla'!F23","v":19.600000000000001},{"$f":"IF('[1]Tasa de Falla'!IR23=0,\"\",'[1]Tasa de Falla'!IR23)","v":""},{"$f":"IF('[1]Tasa de Falla'!IS23=0,\"\",'[1]Tasa de Falla'!IS23)","v":""},{"$f":"IF('[1]Tasa de Falla'!IT23=0,\"\",'[1]Tasa de Falla'!IT23)","v":""},{"$f":"IF('[1]Tasa de Falla'!IU23=0,\"\",'[1]Tasa de Falla'!IU23)","v":""},{"$f":"IF('[1]Tasa de Falla'!IV23=0,\"\",'[1]Tasa de Falla'!IV23)","v":"XXXX"},{"$f":"IF('[1]Tasa de Falla'!IW23=0,\"\",'[1]Tasa de Falla'!IW23)","v":"XXXX"},{"$f":"IF('[1]Tasa de Falla'!IX23=0,\"\",'[1]Tasa de Falla'!IX23)","v":"XXXX"},{"$f":"IF('[1]Tasa de Falla'!IY23=0,\"\",'[1]Tasa de Falla'!IY23)","v":"XXXX"},{"$f":"IF('[1]Tasa de Falla'!IZ23=0,\"\",'[1]Tasa de Falla'!IZ23)","v":"XXXX"},{"$f":"IF('[1]Tasa de Falla'!JA23=0,\"\",'[1]Tasa de Falla'!JA23)","v":"XXXX"},{"$f":"IF('[1]Tasa de Falla'!JB23=0,\"\",'[1]Tasa de Falla'!JB23)","v":"XXXX"},{"$f":"IF('[1]Tasa de Falla'!JC23=0,\"\",'[1]Tasa de Falla'!JC23)","v":"XXXX"}]
[null,null,{"$f":"'[1]Tasa de Falla'!C24","v":8},{"$f":"'[1]Tasa de Falla'!D24","v":"ESTATICA SUR - INDEPENDENCIA 1 (O.F.)"},{"$f":"'[1]Tasa de Falla'!E24","v":132},{"$f":"'[1]Tasa de Falla'!F24","v":2.6},{"$f":"IF('[1]Tasa de Falla'!IR24=0,\"\",'[1]Tasa de Falla'!IR24)","v":""},{"$f":"IF('[1]Tasa de Falla'!IS24=0,\"\",'[1]Tasa de Falla'!IS24)","v":""},{"$f":"IF('[1]Tasa de Falla'!IT24=0,\"\",'[1]Tasa de Falla'!IT24)","v":""},{"$f":"IF('[1]Tasa de Falla'!IU24=0,\"\",'[1]Tasa de Falla'!IU24)","v":""},{"$f":"IF('[1]Tasa de Falla'!IV24=0,\"\",'[1]Tasa de Falla'!IV24)","v":""},{"$f":"IF('[1]Tasa de Falla'!IW24=0,\"\",'[1]Tasa de Falla'!IW24)","v":""},{"$f":"IF('[1]Tasa de Falla'!IX24=0,\"\",'[1]Tasa de Falla'!IX24)","v":""},{"$f":"IF('[1]Tasa de Falla'!IY24=0,\"\",'[1]Tasa de Falla'!IY24)","v":""},{"$f":"IF('[1]Tasa de Falla'!IZ24=0,\"\",'[1]Tasa de Falla'!IZ24)","v":1},{"$f":"IF('[1]Tasa de Falla'!JA24=0,\"\",'[1]Tasa de Falla'!JA24)","v":""},{"$f":"IF('[1]Tasa de Falla'!JB24=0,\"\",'[1]Tasa de Falla'!JB24)","v":""},{"$f":"IF('[1]Tasa de Falla'!JC24=0,\"\",'[1]Tasa de Falla'!JC24)","v":""}]
[null,null,{"$f":"'[1]Tasa de Falla'!C25","v":9},{"$f":"'[1]Tasa de Falla'!D25","v":"ESTATICA SUR - SARMIENTO \"TRANSNOA S.A.\""},{"$f":"'[1]Tasa de Falla'!E25","v":132},{"$f":"'[1]Tasa de Falla'!F25","v":4.4000000000000004},{"$f":"IF('[1]Tasa de Falla'!IR25=0,\"\",'[1]Tasa de Falla'!IR25)","v":""},{"$f":"IF('[1]Tasa de Falla'!IS25=0,\"\",'[1]Tasa de Falla'!IS25)","v":""},{"$f":"IF('[1]Tasa de Falla'!IT25=0,\"\",'[1]Tasa de Falla'!IT25)","v":""},{"$f":"IF('[1]Tasa de Falla'!IU25=0,\"\",'[1]Tasa de Falla'!IU25)","v":""},{"$f":"IF('[1]Tasa de Falla'!IV25=0,\"\",'[1]Tasa de Falla'!IV25)","v":""},{"$f":"IF('[1]Tasa de Falla'!IW25=0,\"\",'[1]Tasa de Falla'!IW25)","v":""},{"$f":"IF('[1]Tasa de Falla'!IX25=0,\"\",'[1]Tasa de Falla'!IX25)","v":""},{"$f":"IF('[1]Tasa de Falla'!IY25=0,\"\",'[1]Tasa de Falla'!IY25)","v":""},{"$f":"IF('[1]Tasa de Falla'!IZ25=0,\"\",'[1]Tasa de Falla'!IZ25)","v":""},{"$f":"IF('[1]Tasa de Falla'!JA25=0,\"\",'[1]Tasa de Falla'!JA25)","v":""},{"$f":"IF('[1]Tasa de Falla'!JB25=0,\"\",'[1]Tasa de Falla'!JB25)","v":""},{"$f":"IF('[1]Tasa de Falla'!JC25=0,\"\",'[1]Tasa de Falla'!JC25)","v":""}]
[null,null,{"$f":"'[1]Tasa de Falla'!C26","v":10},{"$f":"'[1]Tasa de Falla'!D26","v":"GÜEMES - EL BRACHO"},{"$f":"'[1]Tasa de Falla'!E26","v":132},{"$f":"'[1]Tasa de Falla'!F26","v":308},{"$f":"IF('[1]Tasa de Falla'!IR26=0,\"\",'[1]Tasa de Falla'!IR26)","v":"XXXX"},{"$f":"IF('[1]Tasa de Falla'!IS26=0,\"\",'[1]Tasa de Falla'!IS26)","v":"XXXX"},{"$f":"IF('[1]Tasa de Falla'!IT26=0,\"\",'[1]Tasa de Falla'!IT26)","v":"XXXX"},{"$f":"IF('[1]Tasa de Falla'!IU26=0,\"\",'[1]Tasa de Falla'!IU26)","v":"XXXX"},{"$f":"IF('[1]Tasa de Falla'!IV26=0,\"\",'[1]Tasa de Falla'!IV26)","v":"XXXX"},{"$f":"IF('[1]Tasa de Falla'!IW26=0,\"\",'[1]Tasa de Falla'!IW26)","v":"XXXX"},{"$f":"IF('[1]Tasa de Falla'!IX26=0,\"\",'[1]Tasa de Falla'!IX26)","v":"XXXX"},{"$f":"IF('[1]Tasa de Falla'!IY26=0,\"\",'[1]Tasa de Falla'!IY26)","v":"XXXX"},{"$f":"IF('[1]Tasa de Falla'!IZ26=0,\"\",'[1]Tasa de Falla'!IZ26)","v":"XXXX"},{"$f":"IF('[1]Tasa de Falla'!JA26=0,\"\",'[1]Tasa de Falla'!JA26)","v":"XXXX"},{"$f":"IF('[1]Tasa de Falla'!JB26=0,\"\",'[1]Tasa de Falla'!JB26)","v":"XXXX"},{"$f":"IF('[1]Tasa de Falla'!JC26=0,\"\",'[1]Tasa de Falla'!JC26)","v":"XXXX"}]
[null,null,{"$f":"'[1]Tasa de Falla'!C27","v":11},{"$f":"'[1]Tasa de Falla'!D27","v":"CAMPO SANTO - GÜEMES"},{"$f":"'[1]Tasa de Falla'!E27","v":132},{"$f":"'[1]Tasa de Falla'!F27","v":6.2},{"$f":"IF('[1]Tasa de Falla'!IR27=0,\"\",'[1]Tasa de Falla'!IR27)","v":"XXXX"},{"$f":"IF('[1]Tasa de Falla'!IS27=0,\"\",'[1]Tasa de Falla'!IS27)","v":"XXXX"},{"$f":"IF('[1]Tasa de Falla'!IT27=0,\"\",'[1]Tasa de Falla'!IT27)","v":"XXXX"},{"$f":"IF('[1]Tasa de Falla'!IU27=0,\"\",'[1]Tasa de Falla'!IU27)","v":"XXXX"},{"$f":"IF('[1]Tasa de Falla'!IV27=0,\"\",'[1]Tasa de Falla'!IV27)","v":"XXXX"},{"$f":"IF('[1]Tasa de Falla'!IW27=0,\"\",'[1]Tasa de Falla'!IW27)","v":"XXXX"},{"$f":"IF('[1]Tasa de Falla'!IX27=0,\"\",'[1]Tasa de Falla'!IX27)","v":"XXXX"},{"$f":"IF('[1]Tasa de Falla'!IY27=0,\"\",'[1]Tasa de Falla'!IY27)","v":"XXXX"},{"$f":"IF('[1]Tasa de Falla'!IZ27=0,\"\",'[1]Tasa de Falla'!IZ27)","v":"XXXX"},{"$f":"IF('[1]Tasa de Falla'!JA27=0,\"\",'[1]Tasa de Falla'!JA27)","v":"XXXX"},{"$f":"IF('[1]Tasa de Falla'!JB27=0,\"\",'[1]Tasa de Falla'!JB27)","v":"XXXX"},{"$f":"IF('[1]Tasa de Falla'!JC27=0,\"\",'[1]Tasa de Falla'!JC27)","v":"XXXX"}]
[null,null,{"$f":"'[1]Tasa de Falla'!C28","v":12},{"$f":"'[1]Tasa de Falla'!D28","v":"GÜEMES - SAN JUANCITO"},{"$f":"'[1]Tasa de Falla'!E28","v":132},{"$f":"'[1]Tasa de Falla'!F28","v":36.24},{"$f":"IF('[1]Tasa de Falla'!IR28=0,\"\",'[1]Tasa de Falla'!IR28)","v":""},{"$f":"IF('[1]Tasa de Falla'!IS28=0,\"\",'[1]Tasa de Falla'!IS28)","v":""},{"$f":"IF('[1]Tasa de Falla'!IT28=0,\"\",'[1]Tasa de Falla'!IT28)","v":""},{"$f":"IF('[1]Tasa de Falla'!IU28=0,\"\",'[1]Tasa de Falla'!IU28)","v":""},{"$f":"IF('[1]Tasa de Falla'!IV28=0,\"\",'[1]Tasa de Falla'!IV28)","v":""},{"$f":"IF('[1]Tasa de Falla'!IW28=0,\"\",'[1]Tasa de Falla'!IW28)","v":3},{"$f":"IF('[1]Tasa de Falla'!IX28=0,\"\",'[1]Tasa de Falla'!IX28)","v":1},{"$f":"IF('[1]Tasa de Falla'!IY28=0,\"\",'[1]Tasa de Falla'!IY28)","v":""},{"$f":"IF('[1]Tasa de Falla'!IZ28=0,\"\",'[1]Tasa de Falla'!IZ28)","v":""},{"$f":"IF('[1]Tasa de Falla'!JA28=0,\"\",'[1]Tasa de Falla'!JA28)","v":""},{"$f":"IF('[1]Tasa de Falla'!JB28=0,\"\",'[1]Tasa de Falla'!JB28)","v":""},{"$f":"IF('[1]Tasa de Falla'!JC28=0,\"\",'[1]Tasa de Falla'!JC28)","v":""}]
[null,null,{"$f":"'[1]Tasa de Falla'!C29","v":13},{"$f":"'[1]Tasa de Falla'!D29","v":"CATAMARCA - HUACRA"},{"$f":"'[1]Tasa de Falla'!E29","v":132},{"$f":"'[1]Tasa de Falla'!F29","v":67.3},{"$f":"IF('[1]Tasa de Falla'!IR29=0,\"\",'[1]Tasa de Falla'!IR29)","v":""},{"$f":"IF('[1]Tasa de Falla'!IS29=0,\"\",'[1]Tasa de Falla'!IS29)","v":""},{"$f":"IF('[1]Tasa de Falla'!IT29=0,\"\",'[1]Tasa de Falla'!IT29)","v":""},{"$f":"IF('[1]Tasa de Falla'!IU29=0,\"\",'[1]Tasa de Falla'!IU29)","v":""},{"$f":"IF('[1]Tasa de Falla'!IV29=0,\"\",'[1]Tasa de Falla'!IV29)","v":""},{"$f":"IF('[1]Tasa de Falla'!IW29=0,\"\",'[1]Tasa de Falla'!IW29)","v":1},{"$f":"IF('[1]Tasa de Falla'!IX29=0,\"\",'[1]Tasa de Falla'!IX29)","v":""},{"$f":"IF('[1]Tasa de Falla'!IY29=0,\"\",'[1]Tasa de Falla'!IY29)","v":""},{"$f":"IF('[1]Tasa de Falla'!IZ29=0,\"\",'[1]Tasa de Falla'!IZ29)","v":""},{"$f":"IF('[1]Tasa de Falla'!JA29=0,\"\",'[1]Tasa de Falla'!JA29)","v":""},{"$f":"IF('[1]Tasa de Falla'!JB29=0,\"\",'[1]Tasa de Falla'!JB29)","v":""},{"$f":"IF('[1]Tasa de Falla'!JC29=0,\"\",'[1]Tasa de Falla'!JC29)","v":""}]
[null,null,{"$f":"'[1]Tasa de Falla'!C30","v":14},{"$f":"'[1]Tasa de Falla'!D30","v":"HUACRA - LA CALERA"},{"$f":"'[1]Tasa de Falla'!E30","v":132},{"$f":"'[1]Tasa de Falla'!F30","v":91.2},{"$f":"IF('[1]Tasa de Falla'!IR30=0,\"\",'[1]Tasa de Falla'!IR30)","v":""},{"$f":"IF('[1]Tasa de Falla'!IS30=0,\"\",'[1]Tasa de Falla'!IS30)","v":""},{"$f":"IF('[1]Tasa de Falla'!IT30=0,\"\",'[1]Tasa de Falla'!IT30)","v":""},{"$f":"IF('[1]Tasa de Falla'!IU30=0,\"\",'[1]Tasa de Falla'!IU30)","v":""},{"$f":"IF('[1]Tasa de Falla'!IV30=0,\"\",'[1]Tasa de Falla'!IV30)","v":""},{"$f":"IF('[1]Tasa de Falla'!IW30=0,\"\",'[1]Tasa de Falla'!IW30)","v":""},{"$f":"IF('[1]Tasa de Falla'!IX30=0,\"\",'[1]Tasa de Falla'!IX30)","v":1},{"$f":"IF('[1]Tasa de Falla'!IY30=0,\"\",'[1]Tasa de Falla'!IY30)","v":""},{"$f":"IF('[1]Tasa de Falla'!IZ30=0,\"\",'[1]Tasa de Falla'!IZ30)","v":""},{"$f":"IF('[1]Tasa de Falla'!JA30=0,\"\",'[1]Tasa de Falla'!JA30)","v":""},{"$f":"IF('[1]Tasa de Falla'!JB30=0,\"\",'[1]Tasa de Falla'!JB30)","v":""},{"$f":"IF('[1]Tasa de Falla'!JC30=0,\"\",'[1]Tasa de Falla'!JC30)","v":""}]
[null,null,{"$f":"'[1]Tasa de Falla'!C31","v":15},{"$f":"'[1]Tasa de Falla'!D31","v":"AGUA BLANCA - INDEPENDENCIA"},{"$f":"'[1]Tasa de Falla'!E31","v":132},{"$f":"'[1]Tasa de Falla'!F31","v":34.14},{"$f":"IF('[1]Tasa de Falla'!IR31=0,\"\",'[1]Tasa de Falla'!IR31)","v":""},{"$f":"IF('[1]Tasa de Falla'!IS31=0,\"\",'[1]Tasa de Falla'!IS31)","v":""},{"$f":"IF('[1]Tasa de Falla'!IT31=0,\"\",'[1]Tasa de Falla'!IT31)","v":1},{"$f":"IF('[1]Tasa de Falla'!IU31=0,\"\",'[1]Tasa de Falla'!IU31)","v":""},{"$f":"IF('[1]Tasa de Falla'!IV31=0,\"\",'[1]Tasa de Falla'!IV31)","v":""},{"$f":"IF('[1]Tasa de Falla'!IW31=0,\"\",'[1]Tasa de Falla'!IW31)","v":""},{"$f":"IF('[1]Tasa de Falla'!IX31=0,\"\",'[1]Tasa de Falla'!IX31)","v":""},{"$f":"IF('[1]Tasa de Falla'!IY31=0,\"\",'[1]Tasa de Falla'!IY31)","v":""},{"$f":"IF('[1]Tasa de Falla'!IZ31=0,\"\",'[1]Tasa de Falla'!IZ31)","v":""},{"$f":"IF('[1]Tasa de Falla'!JA31=0,\"\",'[1]Tasa de Falla'!JA31)","v":""},{"$f":"IF('[1]Tasa de Falla'!JB31=0,\"\",'[1]Tasa de Falla'!JB31)","v":1},{"$f":"IF('[1]Tasa de Falla'!JC31=0,\"\",'[1]Tasa de Falla'!JC31)","v":""}]
[null,null,{"$f":"'[1]Tasa de Falla'!C32","v":16},{"$f":"'[1]Tasa de Falla'!D32","v":"INDEPENDENCIA - EL BRACHO 1"},{"$f":"'[1]Tasa de Falla'!E32","v":132},{"$f":"'[1]Tasa de Falla'!F32","v":17.100000000000001},{"$f":"IF('[1]Tasa de Falla'!IR32=0,\"\",'[1]Tasa de Falla'!IR32)","v":""},{"$f":"IF('[1]Tasa de Falla'!IS32=0,\"\",'[1]Tasa de Falla'!IS32)","v":""},{"$f":"IF('[1]Tasa de Falla'!IT32=0,\"\",'[1]Tasa de Falla'!IT32)","v":1},{"$f":"IF('[1]Tasa de Falla'!IU32=0,\"\",'[1]Tasa de Falla'!IU32)","v":""},{"$f":"IF('[1]Tasa de Falla'!IV32=0,\"\",'[1]Tasa de Falla'!IV32)","v":""},{"$f":"IF('[1]Tasa de Falla'!IW32=0,\"\",'[1]Tasa de Falla'!IW32)","v":""},{"$f":"IF('[1]Tasa de Falla'!IX32=0,\"\",'[1]Tasa de Falla'!IX32)","v":""},{"$f":"IF('[1]Tasa de Falla'!IY32=0,\"\",'[1]Tasa de Falla'!IY32)","v":""},{"$f":"IF('[1]Tasa de Falla'!IZ32=0,\"\",'[1]Tasa de Falla'!IZ32)","v":""},{"$f":"IF('[1]Tasa de Falla'!JA32=0,\"\",'[1]Tasa de Falla'!JA32)","v":1},{"$f":"IF('[1]Tasa de Falla'!JB32=0,\"\",'[1]Tasa de Falla'!JB32)","v":""},{"$f":"IF('[1]Tasa de Falla'!JC32=0,\"\",'[1]Tasa de Falla'!JC32)","v":""}]
[null,null,{"$f":"'[1]Tasa de Falla'!C33","v":17},{"$f":"'[1]Tasa de Falla'!D33","v":"INDEPENDENCIA - LULES - PAPEL TUCUMAN"},{"$f":"'[1]Tasa de Falla'!E33","v":132},{"$f":"'[1]Tasa de Falla'!F33","v":19.3},{"$f":"IF('[1]Tasa de Falla'!IR33=0,\"\",'[1]Tasa de Falla'!IR33)","v":""},{"$f":"IF('[1]Tasa de Falla'!IS33=0,\"\",'[1]Tasa de Falla'!IS33)","v":""},{"$f":"IF('[1]Tasa de Falla'!IT33=0,\"\",'[1]Tasa de Falla'!IT33)","v":""},{"$f":"IF('[1]Tasa de Falla'!IU33=0,\"\",'[1]Tasa de Falla'!IU33)","v":""},{"$f":"IF('[1]Tasa de Falla'!IV33=0,\"\",'[1]Tasa de Falla'!IV33)","v":""},{"$f":"IF('[1]Tasa de Falla'!IW33=0,\"\",'[1]Tasa de Falla'!IW33)","v":""},{"$f":"IF('[1]Tasa de Falla'!IX33=0,\"\",'[1]Tasa de Falla'!IX33)","v":""},{"$f":"IF('[1]Tasa de Falla'!IY33=0,\"\",'[1]Tasa de Falla'!IY33)","v":""},{"$f":"IF('[1]Tasa de Falla'!IZ33=0,\"\",'[1]Tasa de Falla'!IZ33)","v":""},{"$f":"IF('[1]Tasa de Falla'!JA33=0,\"\",'[1]Tasa de Falla'!JA33)","v":""},{"$f":"IF('[1]Tasa de Falla'!JB33=0,\"\",'[1]Tasa de Falla'!JB33)","v":""},{"$f":"IF('[1]Tasa de Falla'!JC33=0,\"\",'[1]Tasa de Falla'!JC33)","v":""}]
[null,null,{"$f":"'[1]Tasa de Falla'!C34","v":18},{"$f":"'[1]Tasa de Falla'!D34","v":"FRIAS - LA CALERA NOA."},{"$f":"'[1]Tasa de Falla'!E34","v":132},{"$f":"'[1]Tasa de Falla'!F34","v":27.3},{"$f":"IF('[1]Tasa de Falla'!IR34=0,\"\",'[1]Tasa de Falla'!IR34)","v":""},{"$f":"IF('[1]Tasa de Falla'!IS34=0,\"\",'[1]Tasa de Falla'!IS34)","v":1},{"$f":"IF('[1]Tasa de Falla'!IT34=0,\"\",'[1]Tasa de Falla'!IT34)","v":""},{"$f":"IF('[1]Tasa de Falla'!IU34=0,\"\",'[1]Tasa de Falla'!IU34)","v":""},{"$f":"IF('[1]Tasa de Falla'!IV34=0,\"\",'[1]Tasa de Falla'!IV34)","v":""},{"$f":"IF('[1]Tasa de Falla'!IW34=0,\"\",'[1]Tasa de Falla'!IW34)","v":""},{"$f":"IF('[1]Tasa de Falla'!IX34=0,\"\",'[1]Tasa de Falla'!IX34)","v":""},{"$f":"IF('[1]Tasa de Falla'!IY34=0,\"\",'[1]Tasa de Falla'!IY34)","v":""},{"$f":"IF('[1]Tasa de Falla'!IZ34=0,\"\",'[1]Tasa de Falla'!IZ34)","v":""},{"$f":"IF('[1]Tasa de Falla'!JA34=0,\"\",'[1]Tasa de Falla'!JA34)","v":""},{"$f":"IF('[1]Tasa de Falla'!JB34=0,\"\",'[1]Tasa de Falla'!JB34)","v":""},{"$f":"IF('[1]Tasa de Falla'!JC34=0,\"\",'[1]Tasa de Falla'!JC34)","v":""}]
[null,null,{"$f":"'[1]Tasa de Falla'!C35","v":19},{"$f":"'[1]Tasa de Falla'!D35","v":"LA BANDA - SANTIAGO CENTRO"},{"$f":"'[1]Tasa de Falla'!E35","v":132},{"$f":"'[1]Tasa de Falla'!F35","v":10.91},{"$f":"IF('[1]Tasa de Falla'!IR35=0,\"\",'[1]Tasa de Falla'!IR35)","v":""},{"$f":"IF('[1]Tasa de Falla'!IS35=0,\"\",'[1]Tasa de Falla'!IS35)","v":""},{"$f":"IF('[1]Tasa de Falla'!IT35=0,\"\",'[1]Tasa de Falla'!IT35)","v":""},{"$f":"IF('[1]Tasa de Falla'!IU35=0,\"\",'[1]Tasa de Falla'!IU35)","v":""},{"$f":"IF('[1]Tasa de Falla'!IV35=0,\"\",'[1]Tasa de Falla'!IV35)","v":1},{"$f":"IF('[1]Tasa de Falla'!IW35=0,\"\",'[1]Tasa de Falla'!IW35)","v":""},{"$f":"IF('[1]Tasa de Falla'!IX35=0,\"\",'[1]Tasa de Falla'!IX35)","v":""},{"$f":"IF('[1]Tasa de Falla'!IY35=0,\"\",'[1]Tasa de Falla'!IY35)","v":"XXXX"},{"$f":"IF('[1]Tasa de Falla'!IZ35=0,\"\",'[1]Tasa de Falla'!IZ35)","v":"XXXX"},{"$f":"IF('[1]Tasa de Falla'!JA35=0,\"\",'[1]Tasa de Falla'!JA35)","v":"XXXX"},{"$f":"IF('[1]Tasa de Falla'!JB35=0,\"\",'[1]Tasa de Falla'!JB35)","v":"XXXX"},{"$f":"IF('[1]Tasa de Falla'!JC35=0,\"\",'[1]Tasa de Falla'!JC35)","v":"XXXX"}]
[null,null,{"$f":"'[1]Tasa de Falla'!C36","v":20},{"$f":"'[1]Tasa de Falla'!D36","v":"LIBERTADOR NOA. - PICHANAL"},{"$f":"'[1]Tasa de Falla'!E36","v":132},{"$f":"'[1]Tasa de Falla'!F36","v":76},{"$f":"IF('[1]Tasa de Falla'!IR36=0,\"\",'[1]Tasa de Falla'!IR36)","v":2},{"$f":"IF('[1]Tasa de Falla'!IS36=0,\"\",'[1]Tasa de Falla'!IS36)","v":""},{"$f":"IF('[1]Tasa de Falla'!IT36=0,\"\",'[1]Tasa de Falla'!IT36)","v":1},{"$f":"IF('[1]Tasa de Falla'!IU36=0,\"\",'[1]Tasa de Falla'!IU36)","v":1},{"$f":"IF('[1]Tasa de Falla'!IV36=0,\"\",'[1]Tasa de Falla'!IV36)","v":4},{"$f":"IF('[1]Tasa de Falla'!IW36=0,\"\",'[1]Tasa de Falla'!IW36)","v":""},{"$f":"IF('[1]Tasa de Falla'!IX36=0,\"\",'[1]Tasa de Falla'!IX36)","v":""},{"$f":"IF('[1]Tasa de Falla'!IY36=0,\"\",'[1]Tasa de Falla'!IY36)","v":""},{"$f":"IF('[1]Tasa de Falla'!IZ36=0,\"\",'[1]Tasa de Falla'!IZ36)","v":""},{"$f":"IF('[1]Tasa de Falla'!JA36=0,\"\",'[1]Tasa de Falla'!JA36)","v":""},{"$f":"IF('[1]Tasa de Falla'!JB36=0,\"\",'[1]Tasa de Falla'!JB36)","v":""},{"$f":"IF('[1]Tasa de Falla'!JC36=0,\"\",'[1]Tasa de Falla'!JC36)","v":""}]
[null,null,{"$f":"'[1]Tasa de Falla'!C37","v":21},{"$f":"'[1]Tasa de Falla'!D37","v":"GÜEMES - METAN"},{"$f":"'[1]Tasa de Falla'!E37","v":132},{"$f":"'[1]Tasa de Falla'!F37","v":97.13},{"$f":"IF('[1]Tasa de Falla'!IR37=0,\"\",'[1]Tasa de Falla'!IR37)","v":"XXXX"},{"$f":"IF('[1]Tasa de Falla'!IS37=0,\"\",'[1]Tasa de Falla'!IS37)","v":"XXXX"},{"$f":"IF('[1]Tasa de Falla'!IT37=0,\"\",'[1]Tasa de Falla'!IT37)","v":"XXXX"},{"$f":"IF('[1]Tasa de Falla'!IU37=0,\"\",'[1]Tasa de Falla'!IU37)","v":"XXXX"},{"$f":"IF('[1]Tasa de Falla'!IV37=0,\"\",'[1]Tasa de Falla'!IV37)","v":"XXXX"},{"$f":"IF('[1]Tasa de Falla'!IW37=0,\"\",'[1]Tasa de Falla'!IW37)","v":"XXXX"},{"$f":"IF('[1]Tasa de Falla'!IX37=0,\"\",'[1]Tasa de Falla'!IX37)","v":"XXXX"},{"$f":"IF('[1]Tasa de Falla'!IY37=0,\"\",'[1]Tasa de Falla'!IY37)","v":"XXXX"},{"$f":"IF('[1]Tasa de Falla'!IZ37=0,\"\",'[1]Tasa de Falla'!IZ37)","v":"XXXX"},{"$f":"IF('[1]Tasa de Falla'!JA37=0,\"\",'[1]Tasa de Falla'!JA37)","v":"XXXX"},{"$f":"IF('[1]Tasa de Falla'!JB37=0,\"\",'[1]Tasa de Falla'!JB37)","v":"XXXX"},{"$f":"IF('[1]Tasa de Falla'!JC37=0,\"\",'[1]Tasa de Falla'!JC37)","v":"XXXX"}]
[null,null,{"$f":"'[1]Tasa de Falla'!C38","v":22},{"$f":"'[1]Tasa de Falla'!D38","v":"MINETTI - SAN JUANCITO"},{"$f":"'[1]Tasa de Falla'!E38","v":132},{"$f":"'[1]Tasa de Falla'!F38","v":26},{"$f":"IF('[1]Tasa de Falla'!IR38=0,\"\",'[1]Tasa de Falla'!IR38)","v":""},{"$f":"IF('[1]Tasa de Falla'!IS38=0,\"\",'[1]Tasa de Falla'!IS38)","v":""},{"$f":"IF('[1]Tasa de Falla'!IT38=0,\"\",'[1]Tasa de Falla'!IT38)","v":""},{"$f":"IF('[1]Tasa de Falla'!IU38=0,\"\",'[1]Tasa de Falla'!IU38)","v":""},{"$f":"IF('[1]Tasa de Falla'!IV38=0,\"\",'[1]Tasa de Falla'!IV38)","v":""},{"$f":"IF('[1]Tasa de Falla'!IW38=0,\"\",'[1]Tasa de Falla'!IW38)","v":""},{"$f":"IF('[1]Tasa de Falla'!IX38=0,\"\",'[1]Tasa de Falla'!IX38)","v":2},{"$f":"IF('[1]Tasa de Falla'!IY38=0,\"\",'[1]Tasa de Falla'!IY38)","v":""},{"$f":"IF('[1]Tasa de Falla'!IZ38=0,\"\",'[1]Tasa de Falla'!IZ38)","v":""},{"$f":"IF('[1]Tasa de Falla'!JA38=0,\"\",'[1]Tasa de Falla'!JA38)","v":1},{"$f":"IF('[1]Tasa de Falla'!JB38=0,\"\",'[1]Tasa de Falla'!JB38)","v":""},{"$f":"IF('[1]Tasa de Falla'!JC38=0,\"\",'[1]Tasa de Falla'!JC38)","v":""}]
[null,null,{"$f":"'[1]Tasa de Falla'!C39","v":23},{"$f":"'[1]Tasa de Falla'!D39","v":"PALPALA - JUJUY SUR"},{"$f":"'[1]Tasa de Falla'!E39","v":132},{"$f":"'[1]Tasa de Falla'!F39","v":14},{"$f":"IF('[1]Tasa de Falla'!IR39=0,\"\",'[1]Tasa de Falla'!IR39)","v":"XXXX"},{"$f":"IF('[1]Tasa de Falla'!IS39=0,\"\",'[1]Tasa de Falla'!IS39)","v":"XXXX"},{"$f":"IF('[1]Tasa de Falla'!IT39=0,\"\",'[1]Tasa de Falla'!IT39)","v":"XXXX"},{"$f":"IF('[1]Tasa de Falla'!IU39=0,\"\",'[1]Tasa de Falla'!IU39)","v":"XXXX"},{"$f":"IF('[1]Tasa de Falla'!IV39=0,\"\",'[1]Tasa de Falla'!IV39)","v":"XXXX"},{"$f":"IF('[1]Tasa de Falla'!IW39=0,\"\",'[1]Tasa de Falla'!IW39)","v":"XXXX"},{"$f":"IF('[1]Tasa de Falla'!IX39=0,\"\",'[1]Tasa de Falla'!IX39)","v":"XXXX"},{"$f":"IF('[1]Tasa de Falla'!IY39=0,\"\",'[1]Tasa de Falla'!IY39)","v":"XXXX"},{"$f":"IF('[1]Tasa de Falla'!IZ39=0,\"\",'[1]Tasa de Falla'!IZ39)","v":"XXXX"},{"$f":"IF('[1]Tasa de Falla'!JA39=0,\"\",'[1]Tasa de Falla'!JA39)","v":"XXXX"},{"$f":"IF('[1]Tasa de Falla'!JB39=0,\"\",'[1]Tasa de Falla'!JB39)","v":"XXXX"},{"$f":"IF('[1]Tasa de Falla'!JC39=0,\"\",'[1]Tasa de Falla'!JC39)","v":"XXXX"}]
[null,null,{"$f":"'[1]Tasa de Falla'!C40","v":24},{"$f":"'[1]Tasa de Falla'!D40","v":"ORAN - PICHANAL"},{"$f":"'[1]Tasa de Falla'!E40","v":132},{"$f":"'[1]Tasa de Falla'!F40","v":17},{"$f":"IF('[1]Tasa de Falla'!IR40=0,\"\",'[1]Tasa de Falla'!IR40)","v":"XXXX"},{"$f":"IF('[1]Tasa de Falla'!IS40=0,\"\",'[1]Tasa de Falla'!IS40)","v":"XXXX"},{"$f":"IF('[1]Tasa de Falla'!IT40=0,\"\",'[1]Tasa de Falla'!IT40)","v":"XXXX"},{"$f":"IF('[1]Tasa de Falla'!IU40=0,\"\",'[1]Tasa de Falla'!IU40)","v":"XXXX"},{"$f":"IF('[1]Tasa de Falla'!IV40=0,\"\",'[1]Tasa de Falla'!IV40)","v":"XXXX"},{"$f":"IF('[1]Tasa de Falla'!IW40=0,\"\",'[1]Tasa de Falla'!IW40)","v":"XXXX"},{"$f":"IF('[1]Tasa de Falla'!IX40=0,\"\",'[1]Tasa de Falla'!IX40)","v":"XXXX"},{"$f":"IF('[1]Tasa de Falla'!IY40=0,\"\",'[1]Tasa de Falla'!IY40)","v":"XXXX"},{"$f":"IF('[1]Tasa de Falla'!IZ40=0,\"\",'[1]Tasa de Falla'!IZ40)","v":"XXXX"},{"$f":"IF('[1]Tasa de Falla'!JA40=0,\"\",'[1]Tasa de Falla'!JA40)","v":"XXXX"},{"$f":"IF('[1]Tasa de Falla'!JB40=0,\"\",'[1]Tasa de Falla'!JB40)","v":"XXXX"},{"$f":"IF('[1]Tasa de Falla'!JC40=0,\"\",'[1]Tasa de Falla'!JC40)","v":"XXXX"}]
[null,null,{"$f":"'[1]Tasa de Falla'!C41","v":25},{"$f":"'[1]Tasa de Falla'!D41","v":"PICHANAL - TARTAGAL"},{"$f":"'[1]Tasa de Falla'!E41","v":132},{"$f":"'[1]Tasa de Falla'!F41","v":105},{"$f":"IF('[1]Tasa de Falla'!IR41=0,\"\",'[1]Tasa de Falla'!IR41)","v":1},{"$f":"IF('[1]Tasa de Falla'!IS41=0,\"\",'[1]Tasa de Falla'!IS41)","v":""},{"$f":"IF('[1]Tasa de Falla'!IT41=0,\"\",'[1]Tasa de Falla'!IT41)","v":""},{"$f":"IF('[1]Tasa de Falla'!IU41=0,\"\",'[1]Tasa de Falla'!IU41)","v":""},{"$f":"IF('[1]Tasa de Falla'!IV41=0,\"\",'[1]Tasa de Falla'!IV41)","v":"XXXX"},{"$f":"IF('[1]Tasa de Falla'!IW41=0,\"\",'[1]Tasa de Falla'!IW41)","v":"XXXX"},{"$f":"IF('[1]Tasa de Falla'!IX41=0,\"\",'[1]Tasa de Falla'!IX41)","v":"XXXX"},{"$f":"IF('[1]Tasa de Falla'!IY41=0,\"\",'[1]Tasa de Falla'!IY41)","v":"XXXX"},{"$f":"IF('[1]Tasa de Falla'!IZ41=0,\"\",'[1]Tasa de Falla'!IZ41)","v":"XXXX"},{"$f":"IF('[1]Tasa de Falla'!JA41=0,\"\",'[1]Tasa de Falla'!JA41)","v":"XXXX"},{"$f":"IF('[1]Tasa de Falla'!JB41=0,\"\",'[1]Tasa de Falla'!JB41)","v":"XXXX"},{"$f":"IF('[1]Tasa de Falla'!JC41=0,\"\",'[1]Tasa de Falla'!JC41)","v":"XXXX"}]
[null,null,{"$f":"'[1]Tasa de Falla'!C42","v":26},{"$f":"'[1]Tasa de Falla'!D42","v":"C.H. RIO HONDO - LA BANDA"},{"$f":"'[1]Tasa de Falla'!E42","v":132},{"$f":"'[1]Tasa de Falla'!F42","v":76.5},{"$f":"IF('[1]Tasa de Falla'!IR42=0,\"\",'[1]Tasa de Falla'!IR42)","v":""},{"$f":"IF('[1]Tasa de Falla'!IS42=0,\"\",'[1]Tasa de Falla'!IS42)","v":""},{"$f":"IF('[1]Tasa de Falla'!IT42=0,\"\",'[1]Tasa de Falla'!IT42)","v":2},{"$f":"IF('[1]Tasa de Falla'!IU42=0,\"\",'[1]Tasa de Falla'!IU42)","v":""},{"$f":"IF('[1]Tasa de Falla'!IV42=0,\"\",'[1]Tasa de Falla'!IV42)","v":1},{"$f":"IF('[1]Tasa de Falla'!IW42=0,\"\",'[1]Tasa de Falla'!IW42)","v":""},{"$f":"IF('[1]Tasa de Falla'!IX42=0,\"\",'[1]Tasa de Falla'!IX42)","v":""},{"$f":"IF('[1]Tasa de Falla'!IY42=0,\"\",'[1]Tasa de Falla'!IY42)","v":""},{"$f":"IF('[1]Tasa de Falla'!IZ42=0,\"\",'[1]Tasa de Falla'!IZ42)","v":""},{"$f":"IF('[1]Tasa de Falla'!JA42=0,\"\",'[1]Tasa de Falla'!JA42)","v":""},{"$f":"IF('[1]Tasa de Falla'!JB42=0,\"\",'[1]Tasa de Falla'!JB42)","v":""},{"$f":"IF('[1]Tasa de Falla'!JC42=0,\"\",'[1]Tasa de Falla'!JC42)","v":""}]
[null,null,{"$f":"'[1]Tasa de Falla'!C43","v":27},{"$f":"'[1]Tasa de Falla'!D43","v":"LA RIOJA - RECREO  2"},{"$f":"'[1]Tasa de Falla'!E43","v":132},{"$f":"'[1]Tasa de Falla'!F43","v":220},{"$f":"IF('[1]Tasa de Falla'!IR43=0,\"\",'[1]Tasa de Falla'!IR43)","v":"XXXX"},{"$f":"IF('[1]Tasa de Falla'!IS43=0,\"\",'[1]Tasa de Falla'!IS43)","v":"XXXX"},{"$f":"IF('[1]Tasa de Falla'!IT43=0,\"\",'[1]Tasa de Falla'!IT43)","v":"XXXX"},{"$f":"IF('[1]Tasa de Falla'!IU43=0,\"\",'[1]Tasa de Falla'!IU43)","v":"XXXX"},{"$f":"IF('[1]Tasa de Falla'!IV43=0,\"\",'[1]Tasa de Falla'!IV43)","v":"XXXX"},{"$f":"IF('[1]Tasa de Falla'!IW43=0,\"\",'[1]Tasa de Falla'!IW43)","v":"XXXX"},{"$f":"IF('[1]Tasa de Falla'!IX43=0,\"\",'[1]Tasa de Falla'!IX43)","v":"XXXX"},{"$f":"IF('[1]Tasa de Falla'!IY43=0,\"\",'[1]Tasa de Falla'!IY43)","v":"XXXX"},{"$f":"IF('[1]Tasa de Falla'!IZ43=0,\"\",'[1]Tasa de Falla'!IZ43)","v":"XXXX"},{"$f":"IF('[1]Tasa de Falla'!JA43=0,\"\",'[1]Tasa de Falla'!JA43)","v":"XXXX"},{"$f":"IF('[1]Tasa de Falla'!JB43=0,\"\",'[1]Tasa de Falla'!JB43)","v":"XXXX"},{"$f":"IF('[1]Tasa de Falla'!JC43=0,\"\",'[1]Tasa de Falla'!JC43)","v":"XXXX"}]
[null,null,{"$f":"'[1]Tasa de Falla'!C44","v":28},{"$f":"'[1]Tasa de Falla'!D44","v":"CAMPO SANTO - SALTA SUR"},{"$f":"'[1]Tasa de Falla'!E44","v":132},{"$f":"'[1]Tasa de Falla'!F44","v":40.92},{"$f":"IF('[1]Tasa de Falla'!IR44=0,\"\",'[1]Tasa de Falla'!IR44)","v":"XXXX"},{"$f":"IF('[1]Tasa de Falla'!IS44=0,\"\",'[1]Tasa de Falla'!IS44)","v":"XXXX"},{"$f":"IF('[1]Tasa de Falla'!IT44=0,\"\",'[1]Tasa de Falla'!IT44)","v":"XXXX"},{"$f":"IF('[1]Tasa de Falla'!IU44=0,\"\",'[1]Tasa de Falla'!IU44)","v":"XXXX"},{"$f":"IF('[1]Tasa de Falla'!IV44=0,\"\",'[1]Tasa de Falla'!IV44)","v":"XXXX"},{"$f":"IF('[1]Tasa de Falla'!IW44=0,\"\",'[1]Tasa de Falla'!IW44)","v":"XXXX"},{"$f":"IF('[1]Tasa de Falla'!IX44=0,\"\",'[1]Tasa de Falla'!IX44)","v":"XXXX"},{"$f":"IF('[1]Tasa de Falla'!IY44=0,\"\",'[1]Tasa de Falla'!IY44)","v":"XXXX"},{"$f":"IF('[1]Tasa de Falla'!IZ44=0,\"\",'[1]Tasa de Falla'!IZ44)","v":"XXXX"},{"$f":"IF('[1]Tasa de Falla'!JA44=0,\"\",'[1]Tasa de Falla'!JA44)","v":"XXXX"},{"$f":"IF('[1]Tasa de Falla'!JB44=0,\"\",'[1]Tasa de Falla'!JB44)","v":"XXXX"},{"$f":"IF('[1]Tasa de Falla'!JC44=0,\"\",'[1]Tasa de Falla'!JC44)","v":"XXXX"}]
[null,null,{"$f":"'[1]Tasa de Falla'!C45","v":29},{"$f":"'[1]Tasa de Falla'!D45","v":"PALPALA - SAN JUANCITO"},{"$f":"'[1]Tasa de Falla'!E45","v":132},{"$f":"'[1]Tasa de Falla'!F45","v":23.9},{"$f":"IF('[1]Tasa de Falla'!IR45=0,\"\",'[1]Tasa de Falla'!IR45)","v":""},{"$f":"IF('[1]Tasa de Falla'!IS45=0,\"\",'[1]Tasa de Falla'!IS45)","v":""},{"$f":"IF('[1]Tasa de Falla'!IT45=0,\"\",'[1]Tasa de Falla'!IT45)","v":2},{"$f":"IF('[1]Tasa de Falla'!IU45=0,\"\",'[1]Tasa de Falla'!IU45)","v":""},{"$f":"IF('[1]Tasa de Falla'!IV45=0,\"\",'[1]Tasa de Falla'!IV45)","v":""},{"$f":"IF('[1]Tasa de Falla'!IW45=0,\"\",'[1]Tasa de Falla'!IW45)","v":2},{"$f":"IF('[1]Tasa de Falla'!IX45=0,\"\",'[1]Tasa de Falla'!IX45)","v":2},{"$f":"IF('[1]Tasa de Falla'!IY45=0,\"\",'[1]Tasa de Falla'!IY45)","v":""},{"$f":"IF('[1]Tasa de Falla'!IZ45=0,\"\",'[1]Tasa de Falla'!IZ45)","v":""},{"$f":"IF('[1]Tasa de Falla'!JA45=0,\"\",'[1]Tasa de Falla'!JA45)","v":""},{"$f":"IF('[1]Tasa de Falla'!JB45=0,\"\",'[1]Tasa de Falla'!JB45)","v":""},{"$f":"IF('[1]Tasa de Falla'!JC45=0,\"\",'[1]Tasa de Falla'!JC45)","v":""}]
[null,null,{"$f":"'[1]Tasa de Falla'!C46","v":30},{"$f":"'[1]Tasa de Falla'!D46","v":"SAN JUANCITO - SAN PEDRO JUJUY"},{"$f":"'[1]Tasa de Falla'!E46","v":132},{"$f":"'[1]Tasa de Falla'!F46","v":27},{"$f":"IF('[1]Tasa de Falla'!IR46=0,\"\",'[1]Tasa de Falla'!IR46)","v":""},{"$f":"IF('[1]Tasa de Falla'!IS46=0,\"\",'[1]Tasa de Falla'!IS46)","v":""},{"$f":"IF('[1]Tasa de Falla'!IT46=0,\"\",'[1]Tasa de Falla'!IT46)","v":""},{"$f":"IF('[1]Tasa de Falla'!IU46=0,\"\",'[1]Tasa de Falla'!IU46)","v":""},{"$f":"IF('[1]Tasa de Falla'!IV46=0,\"\",'[1]Tasa de Falla'!IV46)","v":""},{"$f":"IF('[1]Tasa de Falla'!IW46=0,\"\",'[1]Tasa de Falla'!IW46)","v":""},{"$f":"IF('[1]Tasa de Falla'!IX46=0,\"\",'[1]Tasa de Falla'!IX46)","v":""},{"$f":"IF('[1]Tasa de Falla'!IY46=0,\"\",'[1]Tasa de Falla'!IY46)","v":""},{"$f":"IF('[1]Tasa de Falla'!IZ46=0,\"\",'[1]Tasa de Falla'!IZ46)","v":""},{"$f":"IF('[1]Tasa de Falla'!JA46=0,\"\",'[1]Tasa de Falla'!JA46)","v":""},{"$f":"IF('[1]Tasa de Falla'!JB46=0,\"\",'[1]Tasa de Falla'!JB46)","v":""},{"$f":"IF('[1]Tasa de Falla'!JC46=0,\"\",'[1]Tasa de Falla'!JC46)","v":""}]
[null,null,{"$f":"'[1]Tasa de Falla'!C47","v":31},{"$f":"'[1]Tasa de Falla'!D47","v":"SAN MARTIN - CATAMARCA"},{"$f":"'[1]Tasa de Falla'!E47","v":132},{"$f":"'[1]Tasa de Falla'!F47","v":88},{"$f":"IF('[1]Tasa de Falla'!IR47=0,\"\",'[1]Tasa de Falla'!IR47)","v":"XXXX"},{"$f":"IF('[1]Tasa de Falla'!IS47=0,\"\",'[1]Tasa de Falla'!IS47)","v":"XXXX"},{"$f":"IF('[1]Tasa de Falla'!IT47=0,\"\",'[1]Tasa de Falla'!IT47)","v":"XXXX"},{"$f":"IF('[1]Tasa de Falla'!IU47=0,\"\",'[1]Tasa de Falla'!IU47)","v":"XXXX"},{"$f":"IF('[1]Tasa de Falla'!IV47=0,\"\",'[1]Tasa de Falla'!IV47)","v":"XXXX"},{"$f":"IF('[1]Tasa de Falla'!IW47=0,\"\",'[1]Tasa de Falla'!IW47)","v":"XXXX"},{"$f":"IF('[1]Tasa de Falla'!IX47=0,\"\",'[1]Tasa de Falla'!IX47)","v":"XXXX"},{"$f":"IF('[1]Tasa de Falla'!IY47=0,\"\",'[1]Tasa de Falla'!IY47)","v":"XXXX"},{"$f":"IF('[1]Tasa de Falla'!IZ47=0,\"\",'[1]Tasa de Falla'!IZ47)","v":"XXXX"},{"$f":"IF('[1]Tasa de Falla'!JA47=0,\"\",'[1]Tasa de Falla'!JA47)","v":"XXXX"},{"$f":"IF('[1]Tasa de Falla'!JB47=0,\"\",'[1]Tasa de Falla'!JB47)","v":"XXXX"},{"$f":"IF('[1]Tasa de Falla'!JC47=0,\"\",'[1]Tasa de Falla'!JC47)","v":"XXXX"}]
[null,null,{"$f":"'[1]Tasa de Falla'!C48","v":32},{"$f":"'[1]Tasa de Falla'!D48","v":"SAN MARTIN - RECREO"},{"$f":"'[1]Tasa de Falla'!E48","v":132},{"$f":"'[1]Tasa de Falla'!F48","v":115},{"$f":"IF('[1]Tasa de Falla'!IR48=0,\"\",'[1]Tasa de Falla'!IR48)","v":"XXXX"},{"$f":"IF('[1]Tasa de Falla'!IS48=0,\"\",'[1]Tasa de Falla'!IS48)","v":"XXXX"},{"$f":"IF('[1]Tasa de Falla'!IT48=0,\"\",'[1]Tasa de Falla'!IT48)","v":"XXXX"},{"$f":"IF('[1]Tasa de Falla'!IU48=0,\"\",'[1]Tasa de Falla'!IU48)","v":"XXXX"},{"$f":"IF('[1]Tasa de Falla'!IV48=0,\"\",'[1]Tasa de Falla'!IV48)","v":"XXXX"},{"$f":"IF('[1]Tasa de Falla'!IW48=0,\"\",'[1]Tasa de Falla'!IW48)","v":"XXXX"},{"$f":"IF('[1]Tasa de Falla'!IX48=0,\"\",'[1]Tasa de Falla'!IX48)","v":"XXXX"},{"$f":"IF('[1]Tasa de Falla'!IY48=0,\"\",'[1]Tasa de Falla'!IY48)","v":"XXXX"},{"$f":"IF('[1]Tasa de Falla'!IZ48=0,\"\",'[1]Tasa de Falla'!IZ48)","v":"XXXX"},{"$f":"IF('[1]Tasa de Falla'!JA48=0,\"\",'[1]Tasa de Falla'!JA48)","v":"XXXX"},{"$f":"IF('[1]Tasa de Falla'!JB48=0,\"\",'[1]Tasa de Falla'!JB48)","v":"XXXX"},{"$f":"IF('[1]Tasa de Falla'!JC48=0,\"\",'[1]Tasa de Falla'!JC48)","v":"XXXX"}]
[null,null,{"$f":"'[1]Tasa de Falla'!C49","v":33},{"$f":"'[1]Tasa de Falla'!D49","v":"SAN MARTIN C. - LA RIOJA"},{"$f":"'[1]Tasa de Falla'!E49","v":132},{"$f":"'[1]Tasa de Falla'!F49","v":105},{"$f":"IF('[1]Tasa de Falla'!IR49=0,\"\",'[1]Tasa de Falla'!IR49)","v":"XXXX"},{"$f":"IF('[1]Tasa de Falla'!IS49=0,\"\",'[1]Tasa de Falla'!IS49)","v":"XXXX"},{"$f":"IF('[1]Tasa de Falla'!IT49=0,\"\",'[1]Tasa de Falla'!IT49)","v":"XXXX"},{"$f":"IF('[1]Tasa de Falla'!IU49=0,\"\",'[1]Tasa de Falla'!IU49)","v":"XXXX"},{"$f":"IF('[1]Tasa de Falla'!IV49=0,\"\",'[1]Tasa de Falla'!IV49)","v":"XXXX"},{"$f":"IF('[1]Tasa de Falla'!IW49=0,\"\",'[1]Tasa de Falla'!IW49)","v":"XXXX"},{"$f":"IF('[1]Tasa de Falla'!IX49=0,\"\",'[1]Tasa de Falla'!IX49)","v":"XXXX"},{"$f":"IF('[1]Tasa de Falla'!IY49=0,\"\",'[1]Tasa de Falla'!IY49)","v":"XXXX"},{"$f":"IF('[1]Tasa de Falla'!IZ49=0,\"\",'[1]Tasa de Falla'!IZ49)","v":"XXXX"},{"$f":"IF('[1]Tasa de Falla'!JA49=0,\"\",'[1]Tasa de Falla'!JA49)","v":"XXXX"},{"$f":"IF('[1]Tasa de Falla'!JB49=0,\"\",'[1]Tasa de Falla'!JB49)","v":"XXXX"},{"$f":"IF('[1]Tasa de Falla'!JC49=0,\"\",'[1]Tasa de Falla'!JC49)","v":"XXXX"}]
[null,null,{"$f":"'[1]Tasa de Falla'!C50","v":34},{"$f":"'[1]Tasa de Falla'!D50","v":"SAN PEDRO JUJUY - LIBERTADOR NOA."},{"$f":"'[1]Tasa de Falla'!E50","v":132},{"$f":"'[1]Tasa de Falla'!F50","v":49},{"$f":"IF('[1]Tasa de Falla'!IR50=0,\"\",'[1]Tasa de Falla'!IR50)","v":1},{"$f":"IF('[1]Tasa de Falla'!IS50=0,\"\",'[1]Tasa de Falla'!IS50)","v":""},{"$f":"IF('[1]Tasa de Falla'!IT50=0,\"\",'[1]Tasa de Falla'!IT50)","v":""},{"$f":"IF('[1]Tasa de Falla'!IU50=0,\"\",'[1]Tasa de Falla'!IU50)","v":""},{"$f":"IF('[1]Tasa de Falla'!IV50=0,\"\",'[1]Tasa de Falla'!IV50)","v":""},{"$f":"IF('[1]Tasa de Falla'!IW50=0,\"\",'[1]Tasa de Falla'!IW50)","v":""},{"$f":"IF('[1]Tasa de Falla'!IX50=0,\"\",'[1]Tasa de Falla'!IX50)","v":""},{"$f":"IF('[1]Tasa de Falla'!IY50=0,\"\",'[1]Tasa de Falla'!IY50)","v":""},{"$f":"IF('[1]Tasa de Falla'!IZ50=0,\"\",'[1]Tasa de Falla'!IZ50)","v":""},{"$f":"IF('[1]Tasa de Falla'!JA50=0,\"\",'[1]Tasa de Falla'!JA50)","v":""},{"$f":"IF('[1]Tasa de Falla'!JB50=0,\"\",'[1]Tasa de Falla'!JB50)","v":""},{"$f":"IF('[1]Tasa de Falla'!JC50=0,\"\",'[1]Tasa de Falla'!JC50)","v":""}]
[null,null,{"$f":"'[1]Tasa de Falla'!C51","v":35},{"$f":"'[1]Tasa de Falla'!D51","v":"TUCUMAN NORTE - EL BRACHO"},{"$f":"'[1]Tasa de Falla'!E51","v":132},{"$f":"'[1]Tasa de Falla'!F51","v":31.5},{"$f":"IF('[1]Tasa de Falla'!IR51=0,\"\",'[1]Tasa de Falla'!IR51)","v":1},{"$f":"IF('[1]Tasa de Falla'!IS51=0,\"\",'[1]Tasa de Falla'!IS51)","v":""},{"$f":"IF('[1]Tasa de Falla'!IT51=0,\"\",'[1]Tasa de Falla'!IT51)","v":""},{"$f":"IF('[1]Tasa de Falla'!IU51=0,\"\",'[1]Tasa de Falla'!IU51)","v":""},{"$f":"IF('[1]Tasa de Falla'!IV51=0,\"\",'[1]Tasa de Falla'!IV51)","v":""},{"$f":"IF('[1]Tasa de Falla'!IW51=0,\"\",'[1]Tasa de Falla'!IW51)","v":""},{"$f":"IF('[1]Tasa de Falla'!IX51=0,\"\",'[1]Tasa de Falla'!IX51)","v":""},{"$f":"IF('[1]Tasa de Falla'!IY51=0,\"\",'[1]Tasa de Falla'!IY51)","v":""},{"$f":"IF('[1]Tasa de Falla'!IZ51=0,\"\",'[1]Tasa de Falla'!IZ51)","v":""},{"$f":"IF('[1]Tasa de Falla'!JA51=0,\"\",'[1]Tasa de Falla'!JA51)","v":1},{"$f":"IF('[1]Tasa de Falla'!JB51=0,\"\",'[1]Tasa de Falla'!JB51)","v":""},{"$f":"IF('[1]Tasa de Falla'!JC51=0,\"\",'[1]Tasa de Falla'!JC51)","v":""}]
[null,null,{"$f":"'[1]Tasa de Falla'!C52","v":36},{"$f":"'[1]Tasa de Falla'!D52","v":"C.H. EL CADILLAL - TUCUMAN NORTE"},{"$f":"'[1]Tasa de Falla'!E52","v":132},{"$f":"'[1]Tasa de Falla'!F52","v":21.8},{"$f":"IF('[1]Tasa de Falla'!IR52=0,\"\",'[1]Tasa de Falla'!IR52)","v":""},{"$f":"IF('[1]Tasa de Falla'!IS52=0,\"\",'[1]Tasa de Falla'!IS52)","v":""},{"$f":"IF('[1]Tasa de Falla'!IT52=0,\"\",'[1]Tasa de Falla'!IT52)","v":1},{"$f":"IF('[1]Tasa de Falla'!IU52=0,\"\",'[1]Tasa de Falla'!IU52)","v":2},{"$f":"IF('[1]Tasa de Falla'!IV52=0,\"\",'[1]Tasa de Falla'!IV52)","v":""},{"$f":"IF('[1]Tasa de Falla'!IW52=0,\"\",'[1]Tasa de Falla'!IW52)","v":1},{"$f":"IF('[1]Tasa de Falla'!IX52=0,\"\",'[1]Tasa de Falla'!IX52)","v":""},{"$f":"IF('[1]Tasa de Falla'!IY52=0,\"\",'[1]Tasa de Falla'!IY52)","v":""},{"$f":"IF('[1]Tasa de Falla'!IZ52=0,\"\",'[1]Tasa de Falla'!IZ52)","v":""},{"$f":"IF('[1]Tasa de Falla'!JA52=0,\"\",'[1]Tasa de Falla'!JA52)","v":""},{"$f":"IF('[1]Tasa de Falla'!JB52=0,\"\",'[1]Tasa de Falla'!JB52)","v":""},{"$f":"IF('[1]Tasa de Falla'!JC52=0,\"\",'[1]Tasa de Falla'!JC52)","v":""}]
[null,null,{"$f":"'[1]Tasa de Falla'!C53","v":37},{"$f":"'[1]Tasa de Falla'!D53","v":"TUCUMAN NORTE - CABRA CORRAL"},{"$f":"'[1]Tasa de Falla'!E53","v":132},{"$f":"'[1]Tasa de Falla'!F53","v":190},{"$f":"IF('[1]Tasa de Falla'!IR53=0,\"\",'[1]Tasa de Falla'!IR53)","v":"XXXX"},{"$f":"IF('[1]Tasa de Falla'!IS53=0,\"\",'[1]Tasa de Falla'!IS53)","v":"XXXX"},{"$f":"IF('[1]Tasa de Falla'!IT53=0,\"\",'[1]Tasa de Falla'!IT53)","v":"XXXX"},{"$f":"IF('[1]Tasa de Falla'!IU53=0,\"\",'[1]Tasa de Falla'!IU53)","v":"XXXX"},{"$f":"IF('[1]Tasa de Falla'!IV53=0,\"\",'[1]Tasa de Falla'!IV53)","v":"XXXX"},{"$f":"IF('[1]Tasa de Falla'!IW53=0,\"\",'[1]Tasa de Falla'!IW53)","v":"XXXX"},{"$f":"IF('[1]Tasa de Falla'!IX53=0,\"\",'[1]Tasa de Falla'!IX53)","v":"XXXX"},{"$f":"IF('[1]Tasa de Falla'!IY53=0,\"\",'[1]Tasa de Falla'!IY53)","v":"XXXX"},{"$f":"IF('[1]Tasa de Falla'!IZ53=0,\"\",'[1]Tasa de Falla'!IZ53)","v":"XXXX"},{"$f":"IF('[1]Tasa de Falla'!JA53=0,\"\",'[1]Tasa de Falla'!JA53)","v":"XXXX"},{"$f":"IF('[1]Tasa de Falla'!JB53=0,\"\",'[1]Tasa de Falla'!JB53)","v":"XXXX"},{"$f":"IF('[1]Tasa de Falla'!JC53=0,\"\",'[1]Tasa de Falla'!JC53)","v":"XXXX"}]
[null,null,{"$f":"'[1]Tasa de Falla'!C54","v":38},{"$f":"'[1]Tasa de Falla'!D54","v":"METAN - TUCUMAN NORTE"},{"$f":"'[1]Tasa de Falla'!E54","v":132},{"$f":"'[1]Tasa de Falla'!F54","v":155.6},{"$f":"IF('[1]Tasa de Falla'!IR54=0,\"\",'[1]Tasa de Falla'!IR54)","v":1},{"$f":"IF('[1]Tasa de Falla'!IS54=0,\"\",'[1]Tasa de Falla'!IS54)","v":1},{"$f":"IF('[1]Tasa de Falla'!IT54=0,\"\",'[1]Tasa de Falla'!IT54)","v":1},{"$f":"IF('[1]Tasa de Falla'!IU54=0,\"\",'[1]Tasa de Falla'!IU54)","v":""},{"$f":"IF('[1]Tasa de Falla'!IV54=0,\"\",'[1]Tasa de Falla'!IV54)","v":""},{"$f":"IF('[1]Tasa de Falla'!IW54=0,\"\",'[1]Tasa de Falla'!IW54)","v":""},{"$f":"IF('[1]Tasa de Falla'!IX54=0,\"\",'[1]Tasa de Falla'!IX54)","v":""},{"$f":"IF('[1]Tasa de Falla'!IY54=0,\"\",'[1]Tasa de Falla'!IY54)","v":""},{"$f":"IF('[1]Tasa de Falla'!IZ54=0,\"\",'[1]Tasa de Falla'!IZ54)","v":""},{"$f":"IF('[1]Tasa de Falla'!JA54=0,\"\",'[1]Tasa de Falla'!JA54)","v":""},{"$f":"IF('[1]Tasa de Falla'!JB54=0,\"\",'[1]Tasa de Falla'!JB54)","v":""},{"$f":"IF('[1]Tasa de Falla'!JC54=0,\"\",'[1]Tasa de Falla'!JC54)","v":""}]
[null,null,{"$f":"'[1]Tasa de Falla'!C55","v":39},{"$f":"'[1]Tasa de Falla'!D55","v":"SARMIENTO - TUCUMAN NORTE (O.F.)"},{"$f":"'[1]Tasa de Falla'!E55","v":132},{"$f":"'[1]Tasa de Falla'!F55","v":3.3},{"$f":"IF('[1]Tasa de Falla'!IR55=0,\"\",'[1]Tasa de Falla'!IR55)","v":""},{"$f":"IF('[1]Tasa de Falla'!IS55=0,\"\",'[1]Tasa de Falla'!IS55)","v":""},{"$f":"IF('[1]Tasa de Falla'!IT55=0,\"\",'[1]Tasa de Falla'!IT55)","v":""},{"$f":"IF('[1]Tasa de Falla'!IU55=0,\"\",'[1]Tasa de Falla'!IU55)","v":""},{"$f":"IF('[1]Tasa de Falla'!IV55=0,\"\",'[1]Tasa de Falla'!IV55)","v":""},{"$f":"IF('[1]Tasa de Falla'!IW55=0,\"\",'[1]Tasa de Falla'!IW55)","v":""},{"$f":"IF('[1]Tasa de Falla'!IX55=0,\"\",'[1]Tasa de Falla'!IX55)","v":""},{"$f":"IF('[1]Tasa de Falla'!IY55=0,\"\",'[1]Tasa de Falla'!IY55)","v":""},{"$f":"IF('[1]Tasa de Falla'!IZ55=0,\"\",'[1]Tasa de Falla'!IZ55)","v":""},{"$f":"IF('[1]Tasa de Falla'!JA55=0,\"\",'[1]Tasa de Falla'!JA55)","v":""},{"$f":"IF('[1]Tasa de Falla'!JB55=0,\"\",'[1]Tasa de Falla'!JB55)","v":""},{"$f":"IF('[1]Tasa de Falla'!JC55=0,\"\",'[1]Tasa de Falla'!JC55)","v":""}]
[null,null,{"$f":"'[1]Tasa de Falla'!C56","v":40},{"$f":"'[1]Tasa de Falla'!D56","v":"TUCUMAN OESTE - TUCUMAN NORTE"},{"$f":"'[1]Tasa de Falla'!E56","v":132},{"$f":"'[1]Tasa de Falla'!F56","v":7},{"$f":"IF('[1]Tasa de Falla'!IR56=0,\"\",'[1]Tasa de Falla'!IR56)","v":1},{"$f":"IF('[1]Tasa de Falla'!IS56=0,\"\",'[1]Tasa de Falla'!IS56)","v":""},{"$f":"IF('[1]Tasa de Falla'!IT56=0,\"\",'[1]Tasa de Falla'!IT56)","v":""},{"$f":"IF('[1]Tasa de Falla'!IU56=0,\"\",'[1]Tasa de Falla'!IU56)","v":""},{"$f":"IF('[1]Tasa de Falla'!IV56=0,\"\",'[1]Tasa de Falla'!IV56)","v":""},{"$f":"IF('[1]Tasa de Falla'!IW56=0,\"\",'[1]Tasa de Falla'!IW56)","v":""},{"$f":"IF('[1]Tasa de Falla'!IX56=0,\"\",'[1]Tasa de Falla'!IX56)","v":""},{"$f":"IF('[1]Tasa de Falla'!IY56=0,\"\",'[1]Tasa de Falla'!IY56)","v":""},{"$f":"IF('[1]Tasa de Falla'!IZ56=0,\"\",'[1]Tasa de Falla'!IZ56)","v":1},{"$f":"IF('[1]Tasa de Falla'!JA56=0,\"\",'[1]Tasa de Falla'!JA56)","v":1},{"$f":"IF('[1]Tasa de Falla'!JB56=0,\"\",'[1]Tasa de Falla'!JB56)","v":""},{"$f":"IF('[1]Tasa de Falla'!JC56=0,\"\",'[1]Tasa de Falla'!JC56)","v":""}]
[null,null,{"$f":"'[1]Tasa de Falla'!C57","v":41},{"$f":"'[1]Tasa de Falla'!D57","v":"AGUILARES - VILLA QUINTEROS"},{"$f":"'[1]Tasa de Falla'!E57","v":132},{"$f":"'[1]Tasa de Falla'!F57","v":21},{"$f":"IF('[1]Tasa de Falla'!IR57=0,\"\",'[1]Tasa de Falla'!IR57)","v":""},{"$f":"IF('[1]Tasa de Falla'!IS57=0,\"\",'[1]Tasa de Falla'!IS57)","v":""},{"$f":"IF('[1]Tasa de Falla'!IT57=0,\"\",'[1]Tasa de Falla'!IT57)","v":""},{"$f":"IF('[1]Tasa de Falla'!IU57=0,\"\",'[1]Tasa de Falla'!IU57)","v":""},{"$f":"IF('[1]Tasa de Falla'!IV57=0,\"\",'[1]Tasa de Falla'!IV57)","v":""},{"$f":"IF('[1]Tasa de Falla'!IW57=0,\"\",'[1]Tasa de Falla'!IW57)","v":1},{"$f":"IF('[1]Tasa de Falla'!IX57=0,\"\",'[1]Tasa de Falla'!IX57)","v":""},{"$f":"IF('[1]Tasa de Falla'!IY57=0,\"\",'[1]Tasa de Falla'!IY57)","v":""},{"$f":"IF('[1]Tasa de Falla'!IZ57=0,\"\",'[1]Tasa de Falla'!IZ57)","v":""},{"$f":"IF('[1]Tasa de Falla'!JA57=0,\"\",'[1]Tasa de Falla'!JA57)","v":""},{"$f":"IF('[1]Tasa de Falla'!JB57=0,\"\",'[1]Tasa de Falla'!JB57)","v":""},{"$f":"IF('[1]Tasa de Falla'!JC57=0,\"\",'[1]Tasa de Falla'!JC57)","v":""}]
[null,null,{"$f":"'[1]Tasa de Falla'!C58","v":42},{"$f":"'[1]Tasa de Falla'!D58","v":"C.H. PUEBLO VIEJO - VILLA QUINTEROS "},{"$f":"'[1]Tasa de Falla'!E58","v":132},{"$f":"'[1]Tasa de Falla'!F58","v":24.5},{"$f":"IF('[1]Tasa de Falla'!IR58=0,\"\",'[1]Tasa de Falla'!IR58)","v":3},{"$f":"IF('[1]Tasa de Falla'!IS58=0,\"\",'[1]Tasa de Falla'!IS58)","v":""},{"$f":"IF('[1]Tasa de Falla'!IT58=0,\"\",'[1]Tasa de Falla'!IT58)","v":""},{"$f":"IF('[1]Tasa de Falla'!IU58=0,\"\",'[1]Tasa de Falla'!IU58)","v":""},{"$f":"IF('[1]Tasa de Falla'!IV58=0,\"\",'[1]Tasa de Falla'!IV58)","v":1},{"$f":"IF('[1]Tasa de Falla'!IW58=0,\"\",'[1]Tasa de Falla'!IW58)","v":""},{"$f":"IF('[1]Tasa de Falla'!IX58=0,\"\",'[1]Tasa de Falla'!IX58)","v":""},{"$f":"IF('[1]Tasa de Falla'!IY58=0,\"\",'[1]Tasa de Falla'!IY58)","v":""},{"$f":"IF('[1]Tasa de Falla'!IZ58=0,\"\",'[1]Tasa de Falla'!IZ58)","v":""},{"$f":"IF('[1]Tasa de Falla'!JA58=0,\"\",'[1]Tasa de Falla'!JA58)","v":""},{"$f":"IF('[1]Tasa de Falla'!JB58=0,\"\",'[1]Tasa de Falla'!JB58)","v":""},{"$f":"IF('[1]Tasa de Falla'!JC58=0,\"\",'[1]Tasa de Falla'!JC58)","v":""}]
[null,null,{"$f":"'[1]Tasa de Falla'!C59","v":43},{"$f":"'[1]Tasa de Falla'!D59","v":"C.H. RIO HONDO - VILLA QUINTEROS"},{"$f":"'[1]Tasa de Falla'!E59","v":132},{"$f":"'[1]Tasa de Falla'!F59","v":75.400000000000006},{"$f":"IF('[1]Tasa de Falla'!IR59=0,\"\",'[1]Tasa de Falla'!IR59)","v":""},{"$f":"IF('[1]Tasa de Falla'!IS59=0,\"\",'[1]Tasa de Falla'!IS59)","v":""},{"$f":"IF('[1]Tasa de Falla'!IT59=0,\"\",'[1]Tasa de Falla'!IT59)","v":""},{"$f":"IF('[1]Tasa de Falla'!IU59=0,\"\",'[1]Tasa de Falla'!IU59)","v":""},{"$f":"IF('[1]Tasa de Falla'!IV59=0,\"\",'[1]Tasa de Falla'!IV59)","v":""},{"$f":"IF('[1]Tasa de Falla'!IW59=0,\"\",'[1]Tasa de Falla'!IW59)","v":""},{"$f":"IF('[1]Tasa de Falla'!IX59=0,\"\",'[1]Tasa de Falla'!IX59)","v":""},{"$f":"IF('[1]Tasa de Falla'!IY59=0,\"\",'[1]Tasa de Falla'!IY59)","v":""},{"$f":"IF('[1]Tasa de Falla'!IZ59=0,\"\",'[1]Tasa de Falla'!IZ59)","v":""},{"$f":"IF('[1]Tasa de Falla'!JA59=0,\"\",'[1]Tasa de Falla'!JA59)","v":""},{"$f":"IF('[1]Tasa de Falla'!JB59=0,\"\",'[1]Tasa de Falla'!JB59)","v":1},{"$f":"IF('[1]Tasa de Falla'!JC59=0,\"\",'[1]Tasa de Falla'!JC59)","v":""}]
[null,null,{"$f":"'[1]Tasa de Falla'!C60","v":44},{"$f":"'[1]Tasa de Falla'!D60","v":"C.H. RIO HONDO - SANTIAGO CENTRO"},{"$f":"'[1]Tasa de Falla'!E60","v":132},{"$f":"'[1]Tasa de Falla'!F60","v":79},{"$f":"IF('[1]Tasa de Falla'!IR60=0,\"\",'[1]Tasa de Falla'!IR60)","v":"XXXX"},{"$f":"IF('[1]Tasa de Falla'!IS60=0,\"\",'[1]Tasa de Falla'!IS60)","v":"XXXX"},{"$f":"IF('[1]Tasa de Falla'!IT60=0,\"\",'[1]Tasa de Falla'!IT60)","v":"XXXX"},{"$f":"IF('[1]Tasa de Falla'!IU60=0,\"\",'[1]Tasa de Falla'!IU60)","v":"XXXX"},{"$f":"IF('[1]Tasa de Falla'!IV60=0,\"\",'[1]Tasa de Falla'!IV60)","v":"XXXX"},{"$f":"IF('[1]Tasa de Falla'!IW60=0,\"\",'[1]Tasa de Falla'!IW60)","v":"XXXX"},{"$f":"IF('[1]Tasa de Falla'!IX60=0,\"\",'[1]Tasa de Falla'!IX60)","v":"XXXX"},{"$f":"IF('[1]Tasa de Falla'!IY60=0,\"\",'[1]Tasa de Falla'!IY60)","v":"XXXX"},{"$f":"IF('[1]Tasa de Falla'!IZ60=0,\"\",'[1]Tasa de Falla'!IZ60)","v":"XXXX"},{"$f":"IF('[1]Tasa de Falla'!JA60=0,\"\",'[1]Tasa de Falla'!JA60)","v":"XXXX"},{"$f":"IF('[1]Tasa de Falla'!JB60=0,\"\",'[1]Tasa de Falla'!JB60)","v":"XXXX"},{"$f":"IF('[1]Tasa de Falla'!JC60=0,\"\",'[1]Tasa de Falla'!JC60)","v":"XXXX"}]
[null,null,{"$f":"'[1]Tasa de Falla'!C61","v":45},{"$f":"'[1]Tasa de Falla'!D61","v":"C.H. RIO HONDO - EL BRACHO"},{"$f":"'[1]Tasa de Falla'!E61","v":132},{"$f":"'[1]Tasa de Falla'!F61","v":80.66},{"$f":"IF('[1]Tasa de Falla'!IR61=0,\"\",'[1]Tasa de Falla'!IR61)","v":""},{"$f":"IF('[1]Tasa de Falla'!IS61=0,\"\",'[1]Tasa de Falla'!IS61)","v":"XXXX"},{"$f":"IF('[1]Tasa de Falla'!IT61=0,\"\",'[1]Tasa de Falla'!IT61)","v":"XXXX"},{"$f":"IF('[1]Tasa de Falla'!IU61=0,\"\",'[1]Tasa de Falla'!IU61)","v":"XXXX"},{"$f":"IF('[1]Tasa de Falla'!IV61=0,\"\",'[1]Tasa de Falla'!IV61)","v":"XXXX"},{"$f":"IF('[1]Tasa de Falla'!IW61=0,\"\",'[1]Tasa de Falla'!IW61)","v":"XXXX"},{"$f":"IF('[1]Tasa de Falla'!IX61=0,\"\",'[1]Tasa de Falla'!IX61)","v":"XXXX"},{"$f":"IF('[1]Tasa de Falla'!IY61=0,\"\",'[1]Tasa de Falla'!IY61)","v":"XXXX"},{"$f":"IF('[1]Tasa de Falla'!IZ61=0,\"\",'[1]Tasa de Falla'!IZ61)","v":"XXXX"},{"$f":"IF('[1]Tasa de Falla'!JA61=0,\"\",'[1]Tasa de Falla'!JA61)","v":"XXXX"},{"$f":"IF('[1]Tasa de Falla'!JB61=0,\"\",'[1]Tasa de Falla'!JB61)","v":"XXXX"},{"$f":"IF('[1]Tasa de Falla'!JC61=0,\"\",'[1]Tasa de Falla'!JC61)","v":"XXXX"}]
[null,null,{"$f":"'[1]Tasa de Falla'!C62","v":46},{"$f":"'[1]Tasa de Falla'!D62","v":"SALTA SUR - SALTA NORTE"},{"$f":"'[1]Tasa de Falla'!E62","v":132},{"$f":"'[1]Tasa de Falla'!F62","v":10},{"$f":"IF('[1]Tasa de Falla'!IR62=0,\"\",'[1]Tasa de Falla'!IR62)","v":""},{"$f":"IF('[1]Tasa de Falla'!IS62=0,\"\",'[1]Tasa de Falla'!IS62)","v":""},{"$f":"IF('[1]Tasa de Falla'!IT62=0,\"\",'[1]Tasa de Falla'!IT62)","v":""},{"$f":"IF('[1]Tasa de Falla'!IU62=0,\"\",'[1]Tasa de Falla'!IU62)","v":""},{"$f":"IF('[1]Tasa de Falla'!IV62=0,\"\",'[1]Tasa de Falla'!IV62)","v":""},{"$f":"IF('[1]Tasa de Falla'!IW62=0,\"\",'[1]Tasa de Falla'!IW62)","v":""},{"$f":"IF('[1]Tasa de Falla'!IX62=0,\"\",'[1]Tasa de Falla'!IX62)","v":""},{"$f":"IF('[1]Tasa de Falla'!IY62=0,\"\",'[1]Tasa de Falla'!IY62)","v":""},{"$f":"IF('[1]Tasa de Falla'!IZ62=0,\"\",'[1]Tasa de Falla'!IZ62)","v":""},{"$f":"IF('[1]Tasa de Falla'!JA62=0,\"\",'[1]Tasa de Falla'!JA62)","v":""},{"$f":"IF('[1]Tasa de Falla'!JB62=0,\"\",'[1]Tasa de Falla'!JB62)","v":""},{"$f":"IF('[1]Tasa de Falla'!JC62=0,\"\",'[1]Tasa de Falla'!JC62)","v":""}]
[null,null,{"$f":"'[1]Tasa de Falla'!C63","v":47},{"$f":"'[1]Tasa de Falla'!D63","v":"PALPALA - JUJUY ESTE"},{"$f":"'[1]Tasa de Falla'!E63","v":132},{"$f":"'[1]Tasa de Falla'!F63","v":12.3},{"$f":"IF('[1]Tasa de Falla'!IR63=0,\"\",'[1]Tasa de Falla'!IR63)","v":""},{"$f":"IF('[1]Tasa de Falla'!IS63=0,\"\",'[1]Tasa de Falla'!IS63)","v":""},{"$f":"IF('[1]Tasa de Falla'!IT63=0,\"\",'[1]Tasa de Falla'!IT63)","v":1},{"$f":"IF('[1]Tasa de Falla'!IU63=0,\"\",'[1]Tasa de Falla'!IU63)","v":""},{"$f":"IF('[1]Tasa de Falla'!IV63=0,\"\",'[1]Tasa de Falla'!IV63)","v":""},{"$f":"IF('[1]Tasa de Falla'!IW63=0,\"\",'[1]Tasa de Falla'!IW63)","v":1},{"$f":"IF('[1]Tasa de Falla'!IX63=0,\"\",'[1]Tasa de Falla'!IX63)","v":""},{"$f":"IF('[1]Tasa de Falla'!IY63=0,\"\",'[1]Tasa de Falla'!IY63)","v":""},{"$f":"IF('[1]Tasa de Falla'!IZ63=0,\"\",'[1]Tasa de Falla'!IZ63)","v":""},{"$f":"IF('[1]Tasa de Falla'!JA63=0,\"\",'[1]Tasa de Falla'!JA63)","v":""},{"$f":"IF('[1]Tasa de Falla'!JB63=0,\"\",'[1]Tasa de Falla'!JB63)","v":""},{"$f":"IF('[1]Tasa de Falla'!JC63=0,\"\",'[1]Tasa de Falla'!JC63)","v":""}]
[null,null,{"$f":"'[1]Tasa de Falla'!C64","v":48},{"$f":"'[1]Tasa de Falla'!D64","v":"JUJUY ESTE - JUJUY SUR"},{"$f":"'[1]Tasa de Falla'!E64","v":132},{"$f":"'[1]Tasa de Falla'!F64","v":4.3},{"$f":"IF('[1]Tasa de Falla'!IR64=0,\"\",'[1]Tasa de Falla'!IR64)","v":""},{"$f":"IF('[1]Tasa de Falla'!IS64=0,\"\",'[1]Tasa de Falla'!IS64)","v":""},{"$f":"IF('[1]Tasa de Falla'!IT64=0,\"\",'[1]Tasa de Falla'!IT64)","v":""},{"$f":"IF('[1]Tasa de Falla'!IU64=0,\"\",'[1]Tasa de Falla'!IU64)","v":""},{"$f":"IF('[1]Tasa de Falla'!IV64=0,\"\",'[1]Tasa de Falla'!IV64)","v":""},{"$f":"IF('[1]Tasa de Falla'!IW64=0,\"\",'[1]Tasa de Falla'!IW64)","v":""},{"$f":"IF('[1]Tasa de Falla'!IX64=0,\"\",'[1]Tasa de Falla'!IX64)","v":""},{"$f":"IF('[1]Tasa de Falla'!IY64=0,\"\",'[1]Tasa de Falla'!IY64)","v":""},{"$f":"IF('[1]Tasa de Falla'!IZ64=0,\"\",'[1]Tasa de Falla'!IZ64)","v":""},{"$f":"IF('[1]Tasa de Falla'!JA64=0,\"\",'[1]Tasa de Falla'!JA64)","v":""},{"$f":"IF('[1]Tasa de Falla'!JB64=0,\"\",'[1]Tasa de Falla'!JB64)","v":""},{"$f":"IF('[1]Tasa de Falla'!JC64=0,\"\",'[1]Tasa de Falla'!JC64)","v":""}]
[null,null,{"$f":"'[1]Tasa de Falla'!C65","v":49},{"$f":"'[1]Tasa de Falla'!D65","v":"CEVIL POZO - GUEMES"},{"$f":"'[1]Tasa de Falla'!E65","v":132},{"$f":"'[1]Tasa de Falla'!F65","v":291},{"$f":"IF('[1]Tasa de Falla'!IR65=0,\"\",'[1]Tasa de Falla'!IR65)","v":"XXXX"},{"$f":"IF('[1]Tasa de Falla'!IS65=0,\"\",'[1]Tasa de Falla'!IS65)","v":"XXXX"},{"$f":"IF('[1]Tasa de Falla'!IT65=0,\"\",'[1]Tasa de Falla'!IT65)","v":"XXXX"},{"$f":"IF('[1]Tasa de Falla'!IU65=0,\"\",'[1]Tasa de Falla'!IU65)","v":"XXXX"},{"$f":"IF('[1]Tasa de Falla'!IV65=0,\"\",'[1]Tasa de Falla'!IV65)","v":"XXXX"},{"$f":"IF('[1]Tasa de Falla'!IW65=0,\"\",'[1]Tasa de Falla'!IW65)","v":"XXXX"},{"$f":"IF('[1]Tasa de Falla'!IX65=0,\"\",'[1]Tasa de Falla'!IX65)","v":"XXXX"},{"$f":"IF('[1]Tasa de Falla'!IY65=0,\"\",'[1]Tasa de Falla'!IY65)","v":"XXXX"},{"$f":"IF('[1]Tasa de Falla'!IZ65=0,\"\",'[1]Tasa de Falla'!IZ65)","v":"XXXX"},{"$f":"IF('[1]Tasa de Falla'!JA65=0,\"\",'[1]Tasa de Falla'!JA65)","v":"XXXX"},{"$f":"IF('[1]Tasa de Falla'!JB65=0,\"\",'[1]Tasa de Falla'!JB65)","v":"XXXX"},{"$f":"IF('[1]Tasa de Falla'!JC65=0,\"\",'[1]Tasa de Falla'!JC65)","v":"XXXX"}]
[null,null,{"$f":"'[1]Tasa de Falla'!C66","v":50},{"$f":"'[1]Tasa de Falla'!D66","v":"CEVIL POZO - EL BRACHO"},{"$f":"'[1]Tasa de Falla'!E66","v":132},{"$f":"'[1]Tasa de Falla'!F66","v":17},{"$f":"IF('[1]Tasa de Falla'!IR66=0,\"\",'[1]Tasa de Falla'!IR66)","v":""},{"$f":"IF('[1]Tasa de Falla'!IS66=0,\"\",'[1]Tasa de Falla'!IS66)","v":""},{"$f":"IF('[1]Tasa de Falla'!IT66=0,\"\",'[1]Tasa de Falla'!IT66)","v":""},{"$f":"IF('[1]Tasa de Falla'!IU66=0,\"\",'[1]Tasa de Falla'!IU66)","v":""},{"$f":"IF('[1]Tasa de Falla'!IV66=0,\"\",'[1]Tasa de Falla'!IV66)","v":""},{"$f":"IF('[1]Tasa de Falla'!IW66=0,\"\",'[1]Tasa de Falla'!IW66)","v":""},{"$f":"IF('[1]Tasa de Falla'!IX66=0,\"\",'[1]Tasa de Falla'!IX66)","v":""},{"$f":"IF('[1]Tasa de Falla'!IY66=0,\"\",'[1]Tasa de Falla'!IY66)","v":""},{"$f":"IF('[1]Tasa de Falla'!IZ66=0,\"\",'[1]Tasa de Falla'!IZ66)","v":""},{"$f":"IF('[1]Tasa de Falla'!JA66=0,\"\",'[1]Tasa de Falla'!JA66)","v":""},{"$f":"IF('[1]Tasa de Falla'!JB66=0,\"\",'[1]Tasa de Falla'!JB66)","v":""},{"$f":"IF('[1]Tasa de Falla'!JC66=0,\"\",'[1]Tasa de Falla'!JC66)","v":""}]
[null,null,{"$f":"'[1]Tasa de Falla'!C67","v":0},{"$f":"'[1]Tasa de Falla'!D67","v":0},{"$f":"'[1]Tasa de Falla'!E67","v":0},{"$f":"'[1]Tasa de Falla'!F67","v":0},{"$f":"IF('[1]Tasa de Falla'!IR67=0,\"\",'[1]Tasa de Falla'!IR67)","v":""},{"$f":"IF('[1]Tasa de Falla'!IS67=0,\"\",'[1]Tasa de Falla'!IS67)","v":""},{"$f":"IF('[1]Tasa de Falla'!IT67=0,\"\",'[1]Tasa de Falla'!IT67)","v":""},{"$f":"IF('[1]Tasa de Falla'!IU67=0,\"\",'[1]Tasa de Falla'!IU67)","v":""},{"$f":"IF('[1]Tasa de Falla'!IV67=0,\"\",'[1]Tasa de Falla'!IV67)","v":""},{"$f":"IF('[1]Tasa de Falla'!IW67=0,\"\",'[1]Tasa de Falla'!IW67)","v":""},{"$f":"IF('[1]Tasa de Falla'!IX67=0,\"\",'[1]Tasa de Falla'!IX67)","v":""},{"$f":"IF('[1]Tasa de Falla'!IY67=0,\"\",'[1]Tasa de Falla'!IY67)","v":""},{"$f":"IF('[1]Tasa de Falla'!IZ67=0,\"\",'[1]Tasa de Falla'!IZ67)","v":""},{"$f":"IF('[1]Tasa de Falla'!JA67=0,\"\",'[1]Tasa de Falla'!JA67)","v":""},{"$f":"IF('[1]Tasa de Falla'!JB67=0,\"\",'[1]Tasa de Falla'!JB67)","v":""},{"$f":"IF('[1]Tasa de Falla'!JC67=0,\"\",'[1]Tasa de Falla'!JC67)","v":""}]
[null,null,{"$f":"'[1]Tasa de Falla'!C68","v":51},{"$f":"'[1]Tasa de Falla'!D68","v":"METAN - EL TUNAL"},{"$f":"'[1]Tasa de Falla'!E68","v":132},{"$f":"'[1]Tasa de Falla'!F68","v":75.599999999999994},{"$f":"IF('[1]Tasa de Falla'!IR68=0,\"\",'[1]Tasa de Falla'!IR68)","v":""},{"$f":"IF('[1]Tasa de Falla'!IS68=0,\"\",'[1]Tasa de Falla'!IS68)","v":""},{"$f":"IF('[1]Tasa de Falla'!IT68=0,\"\",'[1]Tasa de Falla'!IT68)","v":""},{"$f":"IF('[1]Tasa de Falla'!IU68=0,\"\",'[1]Tasa de Falla'!IU68)","v":""},{"$f":"IF('[1]Tasa de Falla'!IV68=0,\"\",'[1]Tasa de Falla'!IV68)","v":""},{"$f":"IF('[1]Tasa de Falla'!IW68=0,\"\",'[1]Tasa de Falla'!IW68)","v":""},{"$f":"IF('[1]Tasa de Falla'!IX68=0,\"\",'[1]Tasa de Falla'!IX68)","v":""},{"$f":"IF('[1]Tasa de Falla'!IY68=0,\"\",'[1]Tasa de Falla'!IY68)","v":""},{"$f":"IF('[1]Tasa de Falla'!IZ68=0,\"\",'[1]Tasa de Falla'!IZ68)","v":""},{"$f":"IF('[1]Tasa de Falla'!JA68=0,\"\",'[1]Tasa de Falla'!JA68)","v":""},{"$f":"IF('[1]Tasa de Falla'!JB68=0,\"\",'[1]Tasa de Falla'!JB68)","v":""},{"$f":"IF('[1]Tasa de Falla'!JC68=0,\"\",'[1]Tasa de Falla'!JC68)","v":""}]
[null,null,{"$f":"'[1]Tasa de Falla'!C69","v":52},{"$f":"'[1]Tasa de Falla'!D69","v":"EL TUNAL - J.V. GONZALEZ"},{"$f":"'[1]Tasa de Falla'!E69","v":132},{"$f":"'[1]Tasa de Falla'!F69","v":41.4},{"$f":"IF('[1]Tasa de Falla'!IR69=0,\"\",'[1]Tasa de Falla'!IR69)","v":""},{"$f":"IF('[1]Tasa de Falla'!IS69=0,\"\",'[1]Tasa de Falla'!IS69)","v":""},{"$f":"IF('[1]Tasa de Falla'!IT69=0,\"\",'[1]Tasa de Falla'!IT69)","v":""},{"$f":"IF('[1]Tasa de Falla'!IU69=0,\"\",'[1]Tasa de Falla'!IU69)","v":""},{"$f":"IF('[1]Tasa de Falla'!IV69=0,\"\",'[1]Tasa de Falla'!IV69)","v":""},{"$f":"IF('[1]Tasa de Falla'!IW69=0,\"\",'[1]Tasa de Falla'!IW69)","v":""},{"$f":"IF('[1]Tasa de Falla'!IX69=0,\"\",'[1]Tasa de Falla'!IX69)","v":""},{"$f":"IF('[1]Tasa de Falla'!IY69=0,\"\",'[1]Tasa de Falla'!IY69)","v":""},{"$f":"IF('[1]Tasa de Falla'!IZ69=0,\"\",'[1]Tasa de Falla'!IZ69)","v":""},{"$f":"IF('[1]Tasa de Falla'!JA69=0,\"\",'[1]Tasa de Falla'!JA69)","v":""},{"$f":"IF('[1]Tasa de Falla'!JB69=0,\"\",'[1]Tasa de Falla'!JB69)","v":""},{"$f":"IF('[1]Tasa de Falla'!JC69=0,\"\",'[1]Tasa de Falla'!JC69)","v":""}]
[null,null,{"$f":"'[1]Tasa de Falla'!C70","v":0},{"$f":"'[1]Tasa de Falla'!D70","v":0},{"$f":"'[1]Tasa de Falla'!E70","v":0},{"$f":"'[1]Tasa de Falla'!F70","v":0},{"$f":"IF('[1]Tasa de Falla'!IR70=0,\"\",'[1]Tasa de Falla'!IR70)","v":""},{"$f":"IF('[1]Tasa de Falla'!IS70=0,\"\",'[1]Tasa de Falla'!IS70)","v":""},{"$f":"IF('[1]Tasa de Falla'!IT70=0,\"\",'[1]Tasa de Falla'!IT70)","v":""},{"$f":"IF('[1]Tasa de Falla'!IU70=0,\"\",'[1]Tasa de Falla'!IU70)","v":""},{"$f":"IF('[1]Tasa de Falla'!IV70=0,\"\",'[1]Tasa de Falla'!IV70)","v":""},{"$f":"IF('[1]Tasa de Falla'!IW70=0,\"\",'[1]Tasa de Falla'!IW70)","v":""},{"$f":"IF('[1]Tasa de Falla'!IX70=0,\"\",'[1]Tasa de Falla'!IX70)","v":""},{"$f":"IF('[1]Tasa de Falla'!IY70=0,\"\",'[1]Tasa de Falla'!IY70)","v":""},{"$f":"IF('[1]Tasa de Falla'!IZ70=0,\"\",'[1]Tasa de Falla'!IZ70)","v":""},{"$f":"IF('[1]Tasa de Falla'!JA70=0,\"\",'[1]Tasa de Falla'!JA70)","v":""},{"$f":"IF('[1]Tasa de Falla'!JB70=0,\"\",'[1]Tasa de Falla'!JB70)","v":""},{"$f":"IF('[1]Tasa de Falla'!JC70=0,\"\",'[1]Tasa de Falla'!JC70)","v":""}]
[null,null,{"$f":"'[1]Tasa de Falla'!C71","v":53},{"$f":"'[1]Tasa de Falla'!D71","v":"LOS PIZARROS - ESCABA"},{"$f":"'[1]Tasa de Falla'!E71","v":132},{"$f":"'[1]Tasa de Falla'!F71","v":21.4},{"$f":"IF('[1]Tasa de Falla'!IR71=0,\"\",'[1]Tasa de Falla'!IR71)","v":1},{"$f":"IF('[1]Tasa de Falla'!IS71=0,\"\",'[1]Tasa de Falla'!IS71)","v":""},{"$f":"IF('[1]Tasa de Falla'!IT71=0,\"\",'[1]Tasa de Falla'!IT71)","v":1},{"$f":"IF('[1]Tasa de Falla'!IU71=0,\"\",'[1]Tasa de Falla'!IU71)","v":""},{"$f":"IF('[1]Tasa de Falla'!IV71=0,\"\",'[1]Tasa de Falla'!IV71)","v":1},{"$f":"IF('[1]Tasa de Falla'!IW71=0,\"\",'[1]Tasa de Falla'!IW71)","v":""},{"$f":"IF('[1]Tasa de Falla'!IX71=0,\"\",'[1]Tasa de Falla'!IX71)","v":""},{"$f":"IF('[1]Tasa de Falla'!IY71=0,\"\",'[1]Tasa de Falla'!IY71)","v":""},{"$f":"IF('[1]Tasa de Falla'!IZ71=0,\"\",'[1]Tasa de Falla'!IZ71)","v":""},{"$f":"IF('[1]Tasa de Falla'!JA71=0,\"\",'[1]Tasa de Falla'!JA71)","v":""},{"$f":"IF('[1]Tasa de Falla'!JB71=0,\"\",'[1]Tasa de Falla'!JB71)","v":1},{"$f":"IF('[1]Tasa de Falla'!JC71=0,\"\",'[1]Tasa de Falla'!JC71)","v":""}]
[null,null,{"$f":"'[1]Tasa de Falla'!C72","v":54},{"$f":"'[1]Tasa de Falla'!D72","v":"LOS PIZARROS - LA COCHA"},{"$f":"'[1]Tasa de Falla'!E72","v":132},{"$f":"'[1]Tasa de Falla'!F72","v":6.5},{"$f":"IF('[1]Tasa de Falla'!IR72=0,\"\",'[1]Tasa de Falla'!IR72)","v":""},{"$f":"IF('[1]Tasa de Falla'!IS72=0,\"\",'[1]Tasa de Falla'!IS72)","v":""},{"$f":"IF('[1]Tasa de Falla'!IT72=0,\"\",'[1]Tasa de Falla'!IT72)","v":""},{"$f":"IF('[1]Tasa de Falla'!IU72=0,\"\",'[1]Tasa de Falla'!IU72)","v":""},{"$f":"IF('[1]Tasa de Falla'!IV72=0,\"\",'[1]Tasa de Falla'!IV72)","v":""},{"$f":"IF('[1]Tasa de Falla'!IW72=0,\"\",'[1]Tasa de Falla'!IW72)","v":""},{"$f":"IF('[1]Tasa de Falla'!IX72=0,\"\",'[1]Tasa de Falla'!IX72)","v":""},{"$f":"IF('[1]Tasa de Falla'!IY72=0,\"\",'[1]Tasa de Falla'!IY72)","v":""},{"$f":"IF('[1]Tasa de Falla'!IZ72=0,\"\",'[1]Tasa de Falla'!IZ72)","v":""},{"$f":"IF('[1]Tasa de Falla'!JA72=0,\"\",'[1]Tasa de Falla'!JA72)","v":""},{"$f":"IF('[1]Tasa de Falla'!JB72=0,\"\",'[1]Tasa de Falla'!JB72)","v":""},{"$f":"IF('[1]Tasa de Falla'!JC72=0,\"\",'[1]Tasa de Falla'!JC72)","v":""}]
[null,null,{"$f":"'[1]Tasa de Falla'!C73","v":55},{"$f":"'[1]Tasa de Falla'!D73","v":"HUACRA - LOS PIZARROS"},{"$f":"'[1]Tasa de Falla'!E73","v":132},{"$f":"'[1]Tasa de Falla'!F73","v":28.5},{"$f":"IF('[1]Tasa de Falla'!IR73=0,\"\",'[1]Tasa de Falla'!IR73)","v":""},{"$f":"IF('[1]Tasa de Falla'!IS73=0,\"\",'[1]Tasa de Falla'!IS73)","v":""},{"$f":"IF('[1]Tasa de Falla'!IT73=0,\"\",'[1]Tasa de Falla'!IT73)","v":1},{"$f":"IF('[1]Tasa de Falla'!IU73=0,\"\",'[1]Tasa de Falla'!IU73)","v":1},{"$f":"IF('[1]Tasa de Falla'!IV73=0,\"\",'[1]Tasa de Falla'!IV73)","v":""},{"$f":"IF('[1]Tasa de Falla'!IW73=0,\"\",'[1]Tasa de Falla'!IW73)","v":""},{"$f":"IF('[1]Tasa de Falla'!IX73=0,\"\",'[1]Tasa de Falla'!IX73)","v":""},{"$f":"IF('[1]Tasa de Falla'!IY73=0,\"\",'[1]Tasa de Falla'!IY73)","v":""},{"$f":"IF('[1]Tasa de Falla'!IZ73=0,\"\",'[1]Tasa de Falla'!IZ73)","v":""},{"$f":"IF('[1]Tasa de Falla'!JA73=0,\"\",'[1]Tasa de Falla'!JA73)","v":""},{"$f":"IF('[1]Tasa de Falla'!JB73=0,\"\",'[1]Tasa de Falla'!JB73)","v":""},{"$f":"IF('[1]Tasa de Falla'!JC73=0,\"\",'[1]Tasa de Falla'!JC73)","v":""}]
[null,null,{"$f":"'[1]Tasa de Falla'!C74","v":56},{"$f":"'[1]Tasa de Falla'!D74","v":"CEVIL POZO - AVELLANEDA"},{"$f":"'[1]Tasa de Falla'!E74","v":132},{"$f":"'[1]Tasa de Falla'!F74","v":8},{"$f":"IF('[1]Tasa de Falla'!IR74=0,\"\",'[1]Tasa de Falla'!IR74)","v":""},{"$f":"IF('[1]Tasa de Falla'!IS74=0,\"\",'[1]Tasa de Falla'!IS74)","v":""},{"$f":"IF('[1]Tasa de Falla'!IT74=0,\"\",'[1]Tasa de Falla'!IT74)","v":""},{"$f":"IF('[1]Tasa de Falla'!IU74=0,\"\",'[1]Tasa de Falla'!IU74)","v":""},{"$f":"IF('[1]Tasa de Falla'!IV74=0,\"\",'[1]Tasa de Falla'!IV74)","v":""},{"$f":"IF('[1]Tasa de Falla'!IW74=0,\"\",'[1]Tasa de Falla'!IW74)","v":""},{"$f":"IF('[1]Tasa de Falla'!IX74=0,\"\",'[1]Tasa de Falla'!IX74)","v":""},{"$f":"IF('[1]Tasa de Falla'!IY74=0,\"\",'[1]Tasa de Falla'!IY74)","v":""},{"$f":"IF('[1]Tasa de Falla'!IZ74=0,\"\",'[1]Tasa de Falla'!IZ74)","v":""},{"$f":"IF('[1]Tasa de Falla'!JA74=0,\"\",'[1]Tasa de Falla'!JA74)","v":""},{"$f":"IF('[1]Tasa de Falla'!JB74=0,\"\",'[1]Tasa de Falla'!JB74)","v":""},{"$f":"IF('[1]Tasa de Falla'!JC74=0,\"\",'[1]Tasa de Falla'!JC74)","v":""}]
[null,null,{"$f":"'[1]Tasa de Falla'!C75","v":57},{"$f":"'[1]Tasa de Falla'!D75","v":"CABRA CORRAL - SALTA ESTE"},{"$f":"'[1]Tasa de Falla'!E75","v":132},{"$f":"'[1]Tasa de Falla'!F75","v":55},{"$f":"IF('[1]Tasa de Falla'!IR75=0,\"\",'[1]Tasa de Falla'!IR75)","v":1},{"$f":"IF('[1]Tasa de Falla'!IS75=0,\"\",'[1]Tasa de Falla'!IS75)","v":""},{"$f":"IF('[1]Tasa de Falla'!IT75=0,\"\",'[1]Tasa de Falla'!IT75)","v":""},{"$f":"IF('[1]Tasa de Falla'!IU75=0,\"\",'[1]Tasa de Falla'!IU75)","v":1},{"$f":"IF('[1]Tasa de Falla'!IV75=0,\"\",'[1]Tasa de Falla'!IV75)","v":""},{"$f":"IF('[1]Tasa de Falla'!IW75=0,\"\",'[1]Tasa de Falla'!IW75)","v":1},{"$f":"IF('[1]Tasa de Falla'!IX75=0,\"\",'[1]Tasa de Falla'!IX75)","v":""},{"$f":"IF('[1]Tasa de Falla'!IY75=0,\"\",'[1]Tasa de Falla'!IY75)","v":""},{"$f":"IF('[1]Tasa de Falla'!IZ75=0,\"\",'[1]Tasa de Falla'!IZ75)","v":1},{"$f":"IF('[1]Tasa de Falla'!JA75=0,\"\",'[1]Tasa de Falla'!JA75)","v":""},{"$f":"IF('[1]Tasa de Falla'!JB75=0,\"\",'[1]Tasa de Falla'!JB75)","v":""},{"$f":"IF('[1]Tasa de Falla'!JC75=0,\"\",'[1]Tasa de Falla'!JC75)","v":""}]
[null,null,{"$f":"'[1]Tasa de Falla'!C76","v":58},{"$f":"'[1]Tasa de Falla'!D76","v":"SALTA ESTE - SALTA SUR"},{"$f":"'[1]Tasa de Falla'!E76","v":132},{"$f":"'[1]Tasa de Falla'!F76","v":7},{"$f":"IF('[1]Tasa de Falla'!IR76=0,\"\",'[1]Tasa de Falla'!IR76)","v":""},{"$f":"IF('[1]Tasa de Falla'!IS76=0,\"\",'[1]Tasa de Falla'!IS76)","v":""},{"$f":"IF('[1]Tasa de Falla'!IT76=0,\"\",'[1]Tasa de Falla'!IT76)","v":""},{"$f":"IF('[1]Tasa de Falla'!IU76=0,\"\",'[1]Tasa de Falla'!IU76)","v":""},{"$f":"IF('[1]Tasa de Falla'!IV76=0,\"\",'[1]Tasa de Falla'!IV76)","v":""},{"$f":"IF('[1]Tasa de Falla'!IW76=0,\"\",'[1]Tasa de Falla'!IW76)","v":""},{"$f":"IF('[1]Tasa de Falla'!IX76=0,\"\",'[1]Tasa de Falla'!IX76)","v":""},{"$f":"IF('[1]Tasa de Falla'!IY76=0,\"\",'[1]Tasa de Falla'!IY76)","v":""},{"$f":"IF('[1]Tasa de Falla'!IZ76=0,\"\",'[1]Tasa de Falla'!IZ76)","v":""},{"$f":"IF('[1]Tasa de Falla'!JA76=0,\"\",'[1]Tasa de Falla'!JA76)","v":""},{"$f":"IF('[1]Tasa de Falla'!JB76=0,\"\",'[1]Tasa de Falla'!JB76)","v":""},{"$f":"IF('[1]Tasa de Falla'!JC76=0,\"\",'[1]Tasa de Falla'!JC76)","v":""}]
[null,null,{"$f":"'[1]Tasa de Falla'!C77","v":59},{"$f":"'[1]Tasa de Falla'!D77","v":"V. QUINTEROS - ACONQUIJA - ANDALGALA"},{"$f":"'[1]Tasa de Falla'!E77","v":132},{"$f":"'[1]Tasa de Falla'!F77","v":102},{"$f":"IF('[1]Tasa de Falla'!IR77=0,\"\",'[1]Tasa de Falla'!IR77)","v":""},{"$f":"IF('[1]Tasa de Falla'!IS77=0,\"\",'[1]Tasa de Falla'!IS77)","v":""},{"$f":"IF('[1]Tasa de Falla'!IT77=0,\"\",'[1]Tasa de Falla'!IT77)","v":""},{"$f":"IF('[1]Tasa de Falla'!IU77=0,\"\",'[1]Tasa de Falla'!IU77)","v":2},{"$f":"IF('[1]Tasa de Falla'!IV77=0,\"\",'[1]Tasa de Falla'!IV77)","v":1},{"$f":"IF('[1]Tasa de Falla'!IW77=0,\"\",'[1]Tasa de Falla'!IW77)","v":""},{"$f":"IF('[1]Tasa de Falla'!IX77=0,\"\",'[1]Tasa de Falla'!IX77)","v":""},{"$f":"IF('[1]Tasa de Falla'!IY77=0,\"\",'[1]Tasa de Falla'!IY77)","v":""},{"$f":"IF('[1]Tasa de Falla'!IZ77=0,\"\",'[1]Tasa de Falla'!IZ77)","v":""},{"$f":"IF('[1]Tasa de Falla'!JA77=0,\"\",'[1]Tasa de Falla'!JA77)","v":1},{"$f":"IF('[1]Tasa de Falla'!JB77=0,\"\",'[1]Tasa de Falla'!JB77)","v":""},{"$f":"IF('[1]Tasa de Falla'!JC77=0,\"\",'[1]Tasa de Falla'!JC77)","v":2}]
[null,null,{"$f":"'[1]Tasa de Falla'!C78","v":60},{"$f":"'[1]Tasa de Falla'!D78","v":"ANDALGALA - BELEN"},{"$f":"'[1]Tasa de Falla'!E78","v":132},{"$f":"'[1]Tasa de Falla'!F78","v":80.3},{"$f":"IF('[1]Tasa de Falla'!IR78=0,\"\",'[1]Tasa de Falla'!IR78)","v":""},{"$f":"IF('[1]Tasa de Falla'!IS78=0,\"\",'[1]Tasa de Falla'!IS78)","v":""},{"$f":"IF('[1]Tasa de Falla'!IT78=0,\"\",'[1]Tasa de Falla'!IT78)","v":""},{"$f":"IF('[1]Tasa de Falla'!IU78=0,\"\",'[1]Tasa de Falla'!IU78)","v":1},{"$f":"IF('[1]Tasa de Falla'!IV78=0,\"\",'[1]Tasa de Falla'!IV78)","v":""},{"$f":"IF('[1]Tasa de Falla'!IW78=0,\"\",'[1]Tasa de Falla'!IW78)","v":""},{"$f":"IF('[1]Tasa de Falla'!IX78=0,\"\",'[1]Tasa de Falla'!IX78)","v":""},{"$f":"IF('[1]Tasa de Falla'!IY78=0,\"\",'[1]Tasa de Falla'!IY78)","v":""},{"$f":"IF('[1]Tasa de Falla'!IZ78=0,\"\",'[1]Tasa de Falla'!IZ78)","v":""},{"$f":"IF('[1]Tasa de Falla'!JA78=0,\"\",'[1]Tasa de Falla'!JA78)","v":""},{"$f":"IF('[1]Tasa de Falla'!JB78=0,\"\",'[1]Tasa de Falla'!JB78)","v":""},{"$f":"IF('[1]Tasa de Falla'!JC78=0,\"\",'[1]Tasa de Falla'!JC78)","v":""}]
[null,null,{"$f":"'[1]Tasa de Falla'!C79","v":61},{"$f":"'[1]Tasa de Falla'!D79","v":"TUCUMAN NORTE - TRANCAS"},{"$f":"'[1]Tasa de Falla'!E79","v":132},{"$f":"'[1]Tasa de Falla'!F79","v":75},{"$f":"IF('[1]Tasa de Falla'!IR79=0,\"\",'[1]Tasa de Falla'!IR79)","v":""},{"$f":"IF('[1]Tasa de Falla'!IS79=0,\"\",'[1]Tasa de Falla'!IS79)","v":""},{"$f":"IF('[1]Tasa de Falla'!IT79=0,\"\",'[1]Tasa de Falla'!IT79)","v":""},{"$f":"IF('[1]Tasa de Falla'!IU79=0,\"\",'[1]Tasa de Falla'!IU79)","v":""},{"$f":"IF('[1]Tasa de Falla'!IV79=0,\"\",'[1]Tasa de Falla'!IV79)","v":""},{"$f":"IF('[1]Tasa de Falla'!IW79=0,\"\",'[1]Tasa de Falla'!IW79)","v":""},{"$f":"IF('[1]Tasa de Falla'!IX79=0,\"\",'[1]Tasa de Falla'!IX79)","v":""},{"$f":"IF('[1]Tasa de Falla'!IY79=0,\"\",'[1]Tasa de Falla'!IY79)","v":""},{"$f":"IF('[1]Tasa de Falla'!IZ79=0,\"\",'[1]Tasa de Falla'!IZ79)","v":1},{"$f":"IF('[1]Tasa de Falla'!JA79=0,\"\",'[1]Tasa de Falla'!JA79)","v":""},{"$f":"IF('[1]Tasa de Falla'!JB79=0,\"\",'[1]Tasa de Falla'!JB79)","v":""},{"$f":"IF('[1]Tasa de Falla'!JC79=0,\"\",'[1]Tasa de Falla'!JC79)","v":""}]
[null,null,{"$f":"'[1]Tasa de Falla'!C80","v":62},{"$f":"'[1]Tasa de Falla'!D80","v":"CABRA CORRAL - TRANCAS"},{"$f":"'[1]Tasa de Falla'!E80","v":132},{"$f":"'[1]Tasa de Falla'!F80","v":115},{"$f":"IF('[1]Tasa de Falla'!IR80=0,\"\",'[1]Tasa de Falla'!IR80)","v":"XXXX"},{"$f":"IF('[1]Tasa de Falla'!IS80=0,\"\",'[1]Tasa de Falla'!IS80)","v":"XXXX"},{"$f":"IF('[1]Tasa de Falla'!IT80=0,\"\",'[1]Tasa de Falla'!IT80)","v":"XXXX"},{"$f":"IF('[1]Tasa de Falla'!IU80=0,\"\",'[1]Tasa de Falla'!IU80)","v":"XXXX"},{"$f":"IF('[1]Tasa de Falla'!IV80=0,\"\",'[1]Tasa de Falla'!IV80)","v":"XXXX"},{"$f":"IF('[1]Tasa de Falla'!IW80=0,\"\",'[1]Tasa de Falla'!IW80)","v":"XXXX"},{"$f":"IF('[1]Tasa de Falla'!IX80=0,\"\",'[1]Tasa de Falla'!IX80)","v":"XXXX"},{"$f":"IF('[1]Tasa de Falla'!IY80=0,\"\",'[1]Tasa de Falla'!IY80)","v":"XXXX"},{"$f":"IF('[1]Tasa de Falla'!IZ80=0,\"\",'[1]Tasa de Falla'!IZ80)","v":"XXXX"},{"$f":"IF('[1]Tasa de Falla'!JA80=0,\"\",'[1]Tasa de Falla'!JA80)","v":"XXXX"},{"$f":"IF('[1]Tasa de Falla'!JB80=0,\"\",'[1]Tasa de Falla'!JB80)","v":"XXXX"},{"$f":"IF('[1]Tasa de Falla'!JC80=0,\"\",'[1]Tasa de Falla'!JC80)","v":"XXXX"}]
[null,null,{"$f":"'[1]Tasa de Falla'!C81","v":63},{"$f":"'[1]Tasa de Falla'!D81","v":"LAS MADERAS - JUJUY SUR"},{"$f":"'[1]Tasa de Falla'!E81","v":132},{"$f":"'[1]Tasa de Falla'!F81","v":27.6},{"$f":"IF('[1]Tasa de Falla'!IR81=0,\"\",'[1]Tasa de Falla'!IR81)","v":""},{"$f":"IF('[1]Tasa de Falla'!IS81=0,\"\",'[1]Tasa de Falla'!IS81)","v":""},{"$f":"IF('[1]Tasa de Falla'!IT81=0,\"\",'[1]Tasa de Falla'!IT81)","v":1},{"$f":"IF('[1]Tasa de Falla'!IU81=0,\"\",'[1]Tasa de Falla'!IU81)","v":""},{"$f":"IF('[1]Tasa de Falla'!IV81=0,\"\",'[1]Tasa de Falla'!IV81)","v":""},{"$f":"IF('[1]Tasa de Falla'!IW81=0,\"\",'[1]Tasa de Falla'!IW81)","v":""},{"$f":"IF('[1]Tasa de Falla'!IX81=0,\"\",'[1]Tasa de Falla'!IX81)","v":""},{"$f":"IF('[1]Tasa de Falla'!IY81=0,\"\",'[1]Tasa de Falla'!IY81)","v":""},{"$f":"IF('[1]Tasa de Falla'!IZ81=0,\"\",'[1]Tasa de Falla'!IZ81)","v":""},{"$f":"IF('[1]Tasa de Falla'!JA81=0,\"\",'[1]Tasa de Falla'!JA81)","v":""},{"$f":"IF('[1]Tasa de Falla'!JB81=0,\"\",'[1]Tasa de Falla'!JB81)","v":""},{"$f":"IF('[1]Tasa de Falla'!JC81=0,\"\",'[1]Tasa de Falla'!JC81)","v":""}]
[null,null,{"$f":"'[1]Tasa de Falla'!C82","v":64},{"$f":"'[1]Tasa de Falla'!D82","v":"BELEN - TINOGASTA"},{"$f":"'[1]Tasa de Falla'!E82","v":132},{"$f":"'[1]Tasa de Falla'!F82","v":72},{"$f":"IF('[1]Tasa de Falla'!IR82=0,\"\",'[1]Tasa de Falla'!IR82)","v":""},{"$f":"IF('[1]Tasa de Falla'!IS82=0,\"\",'[1]Tasa de Falla'!IS82)","v":1},{"$f":"IF('[1]Tasa de Falla'!IT82=0,\"\",'[1]Tasa de Falla'!IT82)","v":""},{"$f":"IF('[1]Tasa de Falla'!IU82=0,\"\",'[1]Tasa de Falla'!IU82)","v":""},{"$f":"IF('[1]Tasa de Falla'!IV82=0,\"\",'[1]Tasa de Falla'!IV82)","v":""},{"$f":"IF('[1]Tasa de Falla'!IW82=0,\"\",'[1]Tasa de Falla'!IW82)","v":""},{"$f":"IF('[1]Tasa de Falla'!IX82=0,\"\",'[1]Tasa de Falla'!IX82)","v":""},{"$f":"IF('[1]Tasa de Falla'!IY82=0,\"\",'[1]Tasa de Falla'!IY82)","v":""},{"$f":"IF('[1]Tasa de Falla'!IZ82=0,\"\",'[1]Tasa de Falla'!IZ82)","v":""},{"$f":"IF('[1]Tasa de Falla'!JA82=0,\"\",'[1]Tasa de Falla'!JA82)","v":""},{"$f":"IF('[1]Tasa de Falla'!JB82=0,\"\",'[1]Tasa de Falla'!JB82)","v":""},{"$f":"IF('[1]Tasa de Falla'!JC82=0,\"\",'[1]Tasa de Falla'!JC82)","v":""}]
[null,null,{"$f":"'[1]Tasa de Falla'!C83","v":65},{"$f":"'[1]Tasa de Falla'!D83","v":"BURRUYACU - CEVIL POZO"},{"$f":"'[1]Tasa de Falla'!E83","v":132},{"$f":"'[1]Tasa de Falla'!F83","v":56},{"$f":"IF('[1]Tasa de Falla'!IR83=0,\"\",'[1]Tasa de Falla'!IR83)","v":1},{"$f":"IF('[1]Tasa de Falla'!IS83=0,\"\",'[1]Tasa de Falla'!IS83)","v":""},{"$f":"IF('[1]Tasa de Falla'!IT83=0,\"\",'[1]Tasa de Falla'!IT83)","v":""},{"$f":"IF('[1]Tasa de Falla'!IU83=0,\"\",'[1]Tasa de Falla'!IU83)","v":1},{"$f":"IF('[1]Tasa de Falla'!IV83=0,\"\",'[1]Tasa de Falla'!IV83)","v":1},{"$f":"IF('[1]Tasa de Falla'!IW83=0,\"\",'[1]Tasa de Falla'!IW83)","v":""},{"$f":"IF('[1]Tasa de Falla'!IX83=0,\"\",'[1]Tasa de Falla'!IX83)","v":""},{"$f":"IF('[1]Tasa de Falla'!IY83=0,\"\",'[1]Tasa de Falla'!IY83)","v":""},{"$f":"IF('[1]Tasa de Falla'!IZ83=0,\"\",'[1]Tasa de Falla'!IZ83)","v":""},{"$f":"IF('[1]Tasa de Falla'!JA83=0,\"\",'[1]Tasa de Falla'!JA83)","v":""},{"$f":"IF('[1]Tasa de Falla'!JB83=0,\"\",'[1]Tasa de Falla'!JB83)","v":""},{"$f":"IF('[1]Tasa de Falla'!JC83=0,\"\",'[1]Tasa de Falla'!JC83)","v":""}]
[null,null,{"$f":"'[1]Tasa de Falla'!C84","v":66},{"$f":"'[1]Tasa de Falla'!D84","v":"GÜEMES - BURRUYACU"},{"$f":"'[1]Tasa de Falla'!E84","v":132},{"$f":"'[1]Tasa de Falla'!F84","v":235.1},{"$f":"IF('[1]Tasa de Falla'!IR84=0,\"\",'[1]Tasa de Falla'!IR84)","v":"XXXX"},{"$f":"IF('[1]Tasa de Falla'!IS84=0,\"\",'[1]Tasa de Falla'!IS84)","v":"XXXX"},{"$f":"IF('[1]Tasa de Falla'!IT84=0,\"\",'[1]Tasa de Falla'!IT84)","v":"XXXX"},{"$f":"IF('[1]Tasa de Falla'!IU84=0,\"\",'[1]Tasa de Falla'!IU84)","v":"XXXX"},{"$f":"IF('[1]Tasa de Falla'!IV84=0,\"\",'[1]Tasa de Falla'!IV84)","v":"XXXX"},{"$f":"IF('[1]Tasa de Falla'!IW84=0,\"\",'[1]Tasa de Falla'!IW84)","v":"XXXX"},{"$f":"IF('[1]Tasa de Falla'!IX84=0,\"\",'[1]Tasa de Falla'!IX84)","v":"XXXX"},{"$f":"IF('[1]Tasa de Falla'!IY84=0,\"\",'[1]Tasa de Falla'!IY84)","v":"XXXX"},{"$f":"IF('[1]Tasa de Falla'!IZ84=0,\"\",'[1]Tasa de Falla'!IZ84)","v":"XXXX"},{"$f":"IF('[1]Tasa de Falla'!JA84=0,\"\",'[1]Tasa de Falla'!JA84)","v":"XXXX"},{"$f":"IF('[1]Tasa de Falla'!JB84=0,\"\",'[1]Tasa de Falla'!JB84)","v":"XXXX"},{"$f":"IF('[1]Tasa de Falla'!JC84=0,\"\",'[1]Tasa de Falla'!JC84)","v":"XXXX"}]
[null,null,{"$f":"'[1]Tasa de Falla'!C85","v":67},{"$f":"'[1]Tasa de Falla'!D85","v":"FRIAS - RECREO"},{"$f":"'[1]Tasa de Falla'!E85","v":132},{"$f":"'[1]Tasa de Falla'!F85","v":74.540000000000006},{"$f":"IF('[1]Tasa de Falla'!IR85=0,\"\",'[1]Tasa de Falla'!IR85)","v":""},{"$f":"IF('[1]Tasa de Falla'!IS85=0,\"\",'[1]Tasa de Falla'!IS85)","v":""},{"$f":"IF('[1]Tasa de Falla'!IT85=0,\"\",'[1]Tasa de Falla'!IT85)","v":""},{"$f":"IF('[1]Tasa de Falla'!IU85=0,\"\",'[1]Tasa de Falla'!IU85)","v":""},{"$f":"IF('[1]Tasa de Falla'!IV85=0,\"\",'[1]Tasa de Falla'!IV85)","v":""},{"$f":"IF('[1]Tasa de Falla'!IW85=0,\"\",'[1]Tasa de Falla'!IW85)","v":""},{"$f":"IF('[1]Tasa de Falla'!IX85=0,\"\",'[1]Tasa de Falla'!IX85)","v":""},{"$f":"IF('[1]Tasa de Falla'!IY85=0,\"\",'[1]Tasa de Falla'!IY85)","v":""},{"$f":"IF('[1]Tasa de Falla'!IZ85=0,\"\",'[1]Tasa de Falla'!IZ85)","v":""},{"$f":"IF('[1]Tasa de Falla'!JA85=0,\"\",'[1]Tasa de Falla'!JA85)","v":""},{"$f":"IF('[1]Tasa de Falla'!JB85=0,\"\",'[1]Tasa de Falla'!JB85)","v":""},{"$f":"IF('[1]Tasa de Falla'!JC85=0,\"\",'[1]Tasa de Falla'!JC85)","v":""}]
[null,null,{"$f":"'[1]Tasa de Falla'!C86","v":68},{"$f":"'[1]Tasa de Falla'!D86","v":"RECREO - LA RIOJA 1"},{"$f":"'[1]Tasa de Falla'!E86","v":132},{"$f":"'[1]Tasa de Falla'!F86","v":221},{"$f":"IF('[1]Tasa de Falla'!IR86=0,\"\",'[1]Tasa de Falla'!IR86)","v":""},{"$f":"IF('[1]Tasa de Falla'!IS86=0,\"\",'[1]Tasa de Falla'!IS86)","v":""},{"$f":"IF('[1]Tasa de Falla'!IT86=0,\"\",'[1]Tasa de Falla'!IT86)","v":1},{"$f":"IF('[1]Tasa de Falla'!IU86=0,\"\",'[1]Tasa de Falla'!IU86)","v":1},{"$f":"IF('[1]Tasa de Falla'!IV86=0,\"\",'[1]Tasa de Falla'!IV86)","v":""},{"$f":"IF('[1]Tasa de Falla'!IW86=0,\"\",'[1]Tasa de Falla'!IW86)","v":""},{"$f":"IF('[1]Tasa de Falla'!IX86=0,\"\",'[1]Tasa de Falla'!IX86)","v":""},{"$f":"IF('[1]Tasa de Falla'!IY86=0,\"\",'[1]Tasa de Falla'!IY86)","v":1},{"$f":"IF('[1]Tasa de Falla'!IZ86=0,\"\",'[1]Tasa de Falla'!IZ86)","v":1},{"$f":"IF('[1]Tasa de Falla'!JA86=0,\"\",'[1]Tasa de Falla'!JA86)","v":""},{"$f":"IF('[1]Tasa de Falla'!JB86=0,\"\",'[1]Tasa de Falla'!JB86)","v":""},{"$f":"IF('[1]Tasa de Falla'!JC86=0,\"\",'[1]Tasa de Falla'!JC86)","v":""}]
[null,null,{"$f":"'[1]Tasa de Falla'!C87","v":69},{"$f":"'[1]Tasa de Falla'!D87","v":"RECREO - LA RIOJA 2"},{"$f":"'[1]Tasa de Falla'!E87","v":132},{"$f":"'[1]Tasa de Falla'!F87","v":220},{"$f":"IF('[1]Tasa de Falla'!IR87=0,\"\",'[1]Tasa de Falla'!IR87)","v":""},{"$f":"IF('[1]Tasa de Falla'!IS87=0,\"\",'[1]Tasa de Falla'!IS87)","v":1},{"$f":"IF('[1]Tasa de Falla'!IT87=0,\"\",'[1]Tasa de Falla'!IT87)","v":""},{"$f":"IF('[1]Tasa de Falla'!IU87=0,\"\",'[1]Tasa de Falla'!IU87)","v":1},{"$f":"IF('[1]Tasa de Falla'!IV87=0,\"\",'[1]Tasa de Falla'!IV87)","v":""},{"$f":"IF('[1]Tasa de Falla'!IW87=0,\"\",'[1]Tasa de Falla'!IW87)","v":""},{"$f":"IF('[1]Tasa de Falla'!IX87=0,\"\",'[1]Tasa de Falla'!IX87)","v":1},{"$f":"IF('[1]Tasa de Falla'!IY87=0,\"\",'[1]Tasa de Falla'!IY87)","v":1},{"$f":"IF('[1]Tasa de Falla'!IZ87=0,\"\",'[1]Tasa de Falla'!IZ87)","v":""},{"$f":"IF('[1]Tasa de Falla'!JA87=0,\"\",'[1]Tasa de Falla'!JA87)","v":""},{"$f":"IF('[1]Tasa de Falla'!JB87=0,\"\",'[1]Tasa de Falla'!JB87)","v":""},{"$f":"IF('[1]Tasa de Falla'!JC87=0,\"\",'[1]Tasa de Falla'!JC87)","v":""}]
[null,null,{"$f":"'[1]Tasa de Falla'!C88","v":70},{"$f":"'[1]Tasa de Falla'!D88","v":"RECREO - CATAMARCA"},{"$f":"'[1]Tasa de Falla'!E88","v":132},{"$f":"'[1]Tasa de Falla'!F88","v":203},{"$f":"IF('[1]Tasa de Falla'!IR88=0,\"\",'[1]Tasa de Falla'!IR88)","v":""},{"$f":"IF('[1]Tasa de Falla'!IS88=0,\"\",'[1]Tasa de Falla'!IS88)","v":""},{"$f":"IF('[1]Tasa de Falla'!IT88=0,\"\",'[1]Tasa de Falla'!IT88)","v":2},{"$f":"IF('[1]Tasa de Falla'!IU88=0,\"\",'[1]Tasa de Falla'!IU88)","v":""},{"$f":"IF('[1]Tasa de Falla'!IV88=0,\"\",'[1]Tasa de Falla'!IV88)","v":""},{"$f":"IF('[1]Tasa de Falla'!IW88=0,\"\",'[1]Tasa de Falla'!IW88)","v":1},{"$f":"IF('[1]Tasa de Falla'!IX88=0,\"\",'[1]Tasa de Falla'!IX88)","v":""},{"$f":"IF('[1]Tasa de Falla'!IY88=0,\"\",'[1]Tasa de Falla'!IY88)","v":""},{"$f":"IF('[1]Tasa de Falla'!IZ88=0,\"\",'[1]Tasa de Falla'!IZ88)","v":""},{"$f":"IF('[1]Tasa de Falla'!JA88=0,\"\",'[1]Tasa de Falla'!JA88)","v":""},{"$f":"IF('[1]Tasa de Falla'!JB88=0,\"\",'[1]Tasa de Falla'!JB88)","v":""},{"$f":"IF('[1]Tasa de Falla'!JC88=0,\"\",'[1]Tasa de Falla'!JC88)","v":""}]
[null,null,{"$f":"'[1]Tasa de Falla'!C89","v":71},{"$f":"'[1]Tasa de Falla'!D89","v":"CABRA CORRAL - EL CARRIL"},{"$f":"'[1]Tasa de Falla'!E89","v":132},{"$f":"'[1]Tasa de Falla'!F89","v":33.75},{"$f":"IF('[1]Tasa de Falla'!IR89=0,\"\",'[1]Tasa de Falla'!IR89)","v":1},{"$f":"IF('[1]Tasa de Falla'!IS89=0,\"\",'[1]Tasa de Falla'!IS89)","v":""},{"$f":"IF('[1]Tasa de Falla'!IT89=0,\"\",'[1]Tasa de Falla'!IT89)","v":""},{"$f":"IF('[1]Tasa de Falla'!IU89=0,\"\",'[1]Tasa de Falla'!IU89)","v":""},{"$f":"IF('[1]Tasa de Falla'!IV89=0,\"\",'[1]Tasa de Falla'!IV89)","v":""},{"$f":"IF('[1]Tasa de Falla'!IW89=0,\"\",'[1]Tasa de Falla'!IW89)","v":""},{"$f":"IF('[1]Tasa de Falla'!IX89=0,\"\",'[1]Tasa de Falla'!IX89)","v":""},{"$f":"IF('[1]Tasa de Falla'!IY89=0,\"\",'[1]Tasa de Falla'!IY89)","v":""},{"$f":"IF('[1]Tasa de Falla'!IZ89=0,\"\",'[1]Tasa de Falla'!IZ89)","v":1},{"$f":"IF('[1]Tasa de Falla'!JA89=0,\"\",'[1]Tasa de Falla'!JA89)","v":""},{"$f":"IF('[1]Tasa de Falla'!JB89=0,\"\",'[1]Tasa de Falla'!JB89)","v":""},{"$f":"IF('[1]Tasa de Falla'!JC89=0,\"\",'[1]Tasa de Falla'!JC89)","v":""}]
[null,null,{"$f":"'[1]Tasa de Falla'!C90","v":72},{"$f":"'[1]Tasa de Falla'!D90","v":"PAMPA GRANDE - CABRA CORRAL"},{"$f":"'[1]Tasa de Falla'!E90","v":132},{"$f":"'[1]Tasa de Falla'!F90","v":60},{"$f":"IF('[1]Tasa de Falla'!IR90=0,\"\",'[1]Tasa de Falla'!IR90)","v":""},{"$f":"IF('[1]Tasa de Falla'!IS90=0,\"\",'[1]Tasa de Falla'!IS90)","v":""},{"$f":"IF('[1]Tasa de Falla'!IT90=0,\"\",'[1]Tasa de Falla'!IT90)","v":""},{"$f":"IF('[1]Tasa de Falla'!IU90=0,\"\",'[1]Tasa de Falla'!IU90)","v":1},{"$f":"IF('[1]Tasa de Falla'!IV90=0,\"\",'[1]Tasa de Falla'!IV90)","v":1},{"$f":"IF('[1]Tasa de Falla'!IW90=0,\"\",'[1]Tasa de Falla'!IW90)","v":1},{"$f":"IF('[1]Tasa de Falla'!IX90=0,\"\",'[1]Tasa de Falla'!IX90)","v":""},{"$f":"IF('[1]Tasa de Falla'!IY90=0,\"\",'[1]Tasa de Falla'!IY90)","v":""},{"$f":"IF('[1]Tasa de Falla'!IZ90=0,\"\",'[1]Tasa de Falla'!IZ90)","v":1},{"$f":"IF('[1]Tasa de Falla'!JA90=0,\"\",'[1]Tasa de Falla'!JA90)","v":""},{"$f":"IF('[1]Tasa de Falla'!JB90=0,\"\",'[1]Tasa de Falla'!JB90)","v":""},{"$f":"IF('[1]Tasa de Falla'!JC90=0,\"\",'[1]Tasa de Falla'!JC90)","v":""}]
[null,null,{"$f":"'[1]Tasa de Falla'!C91","v":73},{"$f":"'[1]Tasa de Falla'!D91","v":"PAMPA GRANDE - CAFAYATE"},{"$f":"'[1]Tasa de Falla'!E91","v":132},{"$f":"'[1]Tasa de Falla'!F91","v":63},{"$f":"IF('[1]Tasa de Falla'!IR91=0,\"\",'[1]Tasa de Falla'!IR91)","v":""},{"$f":"IF('[1]Tasa de Falla'!IS91=0,\"\",'[1]Tasa de Falla'!IS91)","v":""},{"$f":"IF('[1]Tasa de Falla'!IT91=0,\"\",'[1]Tasa de Falla'!IT91)","v":""},{"$f":"IF('[1]Tasa de Falla'!IU91=0,\"\",'[1]Tasa de Falla'!IU91)","v":""},{"$f":"IF('[1]Tasa de Falla'!IV91=0,\"\",'[1]Tasa de Falla'!IV91)","v":""},{"$f":"IF('[1]Tasa de Falla'!IW91=0,\"\",'[1]Tasa de Falla'!IW91)","v":""},{"$f":"IF('[1]Tasa de Falla'!IX91=0,\"\",'[1]Tasa de Falla'!IX91)","v":""},{"$f":"IF('[1]Tasa de Falla'!IY91=0,\"\",'[1]Tasa de Falla'!IY91)","v":""},{"$f":"IF('[1]Tasa de Falla'!IZ91=0,\"\",'[1]Tasa de Falla'!IZ91)","v":""},{"$f":"IF('[1]Tasa de Falla'!JA91=0,\"\",'[1]Tasa de Falla'!JA91)","v":""},{"$f":"IF('[1]Tasa de Falla'!JB91=0,\"\",'[1]Tasa de Falla'!JB91)","v":""},{"$f":"IF('[1]Tasa de Falla'!JC91=0,\"\",'[1]Tasa de Falla'!JC91)","v":3}]
[null,null,{"$f":"'[1]Tasa de Falla'!C92","v":74},{"$f":"'[1]Tasa de Falla'!D92","v":"PAMPA GRANDE - TRANCAS"},{"$f":"'[1]Tasa de Falla'!E92","v":132},{"$f":"'[1]Tasa de Falla'!F92","v":55},{"$f":"IF('[1]Tasa de Falla'!IR92=0,\"\",'[1]Tasa de Falla'!IR92)","v":""},{"$f":"IF('[1]Tasa de Falla'!IS92=0,\"\",'[1]Tasa de Falla'!IS92)","v":""},{"$f":"IF('[1]Tasa de Falla'!IT92=0,\"\",'[1]Tasa de Falla'!IT92)","v":""},{"$f":"IF('[1]Tasa de Falla'!IU92=0,\"\",'[1]Tasa de Falla'!IU92)","v":""},{"$f":"IF('[1]Tasa de Falla'!IV92=0,\"\",'[1]Tasa de Falla'!IV92)","v":""},{"$f":"IF('[1]Tasa de Falla'!IW92=0,\"\",'[1]Tasa de Falla'!IW92)","v":""},{"$f":"IF('[1]Tasa de Falla'!IX92=0,\"\",'[1]Tasa de Falla'!IX92)","v":""},{"$f":"IF('[1]Tasa de Falla'!IY92=0,\"\",'[1]Tasa de Falla'!IY92)","v":""},{"$f":"IF('[1]Tasa de Falla'!IZ92=0,\"\",'[1]Tasa de Falla'!IZ92)","v":""},{"$f":"IF('[1]Tasa de Falla'!JA92=0,\"\",'[1]Tasa de Falla'!JA92)","v":2},{"$f":"IF('[1]Tasa de Falla'!JB92=0,\"\",'[1]Tasa de Falla'!JB92)","v":""},{"$f":"IF('[1]Tasa de Falla'!JC92=0,\"\",'[1]Tasa de Falla'!JC92)","v":""}]
[null,null,{"$f":"'[1]Tasa de Falla'!C93","v":75},{"$f":"'[1]Tasa de Falla'!D93","v":"SANTIAGO CENTRO - FERNANDEZ - SUNCHO CORRAL "},{"$f":"'[1]Tasa de Falla'!E93","v":132},{"$f":"'[1]Tasa de Falla'!F93","v":103},{"$f":"IF('[1]Tasa de Falla'!IR93=0,\"\",'[1]Tasa de Falla'!IR93)","v":""},{"$f":"IF('[1]Tasa de Falla'!IS93=0,\"\",'[1]Tasa de Falla'!IS93)","v":""},{"$f":"IF('[1]Tasa de Falla'!IT93=0,\"\",'[1]Tasa de Falla'!IT93)","v":""},{"$f":"IF('[1]Tasa de Falla'!IU93=0,\"\",'[1]Tasa de Falla'!IU93)","v":""},{"$f":"IF('[1]Tasa de Falla'!IV93=0,\"\",'[1]Tasa de Falla'!IV93)","v":""},{"$f":"IF('[1]Tasa de Falla'!IW93=0,\"\",'[1]Tasa de Falla'!IW93)","v":""},{"$f":"IF('[1]Tasa de Falla'!IX93=0,\"\",'[1]Tasa de Falla'!IX93)","v":""},{"$f":"IF('[1]Tasa de Falla'!IY93=0,\"\",'[1]Tasa de Falla'!IY93)","v":""},{"$f":"IF('[1]Tasa de Falla'!IZ93=0,\"\",'[1]Tasa de Falla'!IZ93)","v":""},{"$f":"IF('[1]Tasa de Falla'!JA93=0,\"\",'[1]Tasa de Falla'!JA93)","v":""},{"$f":"IF('[1]Tasa de Falla'!JB93=0,\"\",'[1]Tasa de Falla'!JB93)","v":1},{"$f":"IF('[1]Tasa de Falla'!JC93=0,\"\",'[1]Tasa de Falla'!JC93)","v":""}]
[null,null,{"$f":"'[1]Tasa de Falla'!C94","v":76},{"$f":"'[1]Tasa de Falla'!D94","v":"SUNCHO CORRAL - ANATUYA"},{"$f":"'[1]Tasa de Falla'!E94","v":132},{"$f":"'[1]Tasa de Falla'!F94","v":81},{"$f":"IF('[1]Tasa de Falla'!IR94=0,\"\",'[1]Tasa de Falla'!IR94)","v":2},{"$f":"IF('[1]Tasa de Falla'!IS94=0,\"\",'[1]Tasa de Falla'!IS94)","v":1},{"$f":"IF('[1]Tasa de Falla'!IT94=0,\"\",'[1]Tasa de Falla'!IT94)","v":""},{"$f":"IF('[1]Tasa de Falla'!IU94=0,\"\",'[1]Tasa de Falla'!IU94)","v":""},{"$f":"IF('[1]Tasa de Falla'!IV94=0,\"\",'[1]Tasa de Falla'!IV94)","v":""},{"$f":"IF('[1]Tasa de Falla'!IW94=0,\"\",'[1]Tasa de Falla'!IW94)","v":""},{"$f":"IF('[1]Tasa de Falla'!IX94=0,\"\",'[1]Tasa de Falla'!IX94)","v":""},{"$f":"IF('[1]Tasa de Falla'!IY94=0,\"\",'[1]Tasa de Falla'!IY94)","v":""},{"$f":"IF('[1]Tasa de Falla'!IZ94=0,\"\",'[1]Tasa de Falla'!IZ94)","v":""},{"$f":"IF('[1]Tasa de Falla'!JA94=0,\"\",'[1]Tasa de Falla'!JA94)","v":""},{"$f":"IF('[1]Tasa de Falla'!JB94=0,\"\",'[1]Tasa de Falla'!JB94)","v":""},{"$f":"IF('[1]Tasa de Falla'!JC94=0,\"\",'[1]Tasa de Falla'!JC94)","v":""}]
[null,null,{"$f":"'[1]Tasa de Falla'!C95","v":77},{"$f":"'[1]Tasa de Falla'!D95","v":"LAS MADERAS - GÜEMES SALTA"},{"$f":"'[1]Tasa de Falla'!E95","v":132},{"$f":"'[1]Tasa de Falla'!F95","v":42},{"$f":"IF('[1]Tasa de Falla'!IR95=0,\"\",'[1]Tasa de Falla'!IR95)","v":1},{"$f":"IF('[1]Tasa de Falla'!IS95=0,\"\",'[1]Tasa de Falla'!IS95)","v":""},{"$f":"IF('[1]Tasa de Falla'!IT95=0,\"\",'[1]Tasa de Falla'!IT95)","v":""},{"$f":"IF('[1]Tasa de Falla'!IU95=0,\"\",'[1]Tasa de Falla'!IU95)","v":""},{"$f":"IF('[1]Tasa de Falla'!IV95=0,\"\",'[1]Tasa de Falla'!IV95)","v":""},{"$f":"IF('[1]Tasa de Falla'!IW95=0,\"\",'[1]Tasa de Falla'!IW95)","v":""},{"$f":"IF('[1]Tasa de Falla'!IX95=0,\"\",'[1]Tasa de Falla'!IX95)","v":""},{"$f":"IF('[1]Tasa de Falla'!IY95=0,\"\",'[1]Tasa de Falla'!IY95)","v":""},{"$f":"IF('[1]Tasa de Falla'!IZ95=0,\"\",'[1]Tasa de Falla'!IZ95)","v":""},{"$f":"IF('[1]Tasa de Falla'!JA95=0,\"\",'[1]Tasa de Falla'!JA95)","v":""},{"$f":"IF('[1]Tasa de Falla'!JB95=0,\"\",'[1]Tasa de Falla'!JB95)","v":""},{"$f":"IF('[1]Tasa de Falla'!JC95=0,\"\",'[1]Tasa de Falla'!JC95)","v":""}]
[null,null,{"$f":"'[1]Tasa de Falla'!C96","v":78},{"$f":"'[1]Tasa de Falla'!D96","v":"INDEPENDENCIA - EL BRACHO 2"},{"$f":"'[1]Tasa de Falla'!E96","v":132},{"$f":"'[1]Tasa de Falla'!F96","v":17.100000000000001},{"$f":"IF('[1]Tasa de Falla'!IR96=0,\"\",'[1]Tasa de Falla'!IR96)","v":""},{"$f":"IF('[1]Tasa de Falla'!IS96=0,\"\",'[1]Tasa de Falla'!IS96)","v":""},{"$f":"IF('[1]Tasa de Falla'!IT96=0,\"\",'[1]Tasa de Falla'!IT96)","v":""},{"$f":"IF('[1]Tasa de Falla'!IU96=0,\"\",'[1]Tasa de Falla'!IU96)","v":""},{"$f":"IF('[1]Tasa de Falla'!IV96=0,\"\",'[1]Tasa de Falla'!IV96)","v":1},{"$f":"IF('[1]Tasa de Falla'!IW96=0,\"\",'[1]Tasa de Falla'!IW96)","v":""},{"$f":"IF('[1]Tasa de Falla'!IX96=0,\"\",'[1]Tasa de Falla'!IX96)","v":""},{"$f":"IF('[1]Tasa de Falla'!IY96=0,\"\",'[1]Tasa de Falla'!IY96)","v":""},{"$f":"IF('[1]Tasa de Falla'!IZ96=0,\"\",'[1]Tasa de Falla'!IZ96)","v":1},{"$f":"IF('[1]Tasa de Falla'!JA96=0,\"\",'[1]Tasa de Falla'!JA96)","v":2},{"$f":"IF('[1]Tasa de Falla'!JB96=0,\"\",'[1]Tasa de Falla'!JB96)","v":""},{"$f":"IF('[1]Tasa de Falla'!JC96=0,\"\",'[1]Tasa de Falla'!JC96)","v":""}]
[null,null,{"$f":"'[1]Tasa de Falla'!C97","v":79},{"$f":"'[1]Tasa de Falla'!D97","v":"GÜEMES - SALTA NORTE"},{"$f":"'[1]Tasa de Falla'!E97","v":132},{"$f":"'[1]Tasa de Falla'!F97","v":39},{"$f":"IF('[1]Tasa de Falla'!IR97=0,\"\",'[1]Tasa de Falla'!IR97)","v":"XXXX"},{"$f":"IF('[1]Tasa de Falla'!IS97=0,\"\",'[1]Tasa de Falla'!IS97)","v":"XXXX"},{"$f":"IF('[1]Tasa de Falla'!IT97=0,\"\",'[1]Tasa de Falla'!IT97)","v":"XXXX"},{"$f":"IF('[1]Tasa de Falla'!IU97=0,\"\",'[1]Tasa de Falla'!IU97)","v":"XXXX"},{"$f":"IF('[1]Tasa de Falla'!IV97=0,\"\",'[1]Tasa de Falla'!IV97)","v":"XXXX"},{"$f":"IF('[1]Tasa de Falla'!IW97=0,\"\",'[1]Tasa de Falla'!IW97)","v":"XXXX"},{"$f":"IF('[1]Tasa de Falla'!IX97=0,\"\",'[1]Tasa de Falla'!IX97)","v":"XXXX"},{"$f":"IF('[1]Tasa de Falla'!IY97=0,\"\",'[1]Tasa de Falla'!IY97)","v":"XXXX"},{"$f":"IF('[1]Tasa de Falla'!IZ97=0,\"\",'[1]Tasa de Falla'!IZ97)","v":"XXXX"},{"$f":"IF('[1]Tasa de Falla'!JA97=0,\"\",'[1]Tasa de Falla'!JA97)","v":"XXXX"},{"$f":"IF('[1]Tasa de Falla'!JB97=0,\"\",'[1]Tasa de Falla'!JB97)","v":"XXXX"},{"$f":"IF('[1]Tasa de Falla'!JC97=0,\"\",'[1]Tasa de Falla'!JC97)","v":"XXXX"}]
[null,null,{"$f":"'[1]Tasa de Falla'!C98","v":80},{"$f":"'[1]Tasa de Falla'!D98","v":"BURRUYACU - COBOS"},{"$f":"'[1]Tasa de Falla'!E98","v":132},{"$f":"'[1]Tasa de Falla'!F98","v":229.5},{"$f":"IF('[1]Tasa de Falla'!IR98=0,\"\",'[1]Tasa de Falla'!IR98)","v":"XXXX"},{"$f":"IF('[1]Tasa de Falla'!IS98=0,\"\",'[1]Tasa de Falla'!IS98)","v":"XXXX"},{"$f":"IF('[1]Tasa de Falla'!IT98=0,\"\",'[1]Tasa de Falla'!IT98)","v":"XXXX"},{"$f":"IF('[1]Tasa de Falla'!IU98=0,\"\",'[1]Tasa de Falla'!IU98)","v":"XXXX"},{"$f":"IF('[1]Tasa de Falla'!IV98=0,\"\",'[1]Tasa de Falla'!IV98)","v":"XXXX"},{"$f":"IF('[1]Tasa de Falla'!IW98=0,\"\",'[1]Tasa de Falla'!IW98)","v":"XXXX"},{"$f":"IF('[1]Tasa de Falla'!IX98=0,\"\",'[1]Tasa de Falla'!IX98)","v":"XXXX"},{"$f":"IF('[1]Tasa de Falla'!IY98=0,\"\",'[1]Tasa de Falla'!IY98)","v":"XXXX"},{"$f":"IF('[1]Tasa de Falla'!IZ98=0,\"\",'[1]Tasa de Falla'!IZ98)","v":"XXXX"},{"$f":"IF('[1]Tasa de Falla'!JA98=0,\"\",'[1]Tasa de Falla'!JA98)","v":"XXXX"},{"$f":"IF('[1]Tasa de Falla'!JB98=0,\"\",'[1]Tasa de Falla'!JB98)","v":"XXXX"},{"$f":"IF('[1]Tasa de Falla'!JC98=0,\"\",'[1]Tasa de Falla'!JC98)","v":"XXXX"}]
[null,null,{"$f":"'[1]Tasa de Falla'!C99","v":81},{"$f":"'[1]Tasa de Falla'!D99","v":"METAN - COBOS"},{"$f":"'[1]Tasa de Falla'!E99","v":132},{"$f":"'[1]Tasa de Falla'!F99","v":89.2},{"$f":"IF('[1]Tasa de Falla'!IR99=0,\"\",'[1]Tasa de Falla'!IR99)","v":""},{"$f":"IF('[1]Tasa de Falla'!IS99=0,\"\",'[1]Tasa de Falla'!IS99)","v":""},{"$f":"IF('[1]Tasa de Falla'!IT99=0,\"\",'[1]Tasa de Falla'!IT99)","v":""},{"$f":"IF('[1]Tasa de Falla'!IU99=0,\"\",'[1]Tasa de Falla'!IU99)","v":""},{"$f":"IF('[1]Tasa de Falla'!IV99=0,\"\",'[1]Tasa de Falla'!IV99)","v":""},{"$f":"IF('[1]Tasa de Falla'!IW99=0,\"\",'[1]Tasa de Falla'!IW99)","v":""},{"$f":"IF('[1]Tasa de Falla'!IX99=0,\"\",'[1]Tasa de Falla'!IX99)","v":""},{"$f":"IF('[1]Tasa de Falla'!IY99=0,\"\",'[1]Tasa de Falla'!IY99)","v":""},{"$f":"IF('[1]Tasa de Falla'!IZ99=0,\"\",'[1]Tasa de Falla'!IZ99)","v":""},{"$f":"IF('[1]Tasa de Falla'!JA99=0,\"\",'[1]Tasa de Falla'!JA99)","v":""},{"$f":"IF('[1]Tasa de Falla'!JB99=0,\"\",'[1]Tasa de Falla'!JB99)","v":""},{"$f":"IF('[1]Tasa de Falla'!JC99=0,\"\",'[1]Tasa de Falla'!JC99)","v":""}]
[null,null,{"$f":"'[1]Tasa de Falla'!C100","v":82},{"$f":"'[1]Tasa de Falla'!D100","v":"AÑATUYA - BANDERA"},{"$f":"'[1]Tasa de Falla'!E100","v":132},{"$f":"'[1]Tasa de Falla'!F100","v":76},{"$f":"IF('[1]Tasa de Falla'!IR100=0,\"\",'[1]Tasa de Falla'!IR100)","v":""},{"$f":"IF('[1]Tasa de Falla'!IS100=0,\"\",'[1]Tasa de Falla'!IS100)","v":2},{"$f":"IF('[1]Tasa de Falla'!IT100=0,\"\",'[1]Tasa de Falla'!IT100)","v":""},{"$f":"IF('[1]Tasa de Falla'!IU100=0,\"\",'[1]Tasa de Falla'!IU100)","v":""},{"$f":"IF('[1]Tasa de Falla'!IV100=0,\"\",'[1]Tasa de Falla'!IV100)","v":1},{"$f":"IF('[1]Tasa de Falla'!IW100=0,\"\",'[1]Tasa de Falla'!IW100)","v":""},{"$f":"IF('[1]Tasa de Falla'!IX100=0,\"\",'[1]Tasa de Falla'!IX100)","v":""},{"$f":"IF('[1]Tasa de Falla'!IY100=0,\"\",'[1]Tasa de Falla'!IY100)","v":""},{"$f":"IF('[1]Tasa de Falla'!IZ100=0,\"\",'[1]Tasa de Falla'!IZ100)","v":""},{"$f":"IF('[1]Tasa de Falla'!JA100=0,\"\",'[1]Tasa de Falla'!JA100)","v":""},{"$f":"IF('[1]Tasa de Falla'!JB100=0,\"\",'[1]Tasa de Falla'!JB100)","v":""},{"$f":"IF('[1]Tasa de Falla'!JC100=0,\"\",'[1]Tasa de Falla'!JC100)","v":""}]
[null,null,{"$f":"'[1]Tasa de Falla'!C101","v":84},{"$f":"'[1]Tasa de Falla'!D101","v":"GÜEMES SALTA - COBOS 1"},{"$f":"'[1]Tasa de Falla'!E101","v":132},{"$f":"'[1]Tasa de Falla'!F101","v":12.1},{"$f":"IF('[1]Tasa de Falla'!IR101=0,\"\",'[1]Tasa de Falla'!IR101)","v":""},{"$f":"IF('[1]Tasa de Falla'!IS101=0,\"\",'[1]Tasa de Falla'!IS101)","v":""},{"$f":"IF('[1]Tasa de Falla'!IT101=0,\"\",'[1]Tasa de Falla'!IT101)","v":""},{"$f":"IF('[1]Tasa de Falla'!IU101=0,\"\",'[1]Tasa de Falla'!IU101)","v":""},{"$f":"IF('[1]Tasa de Falla'!IV101=0,\"\",'[1]Tasa de Falla'!IV101)","v":""},{"$f":"IF('[1]Tasa de Falla'!IW101=0,\"\",'[1]Tasa de Falla'!IW101)","v":""},{"$f":"IF('[1]Tasa de Falla'!IX101=0,\"\",'[1]Tasa de Falla'!IX101)","v":""},{"$f":"IF('[1]Tasa de Falla'!IY101=0,\"\",'[1]Tasa de Falla'!IY101)","v":""},{"$f":"IF('[1]Tasa de Falla'!IZ101=0,\"\",'[1]Tasa de Falla'!IZ101)","v":""},{"$f":"IF('[1]Tasa de Falla'!JA101=0,\"\",'[1]Tasa de Falla'!JA101)","v":""},{"$f":"IF('[1]Tasa de Falla'!JB101=0,\"\",'[1]Tasa de Falla'!JB101)","v":""},{"$f":"IF('[1]Tasa de Falla'!JC101=0,\"\",'[1]Tasa de Falla'!JC101)","v":""}]
[null,null,{"$f":"'[1]Tasa de Falla'!C102","v":85},{"$f":"'[1]Tasa de Falla'!D102","v":"GÜEMES SALTA - COBOS 2"},{"$f":"'[1]Tasa de Falla'!E102","v":132},{"$f":"'[1]Tasa de Falla'!F102","v":12.1},{"$f":"IF('[1]Tasa de Falla'!IR102=0,\"\",'[1]Tasa de Falla'!IR102)","v":""},{"$f":"IF('[1]Tasa de Falla'!IS102=0,\"\",'[1]Tasa de Falla'!IS102)","v":""},{"$f":"IF('[1]Tasa de Falla'!IT102=0,\"\",'[1]Tasa de Falla'!IT102)","v":""},{"$f":"IF('[1]Tasa de Falla'!IU102=0,\"\",'[1]Tasa de Falla'!IU102)","v":""},{"$f":"IF('[1]Tasa de Falla'!IV102=0,\"\",'[1]Tasa de Falla'!IV102)","v":""},{"$f":"IF('[1]Tasa de Falla'!IW102=0,\"\",'[1]Tasa de Falla'!IW102)","v":""},{"$f":"IF('[1]Tasa de Falla'!IX102=0,\"\",'[1]Tasa de Falla'!IX102)","v":""},{"$f":"IF('[1]Tasa de Falla'!IY102=0,\"\",'[1]Tasa de Falla'!IY102)","v":""},{"$f":"IF('[1]Tasa de Falla'!IZ102=0,\"\",'[1]Tasa de Falla'!IZ102)","v":1},{"$f":"IF('[1]Tasa de Falla'!JA102=0,\"\",'[1]Tasa de Falla'!JA102)","v":""},{"$f":"IF('[1]Tasa de Falla'!JB102=0,\"\",'[1]Tasa de Falla'!JB102)","v":""},{"$f":"IF('[1]Tasa de Falla'!JC102=0,\"\",'[1]Tasa de Falla'!JC102)","v":""}]
[null,null,{"$f":"'[1]Tasa de Falla'!C103","v":86},{"$f":"'[1]Tasa de Falla'!D103","v":"EL BRACHO - LA BANDA"},{"$f":"'[1]Tasa de Falla'!E103","v":132},{"$f":"'[1]Tasa de Falla'!F103","v":133.5},{"$f":"IF('[1]Tasa de Falla'!IR103=0,\"\",'[1]Tasa de Falla'!IR103)","v":"XXXX"},{"$f":"IF('[1]Tasa de Falla'!IS103=0,\"\",'[1]Tasa de Falla'!IS103)","v":"XXXX"},{"$f":"IF('[1]Tasa de Falla'!IT103=0,\"\",'[1]Tasa de Falla'!IT103)","v":"XXXX"},{"$f":"IF('[1]Tasa de Falla'!IU103=0,\"\",'[1]Tasa de Falla'!IU103)","v":"XXXX"},{"$f":"IF('[1]Tasa de Falla'!IV103=0,\"\",'[1]Tasa de Falla'!IV103)","v":"XXXX"},{"$f":"IF('[1]Tasa de Falla'!IW103=0,\"\",'[1]Tasa de Falla'!IW103)","v":"XXXX"},{"$f":"IF('[1]Tasa de Falla'!IX103=0,\"\",'[1]Tasa de Falla'!IX103)","v":"XXXX"},{"$f":"IF('[1]Tasa de Falla'!IY103=0,\"\",'[1]Tasa de Falla'!IY103)","v":"XXXX"},{"$f":"IF('[1]Tasa de Falla'!IZ103=0,\"\",'[1]Tasa de Falla'!IZ103)","v":"XXXX"},{"$f":"IF('[1]Tasa de Falla'!JA103=0,\"\",'[1]Tasa de Falla'!JA103)","v":"XXXX"},{"$f":"IF('[1]Tasa de Falla'!JB103=0,\"\",'[1]Tasa de Falla'!JB103)","v":"XXXX"},{"$f":"IF('[1]Tasa de Falla'!JC103=0,\"\",'[1]Tasa de Falla'!JC103)","v":"XXXX"}]
[null,null,{"$f":"'[1]Tasa de Falla'!C104","v":87},{"$f":"'[1]Tasa de Falla'!D104","v":"SANTIAGO OESTE - SANTIAGO SUR "},{"$f":"'[1]Tasa de Falla'!E104","v":132},{"$f":"'[1]Tasa de Falla'!F104","v":10.6},{"$f":"IF('[1]Tasa de Falla'!IR104=0,\"\",'[1]Tasa de Falla'!IR104)","v":""},{"$f":"IF('[1]Tasa de Falla'!IS104=0,\"\",'[1]Tasa de Falla'!IS104)","v":1},{"$f":"IF('[1]Tasa de Falla'!IT104=0,\"\",'[1]Tasa de Falla'!IT104)","v":""},{"$f":"IF('[1]Tasa de Falla'!IU104=0,\"\",'[1]Tasa de Falla'!IU104)","v":""},{"$f":"IF('[1]Tasa de Falla'!IV104=0,\"\",'[1]Tasa de Falla'!IV104)","v":""},{"$f":"IF('[1]Tasa de Falla'!IW104=0,\"\",'[1]Tasa de Falla'!IW104)","v":""},{"$f":"IF('[1]Tasa de Falla'!IX104=0,\"\",'[1]Tasa de Falla'!IX104)","v":""},{"$f":"IF('[1]Tasa de Falla'!IY104=0,\"\",'[1]Tasa de Falla'!IY104)","v":""},{"$f":"IF('[1]Tasa de Falla'!IZ104=0,\"\",'[1]Tasa de Falla'!IZ104)","v":""},{"$f":"IF('[1]Tasa de Falla'!JA104=0,\"\",'[1]Tasa de Falla'!JA104)","v":""},{"$f":"IF('[1]Tasa de Falla'!JB104=0,\"\",'[1]Tasa de Falla'!JB104)","v":""},{"$f":"IF('[1]Tasa de Falla'!JC104=0,\"\",'[1]Tasa de Falla'!JC104)","v":""}]
[null,null,{"$f":"'[1]Tasa de Falla'!C105","v":88},{"$f":"'[1]Tasa de Falla'!D105","v":"SANTIAGO SUR - SANTIAGO CENTRO"},{"$f":"'[1]Tasa de Falla'!E105","v":132},{"$f":"'[1]Tasa de Falla'!F105","v":4},{"$f":"IF('[1]Tasa de Falla'!IR105=0,\"\",'[1]Tasa de Falla'!IR105)","v":""},{"$f":"IF('[1]Tasa de Falla'!IS105=0,\"\",'[1]Tasa de Falla'!IS105)","v":""},{"$f":"IF('[1]Tasa de Falla'!IT105=0,\"\",'[1]Tasa de Falla'!IT105)","v":""},{"$f":"IF('[1]Tasa de Falla'!IU105=0,\"\",'[1]Tasa de Falla'!IU105)","v":""},{"$f":"IF('[1]Tasa de Falla'!IV105=0,\"\",'[1]Tasa de Falla'!IV105)","v":""},{"$f":"IF('[1]Tasa de Falla'!IW105=0,\"\",'[1]Tasa de Falla'!IW105)","v":""},{"$f":"IF('[1]Tasa de Falla'!IX105=0,\"\",'[1]Tasa de Falla'!IX105)","v":""},{"$f":"IF('[1]Tasa de Falla'!IY105=0,\"\",'[1]Tasa de Falla'!IY105)","v":""},{"$f":"IF('[1]Tasa de Falla'!IZ105=0,\"\",'[1]Tasa de Falla'!IZ105)","v":""},{"$f":"IF('[1]Tasa de Falla'!JA105=0,\"\",'[1]Tasa de Falla'!JA105)","v":""},{"$f":"IF('[1]Tasa de Falla'!JB105=0,\"\",'[1]Tasa de Falla'!JB105)","v":""},{"$f":"IF('[1]Tasa de Falla'!JC105=0,\"\",'[1]Tasa de Falla'!JC105)","v":""}]
[null,null,{"$f":"'[1]Tasa de Falla'!C106","v":89},{"$f":"'[1]Tasa de Falla'!D106","v":"C.H. RIO HONDO - SANTIAGO OESTE"},{"$f":"'[1]Tasa de Falla'!E106","v":132},{"$f":"'[1]Tasa de Falla'!F106","v":69.8},{"$f":"IF('[1]Tasa de Falla'!IR106=0,\"\",'[1]Tasa de Falla'!IR106)","v":""},{"$f":"IF('[1]Tasa de Falla'!IS106=0,\"\",'[1]Tasa de Falla'!IS106)","v":1},{"$f":"IF('[1]Tasa de Falla'!IT106=0,\"\",'[1]Tasa de Falla'!IT106)","v":""},{"$f":"IF('[1]Tasa de Falla'!IU106=0,\"\",'[1]Tasa de Falla'!IU106)","v":""},{"$f":"IF('[1]Tasa de Falla'!IV106=0,\"\",'[1]Tasa de Falla'!IV106)","v":""},{"$f":"IF('[1]Tasa de Falla'!IW106=0,\"\",'[1]Tasa de Falla'!IW106)","v":""},{"$f":"IF('[1]Tasa de Falla'!IX106=0,\"\",'[1]Tasa de Falla'!IX106)","v":""},{"$f":"IF('[1]Tasa de Falla'!IY106=0,\"\",'[1]Tasa de Falla'!IY106)","v":""},{"$f":"IF('[1]Tasa de Falla'!IZ106=0,\"\",'[1]Tasa de Falla'!IZ106)","v":""},{"$f":"IF('[1]Tasa de Falla'!JA106=0,\"\",'[1]Tasa de Falla'!JA106)","v":""},{"$f":"IF('[1]Tasa de Falla'!JB106=0,\"\",'[1]Tasa de Falla'!JB106)","v":""},{"$f":"IF('[1]Tasa de Falla'!JC106=0,\"\",'[1]Tasa de Falla'!JC106)","v":""}]
[null,null,{"$f":"'[1]Tasa de Falla'!C107","v":90},{"$f":"'[1]Tasa de Falla'!D107","v":"GÜEMES - MINETTI"},{"$f":"'[1]Tasa de Falla'!E107","v":132},{"$f":"'[1]Tasa de Falla'!F107","v":36.1},{"$f":"IF('[1]Tasa de Falla'!IR107=0,\"\",'[1]Tasa de Falla'!IR107)","v":"XXXX"},{"$f":"IF('[1]Tasa de Falla'!IS107=0,\"\",'[1]Tasa de Falla'!IS107)","v":"XXXX"},{"$f":"IF('[1]Tasa de Falla'!IT107=0,\"\",'[1]Tasa de Falla'!IT107)","v":"XXXX"},{"$f":"IF('[1]Tasa de Falla'!IU107=0,\"\",'[1]Tasa de Falla'!IU107)","v":"XXXX"},{"$f":"IF('[1]Tasa de Falla'!IV107=0,\"\",'[1]Tasa de Falla'!IV107)","v":"XXXX"},{"$f":"IF('[1]Tasa de Falla'!IW107=0,\"\",'[1]Tasa de Falla'!IW107)","v":"XXXX"},{"$f":"IF('[1]Tasa de Falla'!IX107=0,\"\",'[1]Tasa de Falla'!IX107)","v":"XXXX"},{"$f":"IF('[1]Tasa de Falla'!IY107=0,\"\",'[1]Tasa de Falla'!IY107)","v":"XXXX"},{"$f":"IF('[1]Tasa de Falla'!IZ107=0,\"\",'[1]Tasa de Falla'!IZ107)","v":"XXXX"},{"$f":"IF('[1]Tasa de Falla'!JA107=0,\"\",'[1]Tasa de Falla'!JA107)","v":"XXXX"},{"$f":"IF('[1]Tasa de Falla'!JB107=0,\"\",'[1]Tasa de Falla'!JB107)","v":"XXXX"},{"$f":"IF('[1]Tasa de Falla'!JC107=0,\"\",'[1]Tasa de Falla'!JC107)","v":"XXXX"}]
[null,null,{"$f":"'[1]Tasa de Falla'!C108","v":91},{"$f":"'[1]Tasa de Falla'!D108","v":"GÜEMES - SALTA NORTE"},{"$f":"'[1]Tasa de Falla'!E108","v":132},{"$f":"'[1]Tasa de Falla'!F108","v":38.97},{"$f":"IF('[1]Tasa de Falla'!IR108=0,\"\",'[1]Tasa de Falla'!IR108)","v":""},{"$f":"IF('[1]Tasa de Falla'!IS108=0,\"\",'[1]Tasa de Falla'!IS108)","v":""},{"$f":"IF('[1]Tasa de Falla'!IT108=0,\"\",'[1]Tasa de Falla'!IT108)","v":""},{"$f":"IF('[1]Tasa de Falla'!IU108=0,\"\",'[1]Tasa de Falla'!IU108)","v":""},{"$f":"IF('[1]Tasa de Falla'!IV108=0,\"\",'[1]Tasa de Falla'!IV108)","v":""},{"$f":"IF('[1]Tasa de Falla'!IW108=0,\"\",'[1]Tasa de Falla'!IW108)","v":""},{"$f":"IF('[1]Tasa de Falla'!IX108=0,\"\",'[1]Tasa de Falla'!IX108)","v":""},{"$f":"IF('[1]Tasa de Falla'!IY108=0,\"\",'[1]Tasa de Falla'!IY108)","v":""},{"$f":"IF('[1]Tasa de Falla'!IZ108=0,\"\",'[1]Tasa de Falla'!IZ108)","v":""},{"$f":"IF('[1]Tasa de Falla'!JA108=0,\"\",'[1]Tasa de Falla'!JA108)","v":""},{"$f":"IF('[1]Tasa de Falla'!JB108=0,\"\",'[1]Tasa de Falla'!JB108)","v":""},{"$f":"IF('[1]Tasa de Falla'!JC108=0,\"\",'[1]Tasa de Falla'!JC108)","v":""}]
[null,null,{"$f":"'[1]Tasa de Falla'!C109","v":92},{"$f":"'[1]Tasa de Falla'!D109","v":"BURRUYACU - R. DE LA FRONTERA"},{"$f":"'[1]Tasa de Falla'!E109","v":132},{"$f":"'[1]Tasa de Falla'!F109","v":99.1},{"$f":"IF('[1]Tasa de Falla'!IR109=0,\"\",'[1]Tasa de Falla'!IR109)","v":""},{"$f":"IF('[1]Tasa de Falla'!IS109=0,\"\",'[1]Tasa de Falla'!IS109)","v":""},{"$f":"IF('[1]Tasa de Falla'!IT109=0,\"\",'[1]Tasa de Falla'!IT109)","v":""},{"$f":"IF('[1]Tasa de Falla'!IU109=0,\"\",'[1]Tasa de Falla'!IU109)","v":""},{"$f":"IF('[1]Tasa de Falla'!IV109=0,\"\",'[1]Tasa de Falla'!IV109)","v":""},{"$f":"IF('[1]Tasa de Falla'!IW109=0,\"\",'[1]Tasa de Falla'!IW109)","v":""},{"$f":"IF('[1]Tasa de Falla'!IX109=0,\"\",'[1]Tasa de Falla'!IX109)","v":""},{"$f":"IF('[1]Tasa de Falla'!IY109=0,\"\",'[1]Tasa de Falla'!IY109)","v":""},{"$f":"IF('[1]Tasa de Falla'!IZ109=0,\"\",'[1]Tasa de Falla'!IZ109)","v":""},{"$f":"IF('[1]Tasa de Falla'!JA109=0,\"\",'[1]Tasa de Falla'!JA109)","v":1},{"$f":"IF('[1]Tasa de Falla'!JB109=0,\"\",'[1]Tasa de Falla'!JB109)","v":""},{"$f":"IF('[1]Tasa de Falla'!JC109=0,\"\",'[1]Tasa de Falla'!JC109)","v":""}]
[null,null,{"$f":"'[1]Tasa de Falla'!C110","v":93},{"$f":"'[1]Tasa de Falla'!D110","v":"R. DE LA FRONTERA - COBOS"},{"$f":"'[1]Tasa de Falla'!E110","v":132},{"$f":"'[1]Tasa de Falla'!F110","v":130.4},{"$f":"IF('[1]Tasa de Falla'!IR110=0,\"\",'[1]Tasa de Falla'!IR110)","v":""},{"$f":"IF('[1]Tasa de Falla'!IS110=0,\"\",'[1]Tasa de Falla'!IS110)","v":""},{"$f":"IF('[1]Tasa de Falla'!IT110=0,\"\",'[1]Tasa de Falla'!IT110)","v":1},{"$f":"IF('[1]Tasa de Falla'!IU110=0,\"\",'[1]Tasa de Falla'!IU110)","v":""},{"$f":"IF('[1]Tasa de Falla'!IV110=0,\"\",'[1]Tasa de Falla'!IV110)","v":""},{"$f":"IF('[1]Tasa de Falla'!IW110=0,\"\",'[1]Tasa de Falla'!IW110)","v":""},{"$f":"IF('[1]Tasa de Falla'!IX110=0,\"\",'[1]Tasa de Falla'!IX110)","v":""},{"$f":"IF('[1]Tasa de Falla'!IY110=0,\"\",'[1]Tasa de Falla'!IY110)","v":""},{"$f":"IF('[1]Tasa de Falla'!IZ110=0,\"\",'[1]Tasa de Falla'!IZ110)","v":""},{"$f":"IF('[1]Tasa de Falla'!JA110=0,\"\",'[1]Tasa de Falla'!JA110)","v":1},{"$f":"IF('[1]Tasa de Falla'!JB110=0,\"\",'[1]Tasa de Falla'!JB110)","v":""},{"$f":"IF('[1]Tasa de Falla'!JC110=0,\"\",'[1]Tasa de Falla'!JC110)","v":""}]
[null,null,{"$f":"'[1]Tasa de Falla'!C111","v":94},{"$f":"'[1]Tasa de Falla'!D111","v":"J.V. GONZALEZ - APOLINARIO SARAVIA"},{"$f":"'[1]Tasa de Falla'!E111","v":132},{"$f":"'[1]Tasa de Falla'!F111","v":94},{"$f":"IF('[1]Tasa de Falla'!IR111=0,\"\",'[1]Tasa de Falla'!IR111)","v":""},{"$f":"IF('[1]Tasa de Falla'!IS111=0,\"\",'[1]Tasa de Falla'!IS111)","v":""},{"$f":"IF('[1]Tasa de Falla'!IT111=0,\"\",'[1]Tasa de Falla'!IT111)","v":""},{"$f":"IF('[1]Tasa de Falla'!IU111=0,\"\",'[1]Tasa de Falla'!IU111)","v":""},{"$f":"IF('[1]Tasa de Falla'!IV111=0,\"\",'[1]Tasa de Falla'!IV111)","v":""},{"$f":"IF('[1]Tasa de Falla'!IW111=0,\"\",'[1]Tasa de Falla'!IW111)","v":""},{"$f":"IF('[1]Tasa de Falla'!IX111=0,\"\",'[1]Tasa de Falla'!IX111)","v":""},{"$f":"IF('[1]Tasa de Falla'!IY111=0,\"\",'[1]Tasa de Falla'!IY111)","v":""},{"$f":"IF('[1]Tasa de Falla'!IZ111=0,\"\",'[1]Tasa de Falla'!IZ111)","v":""},{"$f":"IF('[1]Tasa de Falla'!JA111=0,\"\",'[1]Tasa de Falla'!JA111)","v":""},{"$f":"IF('[1]Tasa de Falla'!JB111=0,\"\",'[1]Tasa de Falla'!JB111)","v":""},{"$f":"IF('[1]Tasa de Falla'!JC111=0,\"\",'[1]Tasa de Falla'!JC111)","v":1}]
[null,null,{"$f":"'[1]Tasa de Falla'!C112","v":95},{"$f":"'[1]Tasa de Falla'!D112","v":"ANDALGALA - SAULIL"},{"$f":"'[1]Tasa de Falla'!E112","v":132},{"$f":"'[1]Tasa de Falla'!F112","v":76},{"$f":"IF('[1]Tasa de Falla'!IR112=0,\"\",'[1]Tasa de Falla'!IR112)","v":""},{"$f":"IF('[1]Tasa de Falla'!IS112=0,\"\",'[1]Tasa de Falla'!IS112)","v":""},{"$f":"IF('[1]Tasa de Falla'!IT112=0,\"\",'[1]Tasa de Falla'!IT112)","v":""},{"$f":"IF('[1]Tasa de Falla'!IU112=0,\"\",'[1]Tasa de Falla'!IU112)","v":""},{"$f":"IF('[1]Tasa de Falla'!IV112=0,\"\",'[1]Tasa de Falla'!IV112)","v":""},{"$f":"IF('[1]Tasa de Falla'!IW112=0,\"\",'[1]Tasa de Falla'!IW112)","v":""},{"$f":"IF('[1]Tasa de Falla'!IX112=0,\"\",'[1]Tasa de Falla'!IX112)","v":""},{"$f":"IF('[1]Tasa de Falla'!IY112=0,\"\",'[1]Tasa de Falla'!IY112)","v":""},{"$f":"IF('[1]Tasa de Falla'!IZ112=0,\"\",'[1]Tasa de Falla'!IZ112)","v":""},{"$f":"IF('[1]Tasa de Falla'!JA112=0,\"\",'[1]Tasa de Falla'!JA112)","v":""},{"$f":"IF('[1]Tasa de Falla'!JB112=0,\"\",'[1]Tasa de Falla'!JB112)","v":""},{"$f":"IF('[1]Tasa de Falla'!JC112=0,\"\",'[1]Tasa de Falla'!JC112)","v":1}]
[null,null,{"$f":"'[1]Tasa de Falla'!C113","v":96},{"$f":"'[1]Tasa de Falla'!D113","v":"SANTIAGO OESTE - SANT. SUR  - SANT. CENTRO"},{"$f":"'[1]Tasa de Falla'!E113","v":132},{"$f":"'[1]Tasa de Falla'!F113","v":14.6},{"$f":"IF('[1]Tasa de Falla'!IR113=0,\"\",'[1]Tasa de Falla'!IR113)","v":"XXXX"},{"$f":"IF('[1]Tasa de Falla'!IS113=0,\"\",'[1]Tasa de Falla'!IS113)","v":"XXXX"},{"$f":"IF('[1]Tasa de Falla'!IT113=0,\"\",'[1]Tasa de Falla'!IT113)","v":"XXXX"},{"$f":"IF('[1]Tasa de Falla'!IU113=0,\"\",'[1]Tasa de Falla'!IU113)","v":"XXXX"},{"$f":"IF('[1]Tasa de Falla'!IV113=0,\"\",'[1]Tasa de Falla'!IV113)","v":"XXXX"},{"$f":"IF('[1]Tasa de Falla'!IW113=0,\"\",'[1]Tasa de Falla'!IW113)","v":"XXXX"},{"$f":"IF('[1]Tasa de Falla'!IX113=0,\"\",'[1]Tasa de Falla'!IX113)","v":"XXXX"},{"$f":"IF('[1]Tasa de Falla'!IY113=0,\"\",'[1]Tasa de Falla'!IY113)","v":"XXXX"},{"$f":"IF('[1]Tasa de Falla'!IZ113=0,\"\",'[1]Tasa de Falla'!IZ113)","v":"XXXX"},{"$f":"IF('[1]Tasa de Falla'!JA113=0,\"\",'[1]Tasa de Falla'!JA113)","v":"XXXX"},{"$f":"IF('[1]Tasa de Falla'!JB113=0,\"\",'[1]Tasa de Falla'!JB113)","v":"XXXX"},{"$f":"IF('[1]Tasa de Falla'!JC113=0,\"\",'[1]Tasa de Falla'!JC113)","v":"XXXX"}]
[null,null,{"$f":"'[1]Tasa de Falla'!C114","v":97},{"$f":"'[1]Tasa de Falla'!D114","v":"SUNCHO CORRAL - QUIMILI"},{"$f":"'[1]Tasa de Falla'!E114","v":132},{"$f":"'[1]Tasa de Falla'!F114","v":108},{"$f":"IF('[1]Tasa de Falla'!IR114=0,\"\",'[1]Tasa de Falla'!IR114)","v":""},{"$f":"IF('[1]Tasa de Falla'!IS114=0,\"\",'[1]Tasa de Falla'!IS114)","v":""},{"$f":"IF('[1]Tasa de Falla'!IT114=0,\"\",'[1]Tasa de Falla'!IT114)","v":""},{"$f":"IF('[1]Tasa de Falla'!IU114=0,\"\",'[1]Tasa de Falla'!IU114)","v":""},{"$f":"IF('[1]Tasa de Falla'!IV114=0,\"\",'[1]Tasa de Falla'!IV114)","v":""},{"$f":"IF('[1]Tasa de Falla'!IW114=0,\"\",'[1]Tasa de Falla'!IW114)","v":""},{"$f":"IF('[1]Tasa de Falla'!IX114=0,\"\",'[1]Tasa de Falla'!IX114)","v":""},{"$f":"IF('[1]Tasa de Falla'!IY114=0,\"\",'[1]Tasa de Falla'!IY114)","v":""},{"$f":"IF('[1]Tasa de Falla'!IZ114=0,\"\",'[1]Tasa de Falla'!IZ114)","v":""},{"$f":"IF('[1]Tasa de Falla'!JA114=0,\"\",'[1]Tasa de Falla'!JA114)","v":""},{"$f":"IF('[1]Tasa de Falla'!JB114=0,\"\",'[1]Tasa de Falla'!JB114)","v":""},{"$f":"IF('[1]Tasa de Falla'!JC114=0,\"\",'[1]Tasa de Falla'!JC114)","v":""}]
[null,null,{"$f":"'[1]Tasa de Falla'!C115","v":98},{"$f":"'[1]Tasa de Falla'!D115","v":"EL BRACHO - LA BANDA ESTE"},{"$f":"'[1]Tasa de Falla'!E115","v":132},{"$f":"'[1]Tasa de Falla'!F115","v":140.9},{"$f":"IF('[1]Tasa de Falla'!IR115=0,\"\",'[1]Tasa de Falla'!IR115)","v":""},{"$f":"IF('[1]Tasa de Falla'!IS115=0,\"\",'[1]Tasa de Falla'!IS115)","v":""},{"$f":"IF('[1]Tasa de Falla'!IT115=0,\"\",'[1]Tasa de Falla'!IT115)","v":1},{"$f":"IF('[1]Tasa de Falla'!IU115=0,\"\",'[1]Tasa de Falla'!IU115)","v":""},{"$f":"IF('[1]Tasa de Falla'!IV115=0,\"\",'[1]Tasa de Falla'!IV115)","v":1},{"$f":"IF('[1]Tasa de Falla'!IW115=0,\"\",'[1]Tasa de Falla'!IW115)","v":""},{"$f":"IF('[1]Tasa de Falla'!IX115=0,\"\",'[1]Tasa de Falla'!IX115)","v":""},{"$f":"IF('[1]Tasa de Falla'!IY115=0,\"\",'[1]Tasa de Falla'!IY115)","v":""},{"$f":"IF('[1]Tasa de Falla'!IZ115=0,\"\",'[1]Tasa de Falla'!IZ115)","v":""},{"$f":"IF('[1]Tasa de Falla'!JA115=0,\"\",'[1]Tasa de Falla'!JA115)","v":""},{"$f":"IF('[1]Tasa de Falla'!JB115=0,\"\",'[1]Tasa de Falla'!JB115)","v":""},{"$f":"IF('[1]Tasa de Falla'!JC115=0,\"\",'[1]Tasa de Falla'!JC115)","v":1}]
[null,null,{"$f":"'[1]Tasa de Falla'!C116","v":99},{"$f":"'[1]Tasa de Falla'!D116","v":"LA BANDA ESTE - LA BANDA"},{"$f":"'[1]Tasa de Falla'!E116","v":132},{"$f":"'[1]Tasa de Falla'!F116","v":16.2},{"$f":"IF('[1]Tasa de Falla'!IR116=0,\"\",'[1]Tasa de Falla'!IR116)","v":""},{"$f":"IF('[1]Tasa de Falla'!IS116=0,\"\",'[1]Tasa de Falla'!IS116)","v":""},{"$f":"IF('[1]Tasa de Falla'!IT116=0,\"\",'[1]Tasa de Falla'!IT116)","v":""},{"$f":"IF('[1]Tasa de Falla'!IU116=0,\"\",'[1]Tasa de Falla'!IU116)","v":""},{"$f":"IF('[1]Tasa de Falla'!IV116=0,\"\",'[1]Tasa de Falla'!IV116)","v":""},{"$f":"IF('[1]Tasa de Falla'!IW116=0,\"\",'[1]Tasa de Falla'!IW116)","v":""},{"$f":"IF('[1]Tasa de Falla'!IX116=0,\"\",'[1]Tasa de Falla'!IX116)","v":""},{"$f":"IF('[1]Tasa de Falla'!IY116=0,\"\",'[1]Tasa de Falla'!IY116)","v":""},{"$f":"IF('[1]Tasa de Falla'!IZ116=0,\"\",'[1]Tasa de Falla'!IZ116)","v":""},{"$f":"IF('[1]Tasa de Falla'!JA116=0,\"\",'[1]Tasa de Falla'!JA116)","v":""},{"$f":"IF('[1]Tasa de Falla'!JB116=0,\"\",'[1]Tasa de Falla'!JB116)","v":""},{"$f":"IF('[1]Tasa de Falla'!JC116=0,\"\",'[1]Tasa de Falla'!JC116)","v":""}]
[null,null,{"$f":"'[1]Tasa de Falla'!C117","v":100},{"$f":"'[1]Tasa de Falla'!D117","v":"TABACAL - PICHANAL"},{"$f":"'[1]Tasa de Falla'!E117","v":132},{"$f":"'[1]Tasa de Falla'!F117","v":9.0399999999999991},{"$f":"IF('[1]Tasa de Falla'!IR117=0,\"\",'[1]Tasa de Falla'!IR117)","v":""},{"$f":"IF('[1]Tasa de Falla'!IS117=0,\"\",'[1]Tasa de Falla'!IS117)","v":""},{"$f":"IF('[1]Tasa de Falla'!IT117=0,\"\",'[1]Tasa de Falla'!IT117)","v":""},{"$f":"IF('[1]Tasa de Falla'!IU117=0,\"\",'[1]Tasa de Falla'!IU117)","v":""},{"$f":"IF('[1]Tasa de Falla'!IV117=0,\"\",'[1]Tasa de Falla'!IV117)","v":""},{"$f":"IF('[1]Tasa de Falla'!IW117=0,\"\",'[1]Tasa de Falla'!IW117)","v":""},{"$f":"IF('[1]Tasa de Falla'!IX117=0,\"\",'[1]Tasa de Falla'!IX117)","v":""},{"$f":"IF('[1]Tasa de Falla'!IY117=0,\"\",'[1]Tasa de Falla'!IY117)","v":""},{"$f":"IF('[1]Tasa de Falla'!IZ117=0,\"\",'[1]Tasa de Falla'!IZ117)","v":""},{"$f":"IF('[1]Tasa de Falla'!JA117=0,\"\",'[1]Tasa de Falla'!JA117)","v":""},{"$f":"IF('[1]Tasa de Falla'!JB117=0,\"\",'[1]Tasa de Falla'!JB117)","v":""},{"$f":"IF('[1]Tasa de Falla'!JC117=0,\"\",'[1]Tasa de Falla'!JC117)","v":""}]
[null,null,{"$f":"'[1]Tasa de Falla'!C118","v":101},{"$f":"'[1]Tasa de Falla'!D118","v":"ORAN - TABACAL"},{"$f":"'[1]Tasa de Falla'!E118","v":132},{"$f":"'[1]Tasa de Falla'!F118","v":10},{"$f":"IF('[1]Tasa de Falla'!IR118=0,\"\",'[1]Tasa de Falla'!IR118)","v":""},{"$f":"IF('[1]Tasa de Falla'!IS118=0,\"\",'[1]Tasa de Falla'!IS118)","v":""},{"$f":"IF('[1]Tasa de Falla'!IT118=0,\"\",'[1]Tasa de Falla'!IT118)","v":""},{"$f":"IF('[1]Tasa de Falla'!IU118=0,\"\",'[1]Tasa de Falla'!IU118)","v":""},{"$f":"IF('[1]Tasa de Falla'!IV118=0,\"\",'[1]Tasa de Falla'!IV118)","v":""},{"$f":"IF('[1]Tasa de Falla'!IW118=0,\"\",'[1]Tasa de Falla'!IW118)","v":""},{"$f":"IF('[1]Tasa de Falla'!IX118=0,\"\",'[1]Tasa de Falla'!IX118)","v":""},{"$f":"IF('[1]Tasa de Falla'!IY118=0,\"\",'[1]Tasa de Falla'!IY118)","v":1},{"$f":"IF('[1]Tasa de Falla'!IZ118=0,\"\",'[1]Tasa de Falla'!IZ118)","v":""},{"$f":"IF('[1]Tasa de Falla'!JA118=0,\"\",'[1]Tasa de Falla'!JA118)","v":""},{"$f":"IF('[1]Tasa de Falla'!JB118=0,\"\",'[1]Tasa de Falla'!JB118)","v":""},{"$f":"IF('[1]Tasa de Falla'!JC118=0,\"\",'[1]Tasa de Falla'!JC118)","v":""}]
[null,null,{"$f":"'[1]Tasa de Falla'!C119","v":102},{"$f":"'[1]Tasa de Falla'!D119","v":"MONTE QUEMADO -COPO - QUIMILI"},{"$f":"'[1]Tasa de Falla'!E119","v":132},{"$f":"'[1]Tasa de Falla'!F119","v":218},{"$f":"IF('[1]Tasa de Falla'!IR119=0,\"\",'[1]Tasa de Falla'!IR119)","v":""},{"$f":"IF('[1]Tasa de Falla'!IS119=0,\"\",'[1]Tasa de Falla'!IS119)","v":""},{"$f":"IF('[1]Tasa de Falla'!IT119=0,\"\",'[1]Tasa de Falla'!IT119)","v":1},{"$f":"IF('[1]Tasa de Falla'!IU119=0,\"\",'[1]Tasa de Falla'!IU119)","v":""},{"$f":"IF('[1]Tasa de Falla'!IV119=0,\"\",'[1]Tasa de Falla'!IV119)","v":""},{"$f":"IF('[1]Tasa de Falla'!IW119=0,\"\",'[1]Tasa de Falla'!IW119)","v":""},{"$f":"IF('[1]Tasa de Falla'!IX119=0,\"\",'[1]Tasa de Falla'!IX119)","v":""},{"$f":"IF('[1]Tasa de Falla'!IY119=0,\"\",'[1]Tasa de Falla'!IY119)","v":""},{"$f":"IF('[1]Tasa de Falla'!IZ119=0,\"\",'[1]Tasa de Falla'!IZ119)","v":""},{"$f":"IF('[1]Tasa de Falla'!JA119=0,\"\",'[1]Tasa de Falla'!JA119)","v":""},{"$f":"IF('[1]Tasa de Falla'!JB119=0,\"\",'[1]Tasa de Falla'!JB119)","v":""},{"$f":"IF('[1]Tasa de Falla'!JC119=0,\"\",'[1]Tasa de Falla'!JC119)","v":""}]
[null,null,{"$f":"'[1]Tasa de Falla'!C120","v":103},{"$f":"'[1]Tasa de Falla'!D120","v":"PI. CIRCUNVALACIÓN - LARIOJA N. 1"},{"$f":"'[1]Tasa de Falla'!E120","v":132},{"$f":"'[1]Tasa de Falla'!F120","v":16.649999999999999},{"$f":"IF('[1]Tasa de Falla'!IR120=0,\"\",'[1]Tasa de Falla'!IR120)","v":""},{"$f":"IF('[1]Tasa de Falla'!IS120=0,\"\",'[1]Tasa de Falla'!IS120)","v":1},{"$f":"IF('[1]Tasa de Falla'!IT120=0,\"\",'[1]Tasa de Falla'!IT120)","v":""},{"$f":"IF('[1]Tasa de Falla'!IU120=0,\"\",'[1]Tasa de Falla'!IU120)","v":""},{"$f":"IF('[1]Tasa de Falla'!IV120=0,\"\",'[1]Tasa de Falla'!IV120)","v":""},{"$f":"IF('[1]Tasa de Falla'!IW120=0,\"\",'[1]Tasa de Falla'!IW120)","v":""},{"$f":"IF('[1]Tasa de Falla'!IX120=0,\"\",'[1]Tasa de Falla'!IX120)","v":""},{"$f":"IF('[1]Tasa de Falla'!IY120=0,\"\",'[1]Tasa de Falla'!IY120)","v":""},{"$f":"IF('[1]Tasa de Falla'!IZ120=0,\"\",'[1]Tasa de Falla'!IZ120)","v":""},{"$f":"IF('[1]Tasa de Falla'!JA120=0,\"\",'[1]Tasa de Falla'!JA120)","v":""},{"$f":"IF('[1]Tasa de Falla'!JB120=0,\"\",'[1]Tasa de Falla'!JB120)","v":""},{"$f":"IF('[1]Tasa de Falla'!JC120=0,\"\",'[1]Tasa de Falla'!JC120)","v":""}]
[null,null,{"$f":"'[1]Tasa de Falla'!C121","v":104},{"$f":"'[1]Tasa de Falla'!D121","v":"PATQUIA NONOGASTA 132 1"},{"$f":"'[1]Tasa de Falla'!E121","v":132},{"$f":"'[1]Tasa de Falla'!F121","v":108.3},{"$f":"IF('[1]Tasa de Falla'!IR121=0,\"\",'[1]Tasa de Falla'!IR121)","v":""},{"$f":"IF('[1]Tasa de Falla'!IS121=0,\"\",'[1]Tasa de Falla'!IS121)","v":""},{"$f":"IF('[1]Tasa de Falla'!IT121=0,\"\",'[1]Tasa de Falla'!IT121)","v":""},{"$f":"IF('[1]Tasa de Falla'!IU121=0,\"\",'[1]Tasa de Falla'!IU121)","v":""},{"$f":"IF('[1]Tasa de Falla'!IV121=0,\"\",'[1]Tasa de Falla'!IV121)","v":""},{"$f":"IF('[1]Tasa de Falla'!IW121=0,\"\",'[1]Tasa de Falla'!IW121)","v":""},{"$f":"IF('[1]Tasa de Falla'!IX121=0,\"\",'[1]Tasa de Falla'!IX121)","v":""},{"$f":"IF('[1]Tasa de Falla'!IY121=0,\"\",'[1]Tasa de Falla'!IY121)","v":""},{"$f":"IF('[1]Tasa de Falla'!IZ121=0,\"\",'[1]Tasa de Falla'!IZ121)","v":""},{"$f":"IF('[1]Tasa de Falla'!JA121=0,\"\",'[1]Tasa de Falla'!JA121)","v":""},{"$f":"IF('[1]Tasa de Falla'!JB121=0,\"\",'[1]Tasa de Falla'!JB121)","v":""},{"$f":"IF('[1]Tasa de Falla'!JC121=0,\"\",'[1]Tasa de Falla'!JC121)","v":""}]
[null,null,{"$f":"'[1]Tasa de Falla'!C122","v":105},{"$f":"'[1]Tasa de Falla'!D122","v":"NONOGASTA - VILLA UNION 132 1"},{"$f":"'[1]Tasa de Falla'!E122","v":132},{"$f":"'[1]Tasa de Falla'!F122","v":82.1},{"$f":"IF('[1]Tasa de Falla'!IR122=0,\"\",'[1]Tasa de Falla'!IR122)","v":""},{"$f":"IF('[1]Tasa de Falla'!IS122=0,\"\",'[1]Tasa de Falla'!IS122)","v":""},{"$f":"IF('[1]Tasa de Falla'!IT122=0,\"\",'[1]Tasa de Falla'!IT122)","v":""},{"$f":"IF('[1]Tasa de Falla'!IU122=0,\"\",'[1]Tasa de Falla'!IU122)","v":""},{"$f":"IF('[1]Tasa de Falla'!IV122=0,\"\",'[1]Tasa de Falla'!IV122)","v":""},{"$f":"IF('[1]Tasa de Falla'!IW122=0,\"\",'[1]Tasa de Falla'!IW122)","v":""},{"$f":"IF('[1]Tasa de Falla'!IX122=0,\"\",'[1]Tasa de Falla'!IX122)","v":""},{"$f":"IF('[1]Tasa de Falla'!IY122=0,\"\",'[1]Tasa de Falla'!IY122)","v":""},{"$f":"IF('[1]Tasa de Falla'!IZ122=0,\"\",'[1]Tasa de Falla'!IZ122)","v":""},{"$f":"IF('[1]Tasa de Falla'!JA122=0,\"\",'[1]Tasa de Falla'!JA122)","v":""},{"$f":"IF('[1]Tasa de Falla'!JB122=0,\"\",'[1]Tasa de Falla'!JB122)","v":""},{"$f":"IF('[1]Tasa de Falla'!JC122=0,\"\",'[1]Tasa de Falla'!JC122)","v":""}]
[null,null,{"$f":"'[1]Tasa de Falla'!C123","v":106},{"$f":"'[1]Tasa de Falla'!D123","v":"ARAUCO - AIMOGASTA 132 1"},{"$f":"'[1]Tasa de Falla'!E123","v":132},{"$f":"'[1]Tasa de Falla'!F123","v":20},{"$f":"IF('[1]Tasa de Falla'!IR123=0,\"\",'[1]Tasa de Falla'!IR123)","v":""},{"$f":"IF('[1]Tasa de Falla'!IS123=0,\"\",'[1]Tasa de Falla'!IS123)","v":""},{"$f":"IF('[1]Tasa de Falla'!IT123=0,\"\",'[1]Tasa de Falla'!IT123)","v":""},{"$f":"IF('[1]Tasa de Falla'!IU123=0,\"\",'[1]Tasa de Falla'!IU123)","v":""},{"$f":"IF('[1]Tasa de Falla'!IV123=0,\"\",'[1]Tasa de Falla'!IV123)","v":""},{"$f":"IF('[1]Tasa de Falla'!IW123=0,\"\",'[1]Tasa de Falla'!IW123)","v":""},{"$f":"IF('[1]Tasa de Falla'!IX123=0,\"\",'[1]Tasa de Falla'!IX123)","v":""},{"$f":"IF('[1]Tasa de Falla'!IY123=0,\"\",'[1]Tasa de Falla'!IY123)","v":""},{"$f":"IF('[1]Tasa de Falla'!IZ123=0,\"\",'[1]Tasa de Falla'!IZ123)","v":""},{"$f":"IF('[1]Tasa de Falla'!JA123=0,\"\",'[1]Tasa de Falla'!JA123)","v":""},{"$f":"IF('[1]Tasa de Falla'!JB123=0,\"\",'[1]Tasa de Falla'!JB123)","v":""},{"$f":"IF('[1]Tasa de Falla'!JC123=0,\"\",'[1]Tasa de Falla'!JC123)","v":""}]
[null,null,{"$f":"'[1]Tasa de Falla'!C124","v":107},{"$f":"'[1]Tasa de Falla'!D124","v":"PATQUIA - CHAMICAL 132 1"},{"$f":"'[1]Tasa de Falla'!E124","v":132},{"$f":"'[1]Tasa de Falla'!F124","v":67.400000000000006},{"$f":"IF('[1]Tasa de Falla'!IR124=0,\"\",'[1]Tasa de Falla'!IR124)","v":""},{"$f":"IF('[1]Tasa de Falla'!IS124=0,\"\",'[1]Tasa de Falla'!IS124)","v":""},{"$f":"IF('[1]Tasa de Falla'!IT124=0,\"\",'[1]Tasa de Falla'!IT124)","v":""},{"$f":"IF('[1]Tasa de Falla'!IU124=0,\"\",'[1]Tasa de Falla'!IU124)","v":""},{"$f":"IF('[1]Tasa de Falla'!IV124=0,\"\",'[1]Tasa de Falla'!IV124)","v":""},{"$f":"IF('[1]Tasa de Falla'!IW124=0,\"\",'[1]Tasa de Falla'!IW124)","v":""},{"$f":"IF('[1]Tasa de Falla'!IX124=0,\"\",'[1]Tasa de Falla'!IX124)","v":""},{"$f":"IF('[1]Tasa de Falla'!IY124=0,\"\",'[1]Tasa de Falla'!IY124)","v":""},{"$f":"IF('[1]Tasa de Falla'!IZ124=0,\"\",'[1]Tasa de Falla'!IZ124)","v":""},{"$f":"IF('[1]Tasa de Falla'!JA124=0,\"\",'[1]Tasa de Falla'!JA124)","v":""},{"$f":"IF('[1]Tasa de Falla'!JB124=0,\"\",'[1]Tasa de Falla'!JB124)","v":""},{"$f":"IF('[1]Tasa de Falla'!JC124=0,\"\",'[1]Tasa de Falla'!JC124)","v":""}]
[null,null,{"$f":"'[1]Tasa de Falla'!C125","v":108},{"$f":"'[1]Tasa de Falla'!D125","v":"LA RIOJA - ARAUCO 132 1"},{"$f":"'[1]Tasa de Falla'!E125","v":132},{"$f":"'[1]Tasa de Falla'!F125","v":84.3},{"$f":"IF('[1]Tasa de Falla'!IR125=0,\"\",'[1]Tasa de Falla'!IR125)","v":""},{"$f":"IF('[1]Tasa de Falla'!IS125=0,\"\",'[1]Tasa de Falla'!IS125)","v":""},{"$f":"IF('[1]Tasa de Falla'!IT125=0,\"\",'[1]Tasa de Falla'!IT125)","v":""},{"$f":"IF('[1]Tasa de Falla'!IU125=0,\"\",'[1]Tasa de Falla'!IU125)","v":""},{"$f":"IF('[1]Tasa de Falla'!IV125=0,\"\",'[1]Tasa de Falla'!IV125)","v":""},{"$f":"IF('[1]Tasa de Falla'!IW125=0,\"\",'[1]Tasa de Falla'!IW125)","v":1},{"$f":"IF('[1]Tasa de Falla'!IX125=0,\"\",'[1]Tasa de Falla'!IX125)","v":""},{"$f":"IF('[1]Tasa de Falla'!IY125=0,\"\",'[1]Tasa de Falla'!IY125)","v":""},{"$f":"IF('[1]Tasa de Falla'!IZ125=0,\"\",'[1]Tasa de Falla'!IZ125)","v":""},{"$f":"IF('[1]Tasa de Falla'!JA125=0,\"\",'[1]Tasa de Falla'!JA125)","v":""},{"$f":"IF('[1]Tasa de Falla'!JB125=0,\"\",'[1]Tasa de Falla'!JB125)","v":""},{"$f":"IF('[1]Tasa de Falla'!JC125=0,\"\",'[1]Tasa de Falla'!JC125)","v":""}]
[null,null,{"$f":"'[1]Tasa de Falla'!C126","v":109},{"$f":"'[1]Tasa de Falla'!D126","v":"PI PATQUIA - PATQUIA 132 1"},{"$f":"'[1]Tasa de Falla'!E126","v":132},{"$f":"'[1]Tasa de Falla'!F126","v":58.65},{"$f":"IF('[1]Tasa de Falla'!IR126=0,\"\",'[1]Tasa de Falla'!IR126)","v":""},{"$f":"IF('[1]Tasa de Falla'!IS126=0,\"\",'[1]Tasa de Falla'!IS126)","v":""},{"$f":"IF('[1]Tasa de Falla'!IT126=0,\"\",'[1]Tasa de Falla'!IT126)","v":""},{"$f":"IF('[1]Tasa de Falla'!IU126=0,\"\",'[1]Tasa de Falla'!IU126)","v":""},{"$f":"IF('[1]Tasa de Falla'!IV126=0,\"\",'[1]Tasa de Falla'!IV126)","v":""},{"$f":"IF('[1]Tasa de Falla'!IW126=0,\"\",'[1]Tasa de Falla'!IW126)","v":""},{"$f":"IF('[1]Tasa de Falla'!IX126=0,\"\",'[1]Tasa de Falla'!IX126)","v":""},{"$f":"IF('[1]Tasa de Falla'!IY126=0,\"\",'[1]Tasa de Falla'!IY126)","v":""},{"$f":"IF('[1]Tasa de Falla'!IZ126=0,\"\",'[1]Tasa de Falla'!IZ126)","v":""},{"$f":"IF('[1]Tasa de Falla'!JA126=0,\"\",'[1]Tasa de Falla'!JA126)","v":""},{"$f":"IF('[1]Tasa de Falla'!JB126=0,\"\",'[1]Tasa de Falla'!JB126)","v":""},{"$f":"IF('[1]Tasa de Falla'!JC126=0,\"\",'[1]Tasa de Falla'!JC126)","v":""}]
[null,null,{"$f":"'[1]Tasa de Falla'!C127","v":110},{"$f":"'[1]Tasa de Falla'!D127","v":"RIO HONDO - TERMAS NORTE"},{"$f":"'[1]Tasa de Falla'!E127","v":132},{"$f":"'[1]Tasa de Falla'!F127","v":5.8},{"$f":"IF('[1]Tasa de Falla'!IR127=0,\"\",'[1]Tasa de Falla'!IR127)","v":"XXXX"},{"$f":"IF('[1]Tasa de Falla'!IS127=0,\"\",'[1]Tasa de Falla'!IS127)","v":""},{"$f":"IF('[1]Tasa de Falla'!IT127=0,\"\",'[1]Tasa de Falla'!IT127)","v":""},{"$f":"IF('[1]Tasa de Falla'!IU127=0,\"\",'[1]Tasa de Falla'!IU127)","v":""},{"$f":"IF('[1]Tasa de Falla'!IV127=0,\"\",'[1]Tasa de Falla'!IV127)","v":""},{"$f":"IF('[1]Tasa de Falla'!IW127=0,\"\",'[1]Tasa de Falla'!IW127)","v":""},{"$f":"IF('[1]Tasa de Falla'!IX127=0,\"\",'[1]Tasa de Falla'!IX127)","v":""},{"$f":"IF('[1]Tasa de Falla'!IY127=0,\"\",'[1]Tasa de Falla'!IY127)","v":""},{"$f":"IF('[1]Tasa de Falla'!IZ127=0,\"\",'[1]Tasa de Falla'!IZ127)","v":""},{"$f":"IF('[1]Tasa de Falla'!JA127=0,\"\",'[1]Tasa de Falla'!JA127)","v":""},{"$f":"IF('[1]Tasa de Falla'!JB127=0,\"\",'[1]Tasa de Falla'!JB127)","v":""},{"$f":"IF('[1]Tasa de Falla'!JC127=0,\"\",'[1]Tasa de Falla'!JC127)","v":""}]
[null,null,{"$f":"'[1]Tasa de Falla'!C128","v":111},{"$f":"'[1]Tasa de Falla'!D128","v":"EL BRACHO - TETRMAS NORTE"},{"$f":"'[1]Tasa de Falla'!E128","v":132},{"$f":"'[1]Tasa de Falla'!F128","v":78.400000000000006},{"$f":"IF('[1]Tasa de Falla'!IR128=0,\"\",'[1]Tasa de Falla'!IR128)","v":"XXXX"},{"$f":"IF('[1]Tasa de Falla'!IS128=0,\"\",'[1]Tasa de Falla'!IS128)","v":""},{"$f":"IF('[1]Tasa de Falla'!IT128=0,\"\",'[1]Tasa de Falla'!IT128)","v":""},{"$f":"IF('[1]Tasa de Falla'!IU128=0,\"\",'[1]Tasa de Falla'!IU128)","v":""},{"$f":"IF('[1]Tasa de Falla'!IV128=0,\"\",'[1]Tasa de Falla'!IV128)","v":""},{"$f":"IF('[1]Tasa de Falla'!IW128=0,\"\",'[1]Tasa de Falla'!IW128)","v":""},{"$f":"IF('[1]Tasa de Falla'!IX128=0,\"\",'[1]Tasa de Falla'!IX128)","v":""},{"$f":"IF('[1]Tasa de Falla'!IY128=0,\"\",'[1]Tasa de Falla'!IY128)","v":""},{"$f":"IF('[1]Tasa de Falla'!IZ128=0,\"\",'[1]Tasa de Falla'!IZ128)","v":1},{"$f":"IF('[1]Tasa de Falla'!JA128=0,\"\",'[1]Tasa de Falla'!JA128)","v":1},{"$f":"IF('[1]Tasa de Falla'!JB128=0,\"\",'[1]Tasa de Falla'!JB128)","v":""},{"$f":"IF('[1]Tasa de Falla'!JC128=0,\"\",'[1]Tasa de Falla'!JC128)","v":""}]
[null,null,{"$f":"'[1]Tasa de Falla'!C129","v":112},{"$f":"'[1]Tasa de Falla'!D129","v":"PI 150 NORTE - LA RIOJA ESTE"},{"$f":"'[1]Tasa de Falla'!E129","v":132},{"$f":"'[1]Tasa de Falla'!F129","v":4},{"$f":"IF('[1]Tasa de Falla'!IR129=0,\"\",'[1]Tasa de Falla'!IR129)","v":"XXXX"},{"$f":"IF('[1]Tasa de Falla'!IS129=0,\"\",'[1]Tasa de Falla'!IS129)","v":""},{"$f":"IF('[1]Tasa de Falla'!IT129=0,\"\",'[1]Tasa de Falla'!IT129)","v":""},{"$f":"IF('[1]Tasa de Falla'!IU129=0,\"\",'[1]Tasa de Falla'!IU129)","v":""},{"$f":"IF('[1]Tasa de Falla'!IV129=0,\"\",'[1]Tasa de Falla'!IV129)","v":""},{"$f":"IF('[1]Tasa de Falla'!IW129=0,\"\",'[1]Tasa de Falla'!IW129)","v":""},{"$f":"IF('[1]Tasa de Falla'!IX129=0,\"\",'[1]Tasa de Falla'!IX129)","v":""},{"$f":"IF('[1]Tasa de Falla'!IY129=0,\"\",'[1]Tasa de Falla'!IY129)","v":""},{"$f":"IF('[1]Tasa de Falla'!IZ129=0,\"\",'[1]Tasa de Falla'!IZ129)","v":""},{"$f":"IF('[1]Tasa de Falla'!JA129=0,\"\",'[1]Tasa de Falla'!JA129)","v":""},{"$f":"IF('[1]Tasa de Falla'!JB129=0,\"\",'[1]Tasa de Falla'!JB129)","v":""},{"$f":"IF('[1]Tasa de Falla'!JC129=0,\"\",'[1]Tasa de Falla'!JC129)","v":""}]
[null,null,{"$f":"'[1]Tasa de Falla'!C130","v":113},{"$f":"'[1]Tasa de Falla'!D130","v":"PI 150 SUR - LA RIOJA ESTE"},{"$f":"'[1]Tasa de Falla'!E130","v":132},{"$f":"'[1]Tasa de Falla'!F130","v":4},{"$f":"IF('[1]Tasa de Falla'!IR130=0,\"\",'[1]Tasa de Falla'!IR130)","v":"XXXX"},{"$f":"IF('[1]Tasa de Falla'!IS130=0,\"\",'[1]Tasa de Falla'!IS130)","v":""},{"$f":"IF('[1]Tasa de Falla'!IT130=0,\"\",'[1]Tasa de Falla'!IT130)","v":""},{"$f":"IF('[1]Tasa de Falla'!IU130=0,\"\",'[1]Tasa de Falla'!IU130)","v":""},{"$f":"IF('[1]Tasa de Falla'!IV130=0,\"\",'[1]Tasa de Falla'!IV130)","v":""},{"$f":"IF('[1]Tasa de Falla'!IW130=0,\"\",'[1]Tasa de Falla'!IW130)","v":""},{"$f":"IF('[1]Tasa de Falla'!IX130=0,\"\",'[1]Tasa de Falla'!IX130)","v":""},{"$f":"IF('[1]Tasa de Falla'!IY130=0,\"\",'[1]Tasa de Falla'!IY130)","v":""},{"$f":"IF('[1]Tasa de Falla'!IZ130=0,\"\",'[1]Tasa de Falla'!IZ130)","v":""},{"$f":"IF('[1]Tasa de Falla'!JA130=0,\"\",'[1]Tasa de Falla'!JA130)","v":""},{"$f":"IF('[1]Tasa de Falla'!JB130=0,\"\",'[1]Tasa de Falla'!JB130)","v":""},{"$f":"IF('[1]Tasa de Falla'!JC130=0,\"\",'[1]Tasa de Falla'!JC130)","v":""}]
[null,null,{"$f":"'[1]Tasa de Falla'!C131","v":114},{"$f":"'[1]Tasa de Falla'!D131","v":"QUIMILI - CAMPO GALLO 132 1"},{"$f":"'[1]Tasa de Falla'!E131","v":132},{"$f":"'[1]Tasa de Falla'!F131","v":140},{"$f":"IF('[1]Tasa de Falla'!IR131=0,\"\",'[1]Tasa de Falla'!IR131)","v":"XXXX"},{"$f":"IF('[1]Tasa de Falla'!IS131=0,\"\",'[1]Tasa de Falla'!IS131)","v":"XXXX"},{"$f":"IF('[1]Tasa de Falla'!IT131=0,\"\",'[1]Tasa de Falla'!IT131)","v":""},{"$f":"IF('[1]Tasa de Falla'!IU131=0,\"\",'[1]Tasa de Falla'!IU131)","v":""},{"$f":"IF('[1]Tasa de Falla'!IV131=0,\"\",'[1]Tasa de Falla'!IV131)","v":""},{"$f":"IF('[1]Tasa de Falla'!IW131=0,\"\",'[1]Tasa de Falla'!IW131)","v":""},{"$f":"IF('[1]Tasa de Falla'!IX131=0,\"\",'[1]Tasa de Falla'!IX131)","v":""},{"$f":"IF('[1]Tasa de Falla'!IY131=0,\"\",'[1]Tasa de Falla'!IY131)","v":""},{"$f":"IF('[1]Tasa de Falla'!IZ131=0,\"\",'[1]Tasa de Falla'!IZ131)","v":""},{"$f":"IF('[1]Tasa de Falla'!JA131=0,\"\",'[1]Tasa de Falla'!JA131)","v":""},{"$f":"IF('[1]Tasa de Falla'!JB131=0,\"\",'[1]Tasa de Falla'!JB131)","v":""},{"$f":"IF('[1]Tasa de Falla'!JC131=0,\"\",'[1]Tasa de Falla'!JC131)","v":""}]
[null,null,{"$f":"'[1]Tasa de Falla'!C132","v":115},{"$f":"'[1]Tasa de Falla'!D132","v":"CAMPO GALLO - COPO 132 1"},{"$f":"'[1]Tasa de Falla'!E132","v":132},{"$f":"'[1]Tasa de Falla'!F132","v":90},{"$f":"IF('[1]Tasa de Falla'!IR132=0,\"\",'[1]Tasa de Falla'!IR132)","v":"XXXX"},{"$f":"IF('[1]Tasa de Falla'!IS132=0,\"\",'[1]Tasa de Falla'!IS132)","v":"XXXX"},{"$f":"IF('[1]Tasa de Falla'!IT132=0,\"\",'[1]Tasa de Falla'!IT132)","v":""},{"$f":"IF('[1]Tasa de Falla'!IU132=0,\"\",'[1]Tasa de Falla'!IU132)","v":""},{"$f":"IF('[1]Tasa de Falla'!IV132=0,\"\",'[1]Tasa de Falla'!IV132)","v":""},{"$f":"IF('[1]Tasa de Falla'!IW132=0,\"\",'[1]Tasa de Falla'!IW132)","v":""},{"$f":"IF('[1]Tasa de Falla'!IX132=0,\"\",'[1]Tasa de Falla'!IX132)","v":""},{"$f":"IF('[1]Tasa de Falla'!IY132=0,\"\",'[1]Tasa de Falla'!IY132)","v":""},{"$f":"IF('[1]Tasa de Falla'!IZ132=0,\"\",'[1]Tasa de Falla'!IZ132)","v":""},{"$f":"IF('[1]Tasa de Falla'!JA132=0,\"\",'[1]Tasa de Falla'!JA132)","v":""},{"$f":"IF('[1]Tasa de Falla'!JB132=0,\"\",'[1]Tasa de Falla'!JB132)","v":""},{"$f":"IF('[1]Tasa de Falla'!JC132=0,\"\",'[1]Tasa de Falla'!JC132)","v":""}]
[null,null,{"$f":"'[1]Tasa de Falla'!C133","v":116},{"$f":"'[1]Tasa de Falla'!D133","v":"PICHANAL - SENDA HACHADA 132 1"},{"$f":"'[1]Tasa de Falla'!E133","v":132},{"$f":"'[1]Tasa de Falla'!F133","v":46.5},{"$f":"IF('[1]Tasa de Falla'!IR133=0,\"\",'[1]Tasa de Falla'!IR133)","v":"XXXX"},{"$f":"IF('[1]Tasa de Falla'!IS133=0,\"\",'[1]Tasa de Falla'!IS133)","v":"XXXX"},{"$f":"IF('[1]Tasa de Falla'!IT133=0,\"\",'[1]Tasa de Falla'!IT133)","v":"XXXX"},{"$f":"IF('[1]Tasa de Falla'!IU133=0,\"\",'[1]Tasa de Falla'!IU133)","v":"XXXX"},{"$f":"IF('[1]Tasa de Falla'!IV133=0,\"\",'[1]Tasa de Falla'!IV133)","v":""},{"$f":"IF('[1]Tasa de Falla'!IW133=0,\"\",'[1]Tasa de Falla'!IW133)","v":""},{"$f":"IF('[1]Tasa de Falla'!IX133=0,\"\",'[1]Tasa de Falla'!IX133)","v":""},{"$f":"IF('[1]Tasa de Falla'!IY133=0,\"\",'[1]Tasa de Falla'!IY133)","v":""},{"$f":"IF('[1]Tasa de Falla'!IZ133=0,\"\",'[1]Tasa de Falla'!IZ133)","v":""},{"$f":"IF('[1]Tasa de Falla'!JA133=0,\"\",'[1]Tasa de Falla'!JA133)","v":""},{"$f":"IF('[1]Tasa de Falla'!JB133=0,\"\",'[1]Tasa de Falla'!JB133)","v":""},{"$f":"IF('[1]Tasa de Falla'!JC133=0,\"\",'[1]Tasa de Falla'!JC133)","v":""}]
[null,null,{"$f":"'[1]Tasa de Falla'!C134","v":117},{"$f":"'[1]Tasa de Falla'!D134","v":"SENDA HACHADA - TARTAGAL 132 1"},{"$f":"'[1]Tasa de Falla'!E134","v":132},{"$f":"'[1]Tasa de Falla'!F134","v":58.5},{"$f":"IF('[1]Tasa de Falla'!IR134=0,\"\",'[1]Tasa de Falla'!IR134)","v":"XXXX"},{"$f":"IF('[1]Tasa de Falla'!IS134=0,\"\",'[1]Tasa de Falla'!IS134)","v":"XXXX"},{"$f":"IF('[1]Tasa de Falla'!IT134=0,\"\",'[1]Tasa de Falla'!IT134)","v":"XXXX"},{"$f":"IF('[1]Tasa de Falla'!IU134=0,\"\",'[1]Tasa de Falla'!IU134)","v":"XXXX"},{"$f":"IF('[1]Tasa de Falla'!IV134=0,\"\",'[1]Tasa de Falla'!IV134)","v":""},{"$f":"IF('[1]Tasa de Falla'!IW134=0,\"\",'[1]Tasa de Falla'!IW134)","v":""},{"$f":"IF('[1]Tasa de Falla'!IX134=0,\"\",'[1]Tasa de Falla'!IX134)","v":""},{"$f":"IF('[1]Tasa de Falla'!IY134=0,\"\",'[1]Tasa de Falla'!IY134)","v":""},{"$f":"IF('[1]Tasa de Falla'!IZ134=0,\"\",'[1]Tasa de Falla'!IZ134)","v":""},{"$f":"IF('[1]Tasa de Falla'!JA134=0,\"\",'[1]Tasa de Falla'!JA134)","v":""},{"$f":"IF('[1]Tasa de Falla'!JB134=0,\"\",'[1]Tasa de Falla'!JB134)","v":""},{"$f":"IF('[1]Tasa de Falla'!JC134=0,\"\",'[1]Tasa de Falla'!JC134)","v":""}]
[null,null,{"$f":"'[1]Tasa de Falla'!C135","v":118},{"$f":"'[1]Tasa de Falla'!D135","v":"ESTATICA - INDEPENDENCIA.TUC. 132 2"},{"$f":"'[1]Tasa de Falla'!E135","v":132},{"$f":"'[1]Tasa de Falla'!F135","v":3.1},{"$f":"IF('[1]Tasa de Falla'!IR135=0,\"\",'[1]Tasa de Falla'!IR135)","v":"XXXX"},{"$f":"IF('[1]Tasa de Falla'!IS135=0,\"\",'[1]Tasa de Falla'!IS135)","v":"XXXX"},{"$f":"IF('[1]Tasa de Falla'!IT135=0,\"\",'[1]Tasa de Falla'!IT135)","v":"XXXX"},{"$f":"IF('[1]Tasa de Falla'!IU135=0,\"\",'[1]Tasa de Falla'!IU135)","v":"XXXX"},{"$f":"IF('[1]Tasa de Falla'!IV135=0,\"\",'[1]Tasa de Falla'!IV135)","v":"XXXX"},{"$f":"IF('[1]Tasa de Falla'!IW135=0,\"\",'[1]Tasa de Falla'!IW135)","v":"XXXX"},{"$f":"IF('[1]Tasa de Falla'!IX135=0,\"\",'[1]Tasa de Falla'!IX135)","v":""},{"$f":"IF('[1]Tasa de Falla'!IY135=0,\"\",'[1]Tasa de Falla'!IY135)","v":""},{"$f":"IF('[1]Tasa de Falla'!IZ135=0,\"\",'[1]Tasa de Falla'!IZ135)","v":1},{"$f":"IF('[1]Tasa de Falla'!JA135=0,\"\",'[1]Tasa de Falla'!JA135)","v":""},{"$f":"IF('[1]Tasa de Falla'!JB135=0,\"\",'[1]Tasa de Falla'!JB135)","v":""},{"$f":"IF('[1]Tasa de Falla'!JC135=0,\"\",'[1]Tasa de Falla'!JC135)","v":""}]
[null,null,{"$f":"'[1]Tasa de Falla'!C136","v":119},{"$f":"'[1]Tasa de Falla'!D136","v":"SENDA HACHADA - DRAGONES 132 1"},{"$f":"'[1]Tasa de Falla'!E136","v":132},{"$f":"'[1]Tasa de Falla'!F136","v":65},{"$f":"IF('[1]Tasa de Falla'!IR136=0,\"\",'[1]Tasa de Falla'!IR136)","v":"XXXX"},{"$f":"IF('[1]Tasa de Falla'!IS136=0,\"\",'[1]Tasa de Falla'!IS136)","v":"XXXX"},{"$f":"IF('[1]Tasa de Falla'!IT136=0,\"\",'[1]Tasa de Falla'!IT136)","v":"XXXX"},{"$f":"IF('[1]Tasa de Falla'!IU136=0,\"\",'[1]Tasa de Falla'!IU136)","v":"XXXX"},{"$f":"IF('[1]Tasa de Falla'!IV136=0,\"\",'[1]Tasa de Falla'!IV136)","v":"XXXX"},{"$f":"IF('[1]Tasa de Falla'!IW136=0,\"\",'[1]Tasa de Falla'!IW136)","v":"XXXX"},{"$f":"IF('[1]Tasa de Falla'!IX136=0,\"\",'[1]Tasa de Falla'!IX136)","v":"XXXX"},{"$f":"IF('[1]Tasa de Falla'!IY136=0,\"\",'[1]Tasa de Falla'!IY136)","v":"XXXX"},{"$f":"IF('[1]Tasa de Falla'!IZ136=0,\"\",'[1]Tasa de Falla'!IZ136)","v":"XXXX"},{"$f":"IF('[1]Tasa de Falla'!JA136=0,\"\",'[1]Tasa de Falla'!JA136)","v":"XXXX"},{"$f":"IF('[1]Tasa de Falla'!JB136=0,\"\",'[1]Tasa de Falla'!JB136)","v":"XXXX"},{"$f":"IF('[1]Tasa de Falla'!JC136=0,\"\",'[1]Tasa de Falla'!JC136)","v":"XXXX"}]
[null,null,{"$f":"'[1]Tasa de Falla'!C137","v":120},{"$f":"'[1]Tasa de Falla'!D137","v":"COBOS - SALTA ESTE 132 1"},{"$f":"'[1]Tasa de Falla'!E137","v":132},{"$f":"'[1]Tasa de Falla'!F137","v":45.6},{"$f":"IF('[1]Tasa de Falla'!IR137=0,\"\",'[1]Tasa de Falla'!IR137)","v":"XXXX"},{"$f":"IF('[1]Tasa de Falla'!IS137=0,\"\",'[1]Tasa de Falla'!IS137)","v":"XXXX"},{"$f":"IF('[1]Tasa de Falla'!IT137=0,\"\",'[1]Tasa de Falla'!IT137)","v":"XXXX"},{"$f":"IF('[1]Tasa de Falla'!IU137=0,\"\",'[1]Tasa de Falla'!IU137)","v":"XXXX"},{"$f":"IF('[1]Tasa de Falla'!IV137=0,\"\",'[1]Tasa de Falla'!IV137)","v":"XXXX"},{"$f":"IF('[1]Tasa de Falla'!IW137=0,\"\",'[1]Tasa de Falla'!IW137)","v":"XXXX"},{"$f":"IF('[1]Tasa de Falla'!IX137=0,\"\",'[1]Tasa de Falla'!IX137)","v":""},{"$f":"IF('[1]Tasa de Falla'!IY137=0,\"\",'[1]Tasa de Falla'!IY137)","v":1},{"$f":"IF('[1]Tasa de Falla'!IZ137=0,\"\",'[1]Tasa de Falla'!IZ137)","v":""},{"$f":"IF('[1]Tasa de Falla'!JA137=0,\"\",'[1]Tasa de Falla'!JA137)","v":""},{"$f":"IF('[1]Tasa de Falla'!JB137=0,\"\",'[1]Tasa de Falla'!JB137)","v":""},{"$f":"IF('[1]Tasa de Falla'!JC137=0,\"\",'[1]Tasa de Falla'!JC137)","v":""}]
[null,null,{"$f":"'[1]Tasa de Falla'!C138","v":121},{"$f":"'[1]Tasa de Falla'!D138","v":"SANTIAGO - SANTIAGO SUR "},{"$f":"'[1]Tasa de Falla'!E138","v":132},{"$f":"'[1]Tasa de Falla'!F138","v":8.4},{"$f":"IF('[1]Tasa de Falla'!IR138=0,\"\",'[1]Tasa de Falla'!IR138)","v":"XXXX"},{"$f":"IF('[1]Tasa de Falla'!IS138=0,\"\",'[1]Tasa de Falla'!IS138)","v":"XXXX"},{"$f":"IF('[1]Tasa de Falla'!IT138=0,\"\",'[1]Tasa de Falla'!IT138)","v":"XXXX"},{"$f":"IF('[1]Tasa de Falla'!IU138=0,\"\",'[1]Tasa de Falla'!IU138)","v":"XXXX"},{"$f":"IF('[1]Tasa de Falla'!IV138=0,\"\",'[1]Tasa de Falla'!IV138)","v":"XXXX"},{"$f":"IF('[1]Tasa de Falla'!IW138=0,\"\",'[1]Tasa de Falla'!IW138)","v":"XXXX"},{"$f":"IF('[1]Tasa de Falla'!IX138=0,\"\",'[1]Tasa de Falla'!IX138)","v":"XXXX"},{"$f":"IF('[1]Tasa de Falla'!IY138=0,\"\",'[1]Tasa de Falla'!IY138)","v":""},{"$f":"IF('[1]Tasa de Falla'!IZ138=0,\"\",'[1]Tasa de Falla'!IZ138)","v":""},{"$f":"IF('[1]Tasa de Falla'!JA138=0,\"\",'[1]Tasa de Falla'!JA138)","v":""},{"$f":"IF('[1]Tasa de Falla'!JB138=0,\"\",'[1]Tasa de Falla'!JB138)","v":""},{"$f":"IF('[1]Tasa de Falla'!JC138=0,\"\",'[1]Tasa de Falla'!JC138)","v":1}]
[null,null,{"$f":"'[1]Tasa de Falla'!C139","v":122},{"$f":"'[1]Tasa de Falla'!D139","v":"SANTIAGO OESTE - SANTIAGO"},{"$f":"'[1]Tasa de Falla'!E139","v":132},{"$f":"'[1]Tasa de Falla'!F139","v":8.4},{"$f":"IF('[1]Tasa de Falla'!IR139=0,\"\",'[1]Tasa de Falla'!IR139)","v":"XXXX"},{"$f":"IF('[1]Tasa de Falla'!IS139=0,\"\",'[1]Tasa de Falla'!IS139)","v":"XXXX"},{"$f":"IF('[1]Tasa de Falla'!IT139=0,\"\",'[1]Tasa de Falla'!IT139)","v":"XXXX"},{"$f":"IF('[1]Tasa de Falla'!IU139=0,\"\",'[1]Tasa de Falla'!IU139)","v":"XXXX"},{"$f":"IF('[1]Tasa de Falla'!IV139=0,\"\",'[1]Tasa de Falla'!IV139)","v":"XXXX"},{"$f":"IF('[1]Tasa de Falla'!IW139=0,\"\",'[1]Tasa de Falla'!IW139)","v":"XXXX"},{"$f":"IF('[1]Tasa de Falla'!IX139=0,\"\",'[1]Tasa de Falla'!IX139)","v":"XXXX"},{"$f":"IF('[1]Tasa de Falla'!IY139=0,\"\",'[1]Tasa de Falla'!IY139)","v":"XXXX"},{"$f":"IF('[1]Tasa de Falla'!IZ139=0,\"\",'[1]Tasa de Falla'!IZ139)","v":"XXXX"},{"$f":"IF('[1]Tasa de Falla'!JA139=0,\"\",'[1]Tasa de Falla'!JA139)","v":"XXXX"},{"$f":"IF('[1]Tasa de Falla'!JB139=0,\"\",'[1]Tasa de Falla'!JB139)","v":"XXXX"},{"$f":"IF('[1]Tasa de Falla'!JC139=0,\"\",'[1]Tasa de Falla'!JC139)","v":"XXXX"}]
[null,null,{"$f":"'[1]Tasa de Falla'!C140","v":123},{"$f":"'[1]Tasa de Falla'!D140","v":"LA BANDA - MISQUI MAYU II - SANTIAGO ESTE"},{"$f":"'[1]Tasa de Falla'!E140","v":132},{"$f":"'[1]Tasa de Falla'!F140","v":4.92},{"$f":"IF('[1]Tasa de Falla'!IR140=0,\"\",'[1]Tasa de Falla'!IR140)","v":"XXXX"},{"$f":"IF('[1]Tasa de Falla'!IS140=0,\"\",'[1]Tasa de Falla'!IS140)","v":"XXXX"},{"$f":"IF('[1]Tasa de Falla'!IT140=0,\"\",'[1]Tasa de Falla'!IT140)","v":"XXXX"},{"$f":"IF('[1]Tasa de Falla'!IU140=0,\"\",'[1]Tasa de Falla'!IU140)","v":"XXXX"},{"$f":"IF('[1]Tasa de Falla'!IV140=0,\"\",'[1]Tasa de Falla'!IV140)","v":"XXXX"},{"$f":"IF('[1]Tasa de Falla'!IW140=0,\"\",'[1]Tasa de Falla'!IW140)","v":"XXXX"},{"$f":"IF('[1]Tasa de Falla'!IX140=0,\"\",'[1]Tasa de Falla'!IX140)","v":"XXXX"},{"$f":"IF('[1]Tasa de Falla'!IY140=0,\"\",'[1]Tasa de Falla'!IY140)","v":""},{"$f":"IF('[1]Tasa de Falla'!IZ140=0,\"\",'[1]Tasa de Falla'!IZ140)","v":""},{"$f":"IF('[1]Tasa de Falla'!JA140=0,\"\",'[1]Tasa de Falla'!JA140)","v":""},{"$f":"IF('[1]Tasa de Falla'!JB140=0,\"\",'[1]Tasa de Falla'!JB140)","v":1},{"$f":"IF('[1]Tasa de Falla'!JC140=0,\"\",'[1]Tasa de Falla'!JC140)","v":""}]
[null,null,{"$f":"'[1]Tasa de Falla'!C141","v":124},{"$f":"'[1]Tasa de Falla'!D141","v":"CABRA CORRAL - GUACHIPAS - PAMPA GRANDE"},{"$f":"'[1]Tasa de Falla'!E141","v":132},{"$f":"'[1]Tasa de Falla'!F141","v":72.099999999999994},{"$f":"IF('[1]Tasa de Falla'!IR141=0,\"\",'[1]Tasa de Falla'!IR141)","v":"XXXX"},{"$f":"IF('[1]Tasa de Falla'!IS141=0,\"\",'[1]Tasa de Falla'!IS141)","v":"XXXX"},{"$f":"IF('[1]Tasa de Falla'!IT141=0,\"\",'[1]Tasa de Falla'!IT141)","v":"XXXX"},{"$f":"IF('[1]Tasa de Falla'!IU141=0,\"\",'[1]Tasa de Falla'!IU141)","v":"XXXX"},{"$f":"IF('[1]Tasa de Falla'!IV141=0,\"\",'[1]Tasa de Falla'!IV141)","v":"XXXX"},{"$f":"IF('[1]Tasa de Falla'!IW141=0,\"\",'[1]Tasa de Falla'!IW141)","v":"XXXX"},{"$f":"IF('[1]Tasa de Falla'!IX141=0,\"\",'[1]Tasa de Falla'!IX141)","v":"XXXX"},{"$f":"IF('[1]Tasa de Falla'!IY141=0,\"\",'[1]Tasa de Falla'!IY141)","v":"XXXX"},{"$f":"IF('[1]Tasa de Falla'!IZ141=0,\"\",'[1]Tasa de Falla'!IZ141)","v":"XXXX"},{"$f":"IF('[1]Tasa de Falla'!JA141=0,\"\",'[1]Tasa de Falla'!JA141)","v":"XXXX"},{"$f":"IF('[1]Tasa de Falla'!JB141=0,\"\",'[1]Tasa de Falla'!JB141)","v":"XXXX"},{"$f":"IF('[1]Tasa de Falla'!JC141=0,\"\",'[1]Tasa de Falla'!JC141)","v":"XXXX"}]
[null,null,{"$f":"'[1]Tasa de Falla'!C142","v":125},{"$f":"'[1]Tasa de Falla'!D142","v":"EL TABACAL - PI. TABACAL II - ORAN"},{"$f":"'[1]Tasa de Falla'!E142","v":132},{"$f":"'[1]Tasa de Falla'!F142","v":12.04},{"$f":"IF('[1]Tasa de Falla'!IR142=0,\"\",'[1]Tasa de Falla'!IR142)","v":"XXXX"},{"$f":"IF('[1]Tasa de Falla'!IS142=0,\"\",'[1]Tasa de Falla'!IS142)","v":"XXXX"},{"$f":"IF('[1]Tasa de Falla'!IT142=0,\"\",'[1]Tasa de Falla'!IT142)","v":"XXXX"},{"$f":"IF('[1]Tasa de Falla'!IU142=0,\"\",'[1]Tasa de Falla'!IU142)","v":"XXXX"},{"$f":"IF('[1]Tasa de Falla'!IV142=0,\"\",'[1]Tasa de Falla'!IV142)","v":"XXXX"},{"$f":"IF('[1]Tasa de Falla'!IW142=0,\"\",'[1]Tasa de Falla'!IW142)","v":"XXXX"},{"$f":"IF('[1]Tasa de Falla'!IX142=0,\"\",'[1]Tasa de Falla'!IX142)","v":"XXXX"},{"$f":"IF('[1]Tasa de Falla'!IY142=0,\"\",'[1]Tasa de Falla'!IY142)","v":"XXXX"},{"$f":"IF('[1]Tasa de Falla'!IZ142=0,\"\",'[1]Tasa de Falla'!IZ142)","v":"XXXX"},{"$f":"IF('[1]Tasa de Falla'!JA142=0,\"\",'[1]Tasa de Falla'!JA142)","v":"XXXX"},{"$f":"IF('[1]Tasa de Falla'!JB142=0,\"\",'[1]Tasa de Falla'!JB142)","v":"XXXX"},{"$f":"IF('[1]Tasa de Falla'!JC142=0,\"\",'[1]Tasa de Falla'!JC142)","v":"XXXX"}]
[null,null,{"$f":"'[1]Tasa de Falla'!C143","v":126},{"$f":"'[1]Tasa de Falla'!D143","v":"GUEMES - CAMPO SANTO - MINETTI"},{"$f":"'[1]Tasa de Falla'!E143","v":132},{"$f":"'[1]Tasa de Falla'!F143","v":41.8},{"$f":"IF('[1]Tasa de Falla'!IR143=0,\"\",'[1]Tasa de Falla'!IR143)","v":""},{"$f":"IF('[1]Tasa de Falla'!IS143=0,\"\",'[1]Tasa de Falla'!IS143)","v":""},{"$f":"IF('[1]Tasa de Falla'!IT143=0,\"\",'[1]Tasa de Falla'!IT143)","v":""},{"$f":"IF('[1]Tasa de Falla'!IU143=0,\"\",'[1]Tasa de Falla'!IU143)","v":""},{"$f":"IF('[1]Tasa de Falla'!IV143=0,\"\",'[1]Tasa de Falla'!IV143)","v":""},{"$f":"IF('[1]Tasa de Falla'!IW143=0,\"\",'[1]Tasa de Falla'!IW143)","v":2},{"$f":"IF('[1]Tasa de Falla'!IX143=0,\"\",'[1]Tasa de Falla'!IX143)","v":3},{"$f":"IF('[1]Tasa de Falla'!IY143=0,\"\",'[1]Tasa de Falla'!IY143)","v":""},{"$f":"IF('[1]Tasa de Falla'!IZ143=0,\"\",'[1]Tasa de Falla'!IZ143)","v":""},{"$f":"IF('[1]Tasa de Falla'!JA143=0,\"\",'[1]Tasa de Falla'!JA143)","v":1},{"$f":"IF('[1]Tasa de Falla'!JB143=0,\"\",'[1]Tasa de Falla'!JB143)","v":1},{"$f":"IF('[1]Tasa de Falla'!JC143=0,\"\",'[1]Tasa de Falla'!JC143)","v":""}]
[null,null,{"$f":"'[1]Tasa de Falla'!C144","v":127},{"$f":"'[1]Tasa de Falla'!D144","v":"GUEMES - CAMPO SANTO - PARQUE IND."},{"$f":"'[1]Tasa de Falla'!E144","v":132},{"$f":"'[1]Tasa de Falla'!F144","v":38.86},{"$f":"IF('[1]Tasa de Falla'!IR144=0,\"\",'[1]Tasa de Falla'!IR144)","v":""},{"$f":"IF('[1]Tasa de Falla'!IS144=0,\"\",'[1]Tasa de Falla'!IS144)","v":""},{"$f":"IF('[1]Tasa de Falla'!IT144=0,\"\",'[1]Tasa de Falla'!IT144)","v":""},{"$f":"IF('[1]Tasa de Falla'!IU144=0,\"\",'[1]Tasa de Falla'!IU144)","v":""},{"$f":"IF('[1]Tasa de Falla'!IV144=0,\"\",'[1]Tasa de Falla'!IV144)","v":""},{"$f":"IF('[1]Tasa de Falla'!IW144=0,\"\",'[1]Tasa de Falla'!IW144)","v":""},{"$f":"IF('[1]Tasa de Falla'!IX144=0,\"\",'[1]Tasa de Falla'!IX144)","v":""},{"$f":"IF('[1]Tasa de Falla'!IY144=0,\"\",'[1]Tasa de Falla'!IY144)","v":""},{"$f":"IF('[1]Tasa de Falla'!IZ144=0,\"\",'[1]Tasa de Falla'!IZ144)","v":""},{"$f":"IF('[1]Tasa de Falla'!JA144=0,\"\",'[1]Tasa de Falla'!JA144)","v":""},{"$f":"IF('[1]Tasa de Falla'!JB144=0,\"\",'[1]Tasa de Falla'!JB144)","v":""},{"$f":"IF('[1]Tasa de Falla'!JC144=0,\"\",'[1]Tasa de Falla'!JC144)","v":""}]
[null,null,{"$f":"'[1]Tasa de Falla'!C145","v":128},{"$f":"'[1]Tasa de Falla'!D145","v":"SANTIAGO CENTRO - MISQUI MAYU I - SANTIAGO ESTE"},{"$f":"'[1]Tasa de Falla'!E145","v":132},{"$f":"'[1]Tasa de Falla'!F145","v":10.66},{"$f":"IF('[1]Tasa de Falla'!IR145=0,\"\",'[1]Tasa de Falla'!IR145)","v":"XXXX"},{"$f":"IF('[1]Tasa de Falla'!IS145=0,\"\",'[1]Tasa de Falla'!IS145)","v":"XXXX"},{"$f":"IF('[1]Tasa de Falla'!IT145=0,\"\",'[1]Tasa de Falla'!IT145)","v":"XXXX"},{"$f":"IF('[1]Tasa de Falla'!IU145=0,\"\",'[1]Tasa de Falla'!IU145)","v":"XXXX"},{"$f":"IF('[1]Tasa de Falla'!IV145=0,\"\",'[1]Tasa de Falla'!IV145)","v":"XXXX"},{"$f":"IF('[1]Tasa de Falla'!IW145=0,\"\",'[1]Tasa de Falla'!IW145)","v":"XXXX"},{"$f":"IF('[1]Tasa de Falla'!IX145=0,\"\",'[1]Tasa de Falla'!IX145)","v":"XXXX"},{"$f":"IF('[1]Tasa de Falla'!IY145=0,\"\",'[1]Tasa de Falla'!IY145)","v":""},{"$f":"IF('[1]Tasa de Falla'!IZ145=0,\"\",'[1]Tasa de Falla'!IZ145)","v":""},{"$f":"IF('[1]Tasa de Falla'!JA145=0,\"\",'[1]Tasa de Falla'!JA145)","v":""},{"$f":"IF('[1]Tasa de Falla'!JB145=0,\"\",'[1]Tasa de Falla'!JB145)","v":""},{"$f":"IF('[1]Tasa de Falla'!JC145=0,\"\",'[1]Tasa de Falla'!JC145)","v":""}]
[null,null,{"$f":"'[1]Tasa de Falla'!C146","v":129},{"$f":"'[1]Tasa de Falla'!D146","v":"LA RIOJA SUR - PI. PATQUIA   2"},{"$f":"'[1]Tasa de Falla'!E146","v":132},{"$f":"'[1]Tasa de Falla'!F146","v":40},{"$f":"IF('[1]Tasa de Falla'!IR146=0,\"\",'[1]Tasa de Falla'!IR146)","v":""},{"$f":"IF('[1]Tasa de Falla'!IS146=0,\"\",'[1]Tasa de Falla'!IS146)","v":""},{"$f":"IF('[1]Tasa de Falla'!IT146=0,\"\",'[1]Tasa de Falla'!IT146)","v":""},{"$f":"IF('[1]Tasa de Falla'!IU146=0,\"\",'[1]Tasa de Falla'!IU146)","v":""},{"$f":"IF('[1]Tasa de Falla'!IV146=0,\"\",'[1]Tasa de Falla'!IV146)","v":""},{"$f":"IF('[1]Tasa de Falla'!IW146=0,\"\",'[1]Tasa de Falla'!IW146)","v":""},{"$f":"IF('[1]Tasa de Falla'!IX146=0,\"\",'[1]Tasa de Falla'!IX146)","v":""},{"$f":"IF('[1]Tasa de Falla'!IY146=0,\"\",'[1]Tasa de Falla'!IY146)","v":""},{"$f":"IF('[1]Tasa de Falla'!IZ146=0,\"\",'[1]Tasa de Falla'!IZ146)","v":""},{"$f":"IF('[1]Tasa de Falla'!JA146=0,\"\",'[1]Tasa de Falla'!JA146)","v":""},{"$f":"IF('[1]Tasa de Falla'!JB146=0,\"\",'[1]Tasa de Falla'!JB146)","v":""},{"$f":"IF('[1]Tasa de Falla'!JC146=0,\"\",'[1]Tasa de Falla'!JC146)","v":""}]
[null,null,{"$f":"'[1]Tasa de Falla'!C147","v":130},{"$f":"'[1]Tasa de Falla'!D147","v":"LA RIOJA SUR - PI. CIRCUNVALACION   1"},{"$f":"'[1]Tasa de Falla'!E147","v":132},{"$f":"'[1]Tasa de Falla'!F147","v":41.35},{"$f":"IF('[1]Tasa de Falla'!IR147=0,\"\",'[1]Tasa de Falla'!IR147)","v":"XXXX"},{"$f":"IF('[1]Tasa de Falla'!IS147=0,\"\",'[1]Tasa de Falla'!IS147)","v":"XXXX"},{"$f":"IF('[1]Tasa de Falla'!IT147=0,\"\",'[1]Tasa de Falla'!IT147)","v":""},{"$f":"IF('[1]Tasa de Falla'!IU147=0,\"\",'[1]Tasa de Falla'!IU147)","v":""},{"$f":"IF('[1]Tasa de Falla'!IV147=0,\"\",'[1]Tasa de Falla'!IV147)","v":""},{"$f":"IF('[1]Tasa de Falla'!IW147=0,\"\",'[1]Tasa de Falla'!IW147)","v":""},{"$f":"IF('[1]Tasa de Falla'!IX147=0,\"\",'[1]Tasa de Falla'!IX147)","v":""},{"$f":"IF('[1]Tasa de Falla'!IY147=0,\"\",'[1]Tasa de Falla'!IY147)","v":""},{"$f":"IF('[1]Tasa de Falla'!IZ147=0,\"\",'[1]Tasa de Falla'!IZ147)","v":""},{"$f":"IF('[1]Tasa de Falla'!JA147=0,\"\",'[1]Tasa de Falla'!JA147)","v":""},{"$f":"IF('[1]Tasa de Falla'!JB147=0,\"\",'[1]Tasa de Falla'!JB147)","v":""},{"$f":"IF('[1]Tasa de Falla'!JC147=0,\"\",'[1]Tasa de Falla'!JC147)","v":""}]
[]
[null,null,null,null,"Longitud Total    ",{"$f":"SUM(F16:F148)-F19-F21-F22-F26-F27-F37-F39-F40-F43-F44-F47-F48-F49-F53-F60-F65-F78-F82-F96-F101-F111","v":6071.3800000000028}]
[null,null,null,null,null,"Indisponibilidades Forzadas  ",{"$f":"SUM(G17:G148)","v":17},{"$f":"SUM(H17:H148)","v":10},{"$f":"SUM(I17:I148)","v":19},12,14,15,10,4,11,15,6,9]
[null,null,null,null,null,"TASA DE FALLA  ",{"$f":"+'[1]Tasa de Falla'!IR154","v":3.2},{"$f":"+'[1]Tasa de Falla'!IS154","v":3.29},{"$f":"+'[1]Tasa de Falla'!IT154","v":2.89},{"$f":"+'[1]Tasa de Falla'!IU154","v":2.57},{"$f":"+'[1]Tasa de Falla'!IV154","v":2.31},{"$f":"+'[1]Tasa de Falla'!IW154","v":2.39},{"$f":"+'[1]Tasa de Falla'!IX154","v":2.4},{"$f":"+'[1]Tasa de Falla'!IY154","v":2.5099999999999998},{"$f":"+'[1]Tasa de Falla'!IZ154","v":2.2599999999999998},{"$f":"+'[1]Tasa de Falla'!JA154","v":2.44},{"$f":"+'[1]Tasa de Falla'!JB154","v":2.61},{"$f":"+'[1]Tasa de Falla'!JC154","v":2.67},{"$f":"+'[1]Tasa de Falla'!JD154","v":2.74}]
[]
[null,null,"XXX","  Línea no computada en el mes",null,null,null,null,"TASA DE FALLA",null,null,{"$f":"S151","v":2.74},null,"SALIDAS x AÑO / 100 km"]

{"sheet":"DATO","index":9,"n_rows":25,"n_cols":29,"rows_kept":25,"cut":false,"hidden":false,"merged":[]}
["Mes","Mes","Dia","Año"]
["enero","01",31,2006]
["febrero","02",{"$f":"IF(MOD(E14,4)=0,29,28)","v":28},{"$f":"+D2+1","v":2007}]
["marzo","03",31,2008]
["abril","04",30,2009]
["mayo","05",31,2010]
["junio","06",30,2011]
["julio","07",31,2012]
["agosto","08",31,2013]
["septiembre","09",30,2014]
["octubre","10",31,2015]
["noviembre","11",30]
["diciembre","12",31,null,null,null,null,null,"Total"]
[10,11,{"$f":"CELL(\"CONTENIDO\",OFFSET(A1,B14,0))","v":"noviembre"},{"$f":"CELL(\"CONTENIDO\",OFFSET(C1,B14,0))","v":30},{"$f":"CELL(\"CONTENIDO\",OFFSET(D1,A14,0))","v":2015},{"$f":"\"Desde el 01 al \" & D14 & \" de \" & C14 & \" de \" & E14","v":"Desde el 01 al 30 de noviembre de 2015"},{"$f":"CELL(\"CONTENIDO\",OFFSET(B1,B14,0))","v":"11"},{"$f":"RIGHT(E14,2)","v":"15"},"B14"]
[null,{"$f":"\"\\\\rugor\\files\\Transporte\\Transporte\\AA PROCESO AUT ARCHIVOS J\\TRANSNOA\\\" &E14","v":"\\\\rugor\\files\\Transporte\\Transporte\\AA PROCESO AUT ARCHIVOS J\\TRANSNOA\\2015"},null,null,null,null,{"$f":"\"J\"&G14&H14&\"NOA\"","v":"J1115NOA"}]
[null,{"$f":"\"\\\\rugor\\files\\Transporte\\transporte\\AA PROCESO AUT\\INTERCAMBIO\\\" &H14&G14","v":"\\\\rugor\\files\\Transporte\\transporte\\AA PROCESO AUT\\INTERCAMBIO\\1511"}]
["Hoja","FilaInicio","FilasPlantilla","Columnas","NombreHoja","OrigenDeDatos","Col00","Col01","Col02","Col03","Col04","Col05","Col06","Col07","Col08","Col09","Col10","Col11","Col12","Col13","Col14","Col15","FILHTOTAL","COLHTOTAL","FILHCALC","COLHCALC","FILTRANSP","COLTRANSP","COL TSAL"]
["MODELO L",21,20,11,{"$f":"\"LI-\" & $G$14","v":"LI-11"},"TRANSNOA_INDISPONIBILIDADES_LINEAS_TRANSNOA.XLS",3,5,4,6,7,8,0,10,11,14,0,26,0,0,0,0,19,10,42,27,19,27,14]
["MODELO T",24,20,13,{"$f":"\"T-\" & $G$14","v":"T-11"},"TRANSNOA_INDISPONIBILIDADES_TRAFOS_TRANSNOA.XLS",3,5,4,6,7,8,9,11,12,15,16,18,28,17,0,0,25,10,45,29,22,29,15]
["MODELO S",23,20,10,{"$f":"\"SA-\" & $G$14","v":"SA-11"},"TRANSNOA_INDISPONIBILIDADES_SALIDAS_TRANSNOA.XLS",3,5,4,6,7,8,10,11,14,15,21,0,0,0,0,0,29,10,44,22,21,22,14]
["MODELO L RIOJA",21,20,11,{"$f":"\"LI-RIOJA-\" & $G$14","v":"LI-RIOJA-11"},"TRANSNOA_INDISPONIBILIDADES_LINEAS_RIOJA.XLS",3,5,4,6,7,8,0,10,11,14,2,26,0,0,0,0,21,10,42,27,19,27,14]
["MODELO L EDESA",21,20,11,{"$f":"\"LI-EDESA-\" & $G$14","v":"LI-EDESA-11"},"TRANSNOA_INDISPONIBILIDADES_LINEAS_EDESA.XLS",3,5,4,6,7,8,0,10,11,14,2,26,0,0,0,0,20,10,42,27,19,27,14]
["MODELO T EDESA",24,20,13,{"$f":"\"T-EDESA-\" & $G$14","v":"T-EDESA-11"},"TRANSNOA_INDISPONIBILIDADES_TRAFOS_EDESA.XLS",3,5,4,6,7,8,9,11,12,15,16,18,28,17,0,0,26,10,45,29,22,29,15]
["MODELO S EDESA",23,20,10,{"$f":"\"SA-EDESA-\" & $G$14","v":"SA-EDESA-11"},"TRANSNOA_INDISPONIBILIDADES_SALIDAS_EDESA.XLS",3,5,4,6,7,8,10,11,14,15,21,0,0,0,0,0,30,10,44,22,21,22,14]
["MODELO VST",19,24,4,{"$f":"\"CAUSAS-VST-\" & $G$14","v":"CAUSAS-VST-11"},"TRANSNOA_CAUSAS_VST.XLS",3,4,5,6,7,0,0,0,0,0,0,0,0,0,0,0,999,999,0,0,0,0,0]