{"text_format":"1","workbook":"xlsx","n_sheets":9,"sheets":["TOT-1015","LI-10 (1)","LI-10 (2)","Incendio","T-10 (1)","T-10 (2)","SA-10 (1)","Tasa de Falla","DATO"],"not_rendered":{"charts":0,"images":2,"macros":1,"external_links":3,"defined_names":1,"comments":0,"pivot_tables":0},"unopened":[],"bounds":{"document_bytes":16777216,"sheet_cells":100000,"rows_first":2000,"rows_last":500,"rows_between":2000,"halvings":0,"cell_chars":16384,"cell_head_chars":4096},"cells_cut":0,"cells_raw":0,"read":"whole","date_system":"1900"}

{"sheet":"TOT-1015","index":0,"n_rows":33,"n_cols":10,"rows_kept":33,"cut":false,"hidden":false,"merged":[]}
[]
[null,"ANEXO I  al Memorandum   D.T.E.E. N°      356    / 2017"]
[]
["ENTE NACIONAL REGULADOR "]
["DE LA ELECTRICIDAD"]
[]
[null,"SISTEMA DE TRANSPORTE DE ENERGÍA ELÉCTRICA POR DISTRIBUCIÓN TRONCAL"]
[]
[null,"TRANSNOA S.A."]
[]
[null,"TOTAL DE PENALIZACIONES"]
[]
[null,1]
[null,"Desde el 01 al 31 de octubre de 2015"]
[]
[null,"Sanciones duplicadas por tasa de falla > 4 Sal. x año/100km."]
[]
[null,null,"1.-","LÍNEAS"]
[null,null,null,"1.1.-","Equipamiento propio",null,null,null,null,{"$f":"'LI-10 (2)'!AA43","v":381972.31}]
[null,null,null,null,"1.1.1.-","Equipamiento propio incendio",null,null,null,{"$f":"Incendio!AA29","v":16867.57}]
[]
[null,null,"2.-","CONEXIÓN"]
[null,null,null,"2.1.-","Transformación"]
[null,null,null,null,"2.1.1.-","Equipamiento propio",null,null,null,{"$f":"'T-10 (2)'!AC48","v":27995.89}]
[]
[null,null,null,"2.2.-","Salidas"]
[null,null,null,null,"2.2.1.-","Equipamiento propio",null,null,null,{"$f":"'SA-10 (1)'!V44","v":1084.71}]
[]
[]
[]
[null,null,null,null,null,null,"TOTAL ",{"$f":"SUM(J18:J29)","v":427920.48000000004}]
[]
[null,null,"Valores remuneratorios según Acuerdo SE - ENRE -TRANSNOA 2016-2017"]

{"sheet":"LI-10 (1)","index":1,"n_rows":40,"n_cols":27,"rows_kept":40,"cut":false,"hidden":false,"merged":[]}
[]
[null,{"$f":"+'TOT-1015'!B2","v":"ANEXO I  al Memorandum   D.T.E.E. N°      356    / 2017"}]
[]
[" ENTE NACIONAL REGULADOR"]
["       DE LA ELECTRICIDAD"]
[]
[]
[null,null,null,null,null,"SISTEMA DE TRANSPORTE DE ENERGÍA ELÉCTRICA POR DISTRIBUCIÓN TRONCAL - TRANSNOA S.A."]
[]
[null,null,null,null,null,"1.- LÍNEAS"]
[]
[null,null,null,null,null,"1.1.- Equipamiento propio"]
[]
[null,{"$f":"'TOT-1015'!B14","v":"Desde el 01 al 31 de octubre de 2015"}]
[]
[null,null,null,null,null,"$/100 km-h : LINEAS 132 kV ",514.20399999999995,null,null,null,"FACTOR DE PENALIZACION  K =",{"$f":"30*'TOT-1015'!B13","v":30},{"$f":"IF(L16=30,\" \",IF(L16=60,\"Coeficiente duplicado por tasa de falla >4 Sal. x año/100 km.\",\"REVISAR COEFICIENTE\"))","v":" "}]
[null,null,3,4,5,6,7,8,9,10,11,12,13,14,15,16,17,18,19,20,21,22,23,24,25,26,27]
[null,null,"N°","INDISP","ID EQUIPO","LÍNEAS","U\n[kV]","Long.\n[km]","$/h","Salida","Entrada","Hs. \nIndisp","Minutos\nIndisp.","Tipo \nSal.(²)","C.R.\n%","PENALIZ.\nPROGRAM.","REDUCC.\nPROGRAM.","PENALIZACION FORZADA\nPor Salida    1ras. 3 hs.   hs. Restantes",null,null,"REDUCC. FORZADA\nPor Salida     1ras. 3 hs.     hs. Restantes",null,null,"RESTANTE\nFORZADA","REDUCC.\nRESTANTE","Informó\nen Térm.","TOTAL\nPENALIZAC."]
[]
[]
[null,null,1,292905,5565,"SANTIAGO CENTRO - SANTIAGO ESTE",132,10.66,{"$f":"$G$16/100*IF(H21>25,H21,25)","v":128.55099999999999},"2015-10-02T08:31:00","2015-10-02T13:03:00",{"$f":"IF(F21=\"\",\"\",(K21-J21)*24)","v":4.5333333332673647},{"$f":"IF(F21=\"\",\"\",ROUND((K21-J21)*24*60,0))","v":272},"P",{"$f":"IF(F21=\"\",\"\",\"--\")","v":"--"},{"$f":"IF(N21=\"P\",ROUND(M21/60,2)*I21*$L$16*0.01,\"--\")","v":174.70080899999996},{"$f":"IF(N21=\"RP\",I21*O21*ROUND(L21/60,2)*0.01*M21/100,\"--\")","v":"--"},{"$f":"IF(N21=\"F\",I21*$L$16,\"--\")","v":"--"},{"$f":"IF(AND(M21>10,N21=\"F\"),I21*$L$16*IF(M21>180,3,ROUND((M21)/60,2)),\"--\")","v":"--"},{"$f":"IF(AND(M21>180,N21=\"F\"),(ROUND(M21/60,2)-3)*I21*$L$16*0.1,\"--\")","v":"--"},{"$f":"IF(N21=\"R\",I21*$L$16*O21/100,\"--\")","v":"--"},{"$f":"IF(AND(M21>10,N21=\"R\"),I21*$L$16*O21/100*IF(M21>180,3,ROUND(M21/60,2)),\"--\")","v":"--"},{"$f":"IF(AND(M21>180,N21=\"R\"),(ROUND(M21/60,2)-3)*I21*$L$16*0.1*O21/100,\"--\")","v":"--"},{"$f":"IF(N21=\"RF\",ROUND(M21/60,2)*I21*$L$16*0.1,\"--\")","v":"--"},{"$f":"IF(N21=\"RR\",ROUND(M21/60,2)*I21*$L$16*0.1*O21/100,\"--\")","v":"--"},"SI",{"$f":"IF(F21=\"\",\"\",SUM(P21:Y21)*IF(Z21=\"SI\",1,2))","v":174.70080899999996}]
[]
[]
[null,null,4,292995,5513,"CAMPO GALLO - COPO",132,90,462.78359999999998,"2015-10-07T13:11:00","2015-10-07T19:54:00",6.7166666667326353,403,"P","--",932.97173759999987,"--","--","--","--","--","--","--","--","--","SI",932.97173759999987]
[null,null,5,292996,5512,"QUIMILI - CAMPO GALLO",132,140,719.88559999999995,"2015-10-07T13:11:00","2015-10-07T19:54:00",6.7166666667326353,403,"P","--",1451.2893695999999,"--","--","--","--","--","--","--","--","--","SI",1451.2893695999999]
[null,null,6,293003,4691,"VILLA QUINTEROS - ANDALGALA",132,102,524.48807999999997,"2015-10-07T18:36:00","2015-10-08T00:58:00",6.3666666666395031,382,"F","--","--","--",15734.642399999999,47203.927199999998,5302.5744888000008,"--","--","--","--","--","SI",68241.144088799992]
[null,null,7,293041,4691,"VILLA QUINTEROS - ANDALGALA",132,102,524.48807999999997,"2015-10-11T10:56:00","2015-10-11T11:35:00",0.65000000002328306,39,"F","--","--","--",15734.642399999999,10227.51756,"--","--","--","--","--","--","SI",25962.159959999997]
[null,null,8,293070,4251,"PAMPA GRANDE - CAFAYATE",132,63,323.94851999999997,"2015-10-11T17:40:00","2015-10-12T00:42:00",7.03333333338378,422,"F","--","--","--",9718.4555999999993,29155.366799999996,3916.5376068,"--","--","--","--","--","SI",42790.360006799994]
[null,null,9,293283,4251,"PAMPA GRANDE - CAFAYATE",132,63,323.94851999999997,"2015-10-12T08:47:00","2015-10-12T09:34:00",0.78333333326736465,47,"F","--","--","--",9718.4555999999993,7580.3953679999995,"--","--","--","--","--","--","SI",17298.850967999999]
[null,null,10,293286,5554,"STGO CENTRO - FERNANDEZ - SUNCHO CORRAL",132,103,529.63011999999992,"2015-10-13T10:52:00","2015-10-13T12:50:00",1.96666666661622,118,"P","--",313.01140091999997,"--","--","--","--","--","--","--","--","--","SI",313.01140091999997]
[null,null,11,293288,5513,"CAMPO GALLO - COPO",132,90,462.78359999999998,"2015-10-14T09:00:00","2015-10-14T17:03:00",8.0500000000465661,483,"P","--",1117.622394,"--","--","--","--","--","--","--","--","--","SI",1117.622394]
[null,null,12,293289,272,"AGUILARES - ESCABA",132,27.600000381469727,141.92030596153259,"2015-10-14T09:23:00","2015-10-14T16:39:00",7.2666666666045785,436,"P","--",309.52818730210254,"--","--","--","--","--","--","--","--","--","NO",619.05637460420508]
[null,null,13,293294,4251,"PAMPA GRANDE - CAFAYATE",132,63,323.94851999999997,"2015-10-14T16:09:00","2015-10-14T17:38:00",1.4833333332790062,89,"F","--","--","--",9718.4555999999993,14383.314288,"--","--","--","--","--","--","SI",24101.769887999999]
[null,null,14,293301,5513,"CAMPO GALLO - COPO",132,90,462.78359999999998,"2015-10-15T09:29:00","2015-10-15T16:31:00",7.03333333338378,422,"P","--",976.01061240000001,"--","--","--","--","--","--","--","--","--","SI",976.01061240000001]
[null,null,15,293306,5554,"STGO CENTRO - FERNANDEZ - SUNCHO CORRAL",132,103,529.63011999999992,"2015-10-17T06:20:00","2015-10-17T10:25:00",4.0833333333721384,245,"P","--",648.26726687999997,"--","--","--","--","--","--","--","--","--","SI",648.26726687999997]
[null,null,16,293307,5565,"SANTIAGO CENTRO - SANTIAGO ESTE",132,10.66,128.55099999999999,"2015-10-17T06:24:00","2015-10-17T10:24:00",{"$f":"IF(F36=\"\",\"\",(K36-J36)*24)","v":3.9999999999417923},{"$f":"IF(F36=\"\",\"\",ROUND((K36-J36)*24*60,0))","v":240},"P",{"$f":"IF(F36=\"\",\"\",\"--\")","v":"--"},{"$f":"IF(N36=\"P\",ROUND(M36/60,2)*I36*$L$16*0.01,\"--\")","v":154.2612},{"$f":"IF(N36=\"RP\",I36*O36*ROUND(L36/60,2)*0.01*M36/100,\"--\")","v":"--"},{"$f":"IF(N36=\"F\",I36*$L$16,\"--\")","v":"--"},{"$f":"IF(AND(M36>10,N36=\"F\"),I36*$L$16*IF(M36>180,3,ROUND((M36)/60,2)),\"--\")","v":"--"},{"$f":"IF(AND(M36>180,N36=\"F\"),(ROUND(M36/60,2)-3)*I36*$L$16*0.1,\"--\")","v":"--"},{"$f":"IF(N36=\"R\",I36*$L$16*O36/100,\"--\")","v":"--"},{"$f":"IF(AND(M36>10,N36=\"R\"),I36*$L$16*O36/100*IF(M36>180,3,ROUND(M36/60,2)),\"--\")","v":"--"},{"$f":"IF(AND(M36>180,N36=\"R\"),(ROUND(M36/60,2)-3)*I36*$L$16*0.1*O36/100,\"--\")","v":"--"},{"$f":"IF(N36=\"RF\",ROUND(M36/60,2)*I36*$L$16*0.1,\"--\")","v":"--"},{"$f":"IF(N36=\"RR\",ROUND(M36/60,2)*I36*$L$16*0.1*O36/100,\"--\")","v":"--"},"SI",{"$f":"IF(F36=\"\",\"\",SUM(P36:Y36)*IF(Z36=\"SI\",1,2))","v":154.2612}]
[null,null,17,293308,4483,"SANTIAGO SUR - SANTIAGO CENTRO",132,4,128.55099999999999,"2015-10-17T06:24:00","2015-10-17T10:22:00",{"$f":"IF(F37=\"\",\"\",(K37-J37)*24)","v":3.9666666664998047},{"$f":"IF(F37=\"\",\"\",ROUND((K37-J37)*24*60,0))","v":238},"P",{"$f":"IF(F37=\"\",\"\",\"--\")","v":"--"},{"$f":"IF(N37=\"P\",ROUND(M37/60,2)*I37*$L$16*0.01,\"--\")","v":153.104241},{"$f":"IF(N37=\"RP\",I37*O37*ROUND(L37/60,2)*0.01*M37/100,\"--\")","v":"--"},{"$f":"IF(N37=\"F\",I37*$L$16,\"--\")","v":"--"},{"$f":"IF(AND(M37>10,N37=\"F\"),I37*$L$16*IF(M37>180,3,ROUND((M37)/60,2)),\"--\")","v":"--"},{"$f":"IF(AND(M37>180,N37=\"F\"),(ROUND(M37/60,2)-3)*I37*$L$16*0.1,\"--\")","v":"--"},{"$f":"IF(N37=\"R\",I37*$L$16*O37/100,\"--\")","v":"--"},{"$f":"IF(AND(M37>10,N37=\"R\"),I37*$L$16*O37/100*IF(M37>180,3,ROUND(M37/60,2)),\"--\")","v":"--"},{"$f":"IF(AND(M37>180,N37=\"R\"),(ROUND(M37/60,2)-3)*I37*$L$16*0.1*O37/100,\"--\")","v":"--"},{"$f":"IF(N37=\"RF\",ROUND(M37/60,2)*I37*$L$16*0.1,\"--\")","v":"--"},{"$f":"IF(N37=\"RR\",ROUND(M37/60,2)*I37*$L$16*0.1*O37/100,\"--\")","v":"--"},"SI",{"$f":"IF(F37=\"\",\"\",SUM(P37:Y37)*IF(Z37=\"SI\",1,2))","v":153.104241}]
[null,null,18,293469,5296,"LA BANDA ESTE - LA BANDA",132,15.2,128.55099999999999,"2015-10-21T08:11:00","2015-10-21T14:04:00",{"$f":"IF(F38=\"\",\"\",(K38-J38)*24)","v":5.8833333333022892},{"$f":"IF(F38=\"\",\"\",ROUND((K38-J38)*24*60,0))","v":353},"P",{"$f":"IF(F38=\"\",\"\",\"--\")","v":"--"},{"$f":"IF(N38=\"P\",ROUND(M38/60,2)*I38*$L$16*0.01,\"--\")","v":226.76396399999999},{"$f":"IF(N38=\"RP\",I38*O38*ROUND(L38/60,2)*0.01*M38/100,\"--\")","v":"--"},{"$f":"IF(N38=\"F\",I38*$L$16,\"--\")","v":"--"},{"$f":"IF(AND(M38>10,N38=\"F\"),I38*$L$16*IF(M38>180,3,ROUND((M38)/60,2)),\"--\")","v":"--"},{"$f":"IF(AND(M38>180,N38=\"F\"),(ROUND(M38/60,2)-3)*I38*$L$16*0.1,\"--\")","v":"--"},{"$f":"IF(N38=\"R\",I38*$L$16*O38/100,\"--\")","v":"--"},{"$f":"IF(AND(M38>10,N38=\"R\"),I38*$L$16*O38/100*IF(M38>180,3,ROUND(M38/60,2)),\"--\")","v":"--"},{"$f":"IF(AND(M38>180,N38=\"R\"),(ROUND(M38/60,2)-3)*I38*$L$16*0.1*O38/100,\"--\")","v":"--"},{"$f":"IF(N38=\"RF\",ROUND(M38/60,2)*I38*$L$16*0.1,\"--\")","v":"--"},{"$f":"IF(N38=\"RR\",ROUND(M38/60,2)*I38*$L$16*0.1*O38/100,\"--\")","v":"--"},"SI",{"$f":"IF(F38=\"\",\"\",SUM(P38:Y38)*IF(Z38=\"SI\",1,2))","v":226.76396399999999}]
[]
[null,null,"(²)","P - PROGRAMADA  ; F - FORZADA",null,null,null,null,null,null,null,null,null,null,null,{"$f":"SUM(P19:P39)","v":6457.5311827021023},0,60624.651599999997,108550.52121599999,9219.1120956000013,0,0,0,0,0,null,{"$f":"ROUND(SUM(AA19:AA39),2)","v":185161.34}]

{"sheet":"LI-10 (2)","index":2,"n_rows":43,"n_cols":27,"rows_kept":43,"cut":false,"hidden":false,"merged":[]}
[]
[null,{"$f":"+'TOT-1015'!B2","v":"ANEXO I  al Memorandum   D.T.E.E. N°      356    / 2017"}]
[]
[" ENTE NACIONAL REGULADOR"]
["       DE LA ELECTRICIDAD"]
[]
[]
[null,null,null,null,null,"SISTEMA DE TRANSPORTE DE ENERGÍA ELÉCTRICA POR DISTRIBUCIÓN TRONCAL - TRANSNOA S.A."]
[]
[null,null,null,null,null,"1.- LÍNEAS"]
[]
[null,null,null,null,null,"1.1.- Equipamiento propio"]
[]
[null,{"$f":"'TOT-1015'!B14","v":"Desde el 01 al 31 de octubre de 2015"}]
[]
[null,null,null,null,null,"$/100 km-h : LINEAS 132 kV ",514.20399999999995,null,null,null,"FACTOR DE PENALIZACION  K =",{"$f":"30*'TOT-1015'!B13","v":30},{"$f":"IF(L16=30,\" \",IF(L16=60,\"Coeficiente duplicado por tasa de falla >4 Sal. x año/100 km.\",\"REVISAR COEFICIENTE\"))","v":" "}]
[null,null,3,4,5,6,7,8,9,10,11,12,13,14,15,16,17,18,19,20,21,22,23,24,25,26,27]
[null,null,"N°","INDISP","ID EQUIPO","LÍNEAS","U\n[kV]","Long.\n[km]","$/h","Salida","Entrada","Hs. \nIndisp","Minutos\nIndisp.","Tipo \nSal.(²)","C.R.\n%","PENALIZ.\nPROGRAM.","REDUCC.\nPROGRAM.","PENALIZACION FORZADA\nPor Salida    1ras. 3 hs.   hs. Restantes",null,null,"REDUCC. FORZADA\nPor Salida     1ras. 3 hs.     hs. Restantes",null,null,"RESTANTE\nFORZADA","REDUCC.\nRESTANTE","Informó\nen Térm.","TOTAL\nPENALIZAC."]
[null,null,null,null,null,null,null,null,null,null,null,null,null,null,null,null,null,null,null,null,null,null,null,null,null,null,{"$f":"'LI-10 (1)'!AA40","v":185161.34}]
[]
[null,null,19,293471,272,"AGUILARES - ESCABA",132,27.600000381469727,{"$f":"$G$16/100*IF(H21>25,H21,25)","v":141.92030596153259},"2015-10-21T09:54:00","2015-10-21T18:14:00",{"$f":"IF(F21=\"\",\"\",(K21-J21)*24)","v":8.3333333334303461},{"$f":"IF(F21=\"\",\"\",ROUND((K21-J21)*24*60,0))","v":500},"P",{"$f":"IF(F21=\"\",\"\",\"--\")","v":"--"},{"$f":"IF(N21=\"P\",ROUND(M21/60,2)*I21*$L$16*0.01,\"--\")","v":354.65884459786992},{"$f":"IF(N21=\"RP\",I21*O21*ROUND(L21/60,2)*0.01*M21/100,\"--\")","v":"--"},{"$f":"IF(N21=\"F\",I21*$L$16,\"--\")","v":"--"},{"$f":"IF(AND(M21>10,N21=\"F\"),I21*$L$16*IF(M21>180,3,ROUND((M21)/60,2)),\"--\")","v":"--"},{"$f":"IF(AND(M21>180,N21=\"F\"),(ROUND(M21/60,2)-3)*I21*$L$16*0.1,\"--\")","v":"--"},{"$f":"IF(N21=\"R\",I21*$L$16*O21/100,\"--\")","v":"--"},{"$f":"IF(AND(M21>10,N21=\"R\"),I21*$L$16*O21/100*IF(M21>180,3,ROUND(M21/60,2)),\"--\")","v":"--"},{"$f":"IF(AND(M21>180,N21=\"R\"),(ROUND(M21/60,2)-3)*I21*$L$16*0.1*O21/100,\"--\")","v":"--"},{"$f":"IF(N21=\"RF\",ROUND(M21/60,2)*I21*$L$16*0.1,\"--\")","v":"--"},{"$f":"IF(N21=\"RR\",ROUND(M21/60,2)*I21*$L$16*0.1*O21/100,\"--\")","v":"--"},"SI",{"$f":"IF(F21=\"\",\"\",SUM(P21:Y21)*IF(Z21=\"SI\",1,2))","v":354.65884459786992}]
[null,null,20,293473,5554,"STGO CENTRO - FERNANDEZ - SUNCHO CORRAL",132,103,{"$f":"$G$16/100*IF(H22>25,H22,25)","v":529.63011999999992},"2015-10-22T08:23:00","2015-10-22T11:38:00",{"$f":"IF(F22=\"\",\"\",(K22-J22)*24)","v":3.2499999999417923},{"$f":"IF(F22=\"\",\"\",ROUND((K22-J22)*24*60,0))","v":195},"P",{"$f":"IF(F22=\"\",\"\",\"--\")","v":"--"},{"$f":"IF(N22=\"P\",ROUND(M22/60,2)*I22*$L$16*0.01,\"--\")","v":516.38936699999988},{"$f":"IF(N22=\"RP\",I22*O22*ROUND(L22/60,2)*0.01*M22/100,\"--\")","v":"--"},{"$f":"IF(N22=\"F\",I22*$L$16,\"--\")","v":"--"},{"$f":"IF(AND(M22>10,N22=\"F\"),I22*$L$16*IF(M22>180,3,ROUND((M22)/60,2)),\"--\")","v":"--"},{"$f":"IF(AND(M22>180,N22=\"F\"),(ROUND(M22/60,2)-3)*I22*$L$16*0.1,\"--\")","v":"--"},{"$f":"IF(N22=\"R\",I22*$L$16*O22/100,\"--\")","v":"--"},{"$f":"IF(AND(M22>10,N22=\"R\"),I22*$L$16*O22/100*IF(M22>180,3,ROUND(M22/60,2)),\"--\")","v":"--"},{"$f":"IF(AND(M22>180,N22=\"R\"),(ROUND(M22/60,2)-3)*I22*$L$16*0.1*O22/100,\"--\")","v":"--"},{"$f":"IF(N22=\"RF\",ROUND(M22/60,2)*I22*$L$16*0.1,\"--\")","v":"--"},{"$f":"IF(N22=\"RR\",ROUND(M22/60,2)*I22*$L$16*0.1*O22/100,\"--\")","v":"--"},"SI",{"$f":"IF(F22=\"\",\"\",SUM(P22:Y22)*IF(Z22=\"SI\",1,2))","v":516.38936699999988}]
[null,null,21,293474,272,"AGUILARES - ESCABA",132,27.600000381469727,141.92030596153259,"2015-10-22T09:52:00","2015-10-22T17:09:00",7.2833333333255723,437,"P","--",309.95394821998718,"--","--","--","--","--","--","--","--","--","SI",309.95394821998718]
[null,null,22,293475,272,"AGUILARES - ESCABA",132,27.600000381469727,141.92030596153259,"2015-10-23T10:25:00","2015-10-23T17:24:00",6.9833333332207985,419,"P","--",297.18112068344925,"--","--","--","--","--","--","--","--","--","SI",297.18112068344925]
[null,null,23,293971,5295,"EL BRACHO - LA BANDA ESTE",132,140.9,724.51343599999996,"2015-10-26T18:12:00","2015-10-27T01:36:00",7.4000000000232831,444,"F","--","--","--",21735.40308,65206.209239999996,9563.577355200001,"--","--","--","--","--","SI",96505.189675200003]
[null,null,24,293994,272,"AGUILARES - ESCABA",132,27.600000381469727,141.92030596153259,"2015-10-27T10:20:00","2015-10-27T16:20:00",6,360,"P","--",255.45655073075869,"--","--","--","--","--","--","--","--","--","SI",255.45655073075869]
[null,null,25,293995,4803,"J. V. GONZALEZ - APOLINARIO SARAVIA",132,94,483.35175999999996,"2015-10-27T10:21:00","2015-10-27T17:20:00",6.9833333332207985,419,"F","--",{"$f":"IF(N27=\"P\",ROUND(M27/60,2)*I27*$L$16*0.01,\"--\")","v":"--"},{"$f":"IF(N27=\"RP\",I27*O27*ROUND(L27/60,2)*0.01*M27/100,\"--\")","v":"--"},{"$f":"IF(N27=\"F\",I27*$L$16,\"--\")","v":14500.552799999999},{"$f":"IF(AND(M27>10,N27=\"F\"),I27*$L$16*IF(M27>180,3,ROUND((M27)/60,2)),\"--\")","v":43501.6584},{"$f":"IF(AND(M27>180,N27=\"F\"),(ROUND(M27/60,2)-3)*I27*$L$16*0.1,\"--\")","v":5771.2200144000008},{"$f":"IF(N27=\"R\",I27*$L$16*O27/100,\"--\")","v":"--"},{"$f":"IF(AND(M27>10,N27=\"R\"),I27*$L$16*O27/100*IF(M27>180,3,ROUND(M27/60,2)),\"--\")","v":"--"},{"$f":"IF(AND(M27>180,N27=\"R\"),(ROUND(M27/60,2)-3)*I27*$L$16*0.1*O27/100,\"--\")","v":"--"},{"$f":"IF(N27=\"RF\",ROUND(M27/60,2)*I27*$L$16*0.1,\"--\")","v":"--"},{"$f":"IF(N27=\"RR\",ROUND(M27/60,2)*I27*$L$16*0.1*O27/100,\"--\")","v":"--"},"SI",{"$f":"IF(F27=\"\",\"\",SUM(P27:Y27)*IF(Z27=\"SI\",1,2))","v":63773.4312144}]
[null,null,26,294000,5541,"SANTIAGO - SANTIAGO SUR",132,8.4,128.55099999999999,"2015-10-28T06:31:00","2015-10-28T09:39:00",3.1333333334187046,188,"F","--","--","--",3856.5299999999997,11569.59,50.134889999999956,"--","--","--","--","--","SI",15476.254889999998]
[null,null,27,294006,5513,"CAMPO GALLO - COPO",132,90,462.78359999999998,"2015-10-28T09:53:00","2015-10-28T15:51:00",5.9666666665580124,358,"P","--",828.84542759999999,"--","--","--","--","--","--","--","--","--","SI",828.84542759999999]
[null,null,28,294008,5513,"CAMPO GALLO - COPO",132,90,462.78359999999998,"2015-10-29T08:33:00","2015-10-29T16:36:00",8.0500000000465661,483,"P","--",1117.622394,"--","--","--","--","--","--","--","--","--","SI",1117.622394]
[null,null,29,294012,4902,"ANDALGALA - SAUJIL",132,76,390.79503999999997,"2015-10-29T19:47:00","2015-10-29T20:15:00",0.46666666661622003,28,"F","--","--","--",11723.851199999999,5510.210063999999,"--","--","--","--","--","--","SI",17234.061263999996]
[null,null,30,294019,5483,"TERMAS NORTE - RIO HONDO",132,5.8,128.55099999999999,"2015-10-30T09:09:00","2015-10-30T12:50:00",3.6833333332906477,221,"P","--",141.92030399999999,"--","--","--","--","--","--","--","--","--","SI",141.92030399999999]
[]
[null,null,null,null,null,null,null,null,128.55099999999999,null,null,"","",null,"","--","--","--","--","--","--","--","--","--","--",{"$f":"IF(F34=\"\",\"\",\"SI\")","v":""},""]
[null,null,null,null,null,null,null,null,128.55099999999999,null,null,"","",null,"","--","--","--","--","--","--","--","--","--","--","",""]
[null,null,null,null,null,null,null,null,128.55099999999999,null,null,"","",null,"","--","--","--","--","--","--","--","--","--","--","",""]
[null,null,null,null,null,null,null,null,128.55099999999999,null,null,"","",null,"","--","--","--","--","--","--","--","--","--","--","",""]
[null,null,null,null,null,null,null,null,128.55099999999999,null,null,"","",null,"","--","--","--","--","--","--","--","--","--","--","",""]
[null,null,null,null,null,null,null,null,128.55099999999999,null,null,{"$f":"IF(F39=\"\",\"\",(K39-J39)*24)","v":""},{"$f":"IF(F39=\"\",\"\",ROUND((K39-J39)*24*60,0))","v":""},null,{"$f":"IF(F39=\"\",\"\",\"--\")","v":""},{"$f":"IF(N39=\"P\",ROUND(M39/60,2)*I39*$L$16*0.01,\"--\")","v":"--"},{"$f":"IF(N39=\"RP\",I39*O39*ROUND(L39/60,2)*0.01*M39/100,\"--\")","v":"--"},{"$f":"IF(N39=\"F\",I39*$L$16,\"--\")","v":"--"},{"$f":"IF(AND(M39>10,N39=\"F\"),I39*$L$16*IF(M39>180,3,ROUND((M39)/60,2)),\"--\")","v":"--"},{"$f":"IF(AND(M39>180,N39=\"F\"),(ROUND(M39/60,2)-3)*I39*$L$16*0.1,\"--\")","v":"--"},{"$f":"IF(N39=\"R\",I39*$L$16*O39/100,\"--\")","v":"--"},{"$f":"IF(AND(M39>10,N39=\"R\"),I39*$L$16*O39/100*IF(M39>180,3,ROUND(M39/60,2)),\"--\")","v":"--"},{"$f":"IF(AND(M39>180,N39=\"R\"),(ROUND(M39/60,2)-3)*I39*$L$16*0.1*O39/100,\"--\")","v":"--"},{"$f":"IF(N39=\"RF\",ROUND(M39/60,2)*I39*$L$16*0.1,\"--\")","v":"--"},{"$f":"IF(N39=\"RR\",ROUND(M39/60,2)*I39*$L$16*0.1*O39/100,\"--\")","v":"--"},"",{"$f":"IF(F39=\"\",\"\",SUM(P39:Y39)*IF(Z39=\"SI\",1,2))","v":""}]
[null,null,null,null,null,null,null,null,128.55099999999999,null,null,{"$f":"IF(F40=\"\",\"\",(K40-J40)*24)","v":""},{"$f":"IF(F40=\"\",\"\",ROUND((K40-J40)*24*60,0))","v":""},null,{"$f":"IF(F40=\"\",\"\",\"--\")","v":""},{"$f":"IF(N40=\"P\",ROUND(M40/60,2)*I40*$L$16*0.01,\"--\")","v":"--"},{"$f":"IF(N40=\"RP\",I40*O40*ROUND(L40/60,2)*0.01*M40/100,\"--\")","v":"--"},{"$f":"IF(N40=\"F\",I40*$L$16,\"--\")","v":"--"},{"$f":"IF(AND(M40>10,N40=\"F\"),I40*$L$16*IF(M40>180,3,ROUND((M40)/60,2)),\"--\")","v":"--"},{"$f":"IF(AND(M40>180,N40=\"F\"),(ROUND(M40/60,2)-3)*I40*$L$16*0.1,\"--\")","v":"--"},{"$f":"IF(N40=\"R\",I40*$L$16*O40/100,\"--\")","v":"--"},{"$f":"IF(AND(M40>10,N40=\"R\"),I40*$L$16*O40/100*IF(M40>180,3,ROUND(M40/60,2)),\"--\")","v":"--"},{"$f":"IF(AND(M40>180,N40=\"R\"),(ROUND(M40/60,2)-3)*I40*$L$16*0.1*O40/100,\"--\")","v":"--"},{"$f":"IF(N40=\"RF\",ROUND(M40/60,2)*I40*$L$16*0.1,\"--\")","v":"--"},{"$f":"IF(N40=\"RR\",ROUND(M40/60,2)*I40*$L$16*0.1*O40/100,\"--\")","v":"--"},"",{"$f":"IF(F40=\"\",\"\",SUM(P40:Y40)*IF(Z40=\"SI\",1,2))","v":""}]
[null,null,null,null,null,null,null,null,128.55099999999999,null,null,{"$f":"IF(F41=\"\",\"\",(K41-J41)*24)","v":""},{"$f":"IF(F41=\"\",\"\",ROUND((K41-J41)*24*60,0))","v":""},null,{"$f":"IF(F41=\"\",\"\",\"--\")","v":""},{"$f":"IF(N41=\"P\",ROUND(M41/60,2)*I41*$L$16*0.01,\"--\")","v":"--"},{"$f":"IF(N41=\"RP\",I41*O41*ROUND(L41/60,2)*0.01*M41/100,\"--\")","v":"--"},{"$f":"IF(N41=\"F\",I41*$L$16,\"--\")","v":"--"},{"$f":"IF(AND(M41>10,N41=\"F\"),I41*$L$16*IF(M41>180,3,ROUND((M41)/60,2)),\"--\")","v":"--"},{"$f":"IF(AND(M41>180,N41=\"F\"),(ROUND(M41/60,2)-3)*I41*$L$16*0.1,\"--\")","v":"--"},{"$f":"IF(N41=\"R\",I41*$L$16*O41/100,\"--\")","v":"--"},{"$f":"IF(AND(M41>10,N41=\"R\"),I41*$L$16*O41/100*IF(M41>180,3,ROUND(M41/60,2)),\"--\")","v":"--"},{"$f":"IF(AND(M41>180,N41=\"R\"),(ROUND(M41/60,2)-3)*I41*$L$16*0.1*O41/100,\"--\")","v":"--"},{"$f":"IF(N41=\"RF\",ROUND(M41/60,2)*I41*$L$16*0.1,\"--\")","v":"--"},{"$f":"IF(N41=\"RR\",ROUND(M41/60,2)*I41*$L$16*0.1*O41/100,\"--\")","v":"--"},"",{"$f":"IF(F41=\"\",\"\",SUM(P41:Y41)*IF(Z41=\"SI\",1,2))","v":""}]
[]
[null,null,"(²)","P - PROGRAMADA  ; F - FORZADA",null,null,null,null,null,null,null,null,null,null,null,{"$f":"SUM(P19:P42)","v":3822.0279568320648},0,51816.337079999998,125787.66770399999,15384.9322596,0,0,0,0,0,null,{"$f":"ROUND(SUM(AA19:AA42),2)","v":381972.31}]

{"sheet":"Incendio","index":3,"n_rows":30,"n_cols":27,"rows_kept":30,"cut":false,"hidden":false,"merged":[]}
[]
[null,{"$f":"'TOT-1015'!B2","v":"ANEXO I  al Memorandum   D.T.E.E. N°      356    / 2017"}]
[]
[" ENTE NACIONAL REGULADOR "]
["       DE LA ELECTRICIDAD"]
[]
[]
[null,null,null,null,null,"SISTEMA DE TRANSPORTE DE ENERGÍA ELÉCTRICA POR DISTRIBUCIÓN TRONCAL - TRANSNOA S.A."]
[]
[null,null,null,null,null,"1.- LÍNEAS"]
[]
[null,null,null,null,null,"1.1.1.- Equipamiento propio - Incendio"]
[]
[null,{"$f":"'TOT-1015'!B14","v":"Desde el 01 al 31 de octubre de 2015"}]
[]
[null,null,null,null,null,"$/100 km-h : LINEAS 132 kV ",514.20399999999995,null,null,null,"FACTOR DE PENALIZACION  K =",{"$f":"30*'[1]TOT-0915'!B13","v":30},{"$f":"IF(L16=30,\" \",IF(L16=60,\"Coeficiente duplicado por tasa de falla >4 Sal. x año/100 km.\",\"REVISAR COEFICIENTE\"))","v":" "}]
[null,null,3,4,5,6,7,8,9,10,11,12,13,14,15,16,17,18,19,20,21,22,23,24,25,26,27]
[null,null,"N°","INDISP","ID EQUIPO","LÍNEAS","U\n[kV]","Long.\n[km]","$/h","Salida","Entrada","Hs. \nIndisp","Minutos\nIndisp.","Tipo \nSal.(²)","C.R.\n%","PENALIZ.\nPROGRAM.","REDUCC.\nPROGRAM.","PENALIZACION FORZADA\nPor Salida    1ras. 3 hs.   hs. Restantes",null,null,"REDUCC. FORZADA\nPor Salida     1ras. 3 hs.     hs. Restantes",null,null,"RESTANTE\nFORZADA","REDUCC.\nRESTANTE","Informó\nen Térm.","TOTAL\nPENALIZAC."]
[]
[]
[null,null,2,292993,4677,"GUEMES SALTA - MINETTI",132,36.099998474121094,{"$f":"$G$16/100*IF(H21>25,H21,25)","v":185.62763615386962},"2015-10-06T15:07:00","2015-10-06T15:27:00",{"$f":"IF(F21=\"\",\"\",(K21-J21)*24)","v":0.33333333337213844},{"$f":"IF(F21=\"\",\"\",ROUND((K21-J21)*24*60,0))","v":20},"FM",{"$f":"IF(F21=\"\",\"\",\"--\")","v":"--"},{"$f":"IF(N21=\"P\",ROUND(M21/60,2)*I21*$L$16*0.01,\"--\")","v":"--"},{"$f":"IF(N21=\"RP\",I21*O21*ROUND(L21/60,2)*0.01*M21/100,\"--\")","v":"--"},0,{"$f":"IF(AND(M21>10,N21=\"F\"),I21*$L$16*IF(M21>180,3,ROUND((M21)/60,2)),\"--\")","v":"--"},{"$f":"IF(AND(M21>180,N21=\"F\"),(ROUND(M21/60,2)-3)*I21*$L$16*0.1,\"--\")","v":"--"},{"$f":"IF(N21=\"R\",I21*$L$16*O21/100,\"--\")","v":"--"},{"$f":"IF(AND(M21>10,N21=\"R\"),I21*$L$16*O21/100*IF(M21>180,3,ROUND(M21/60,2)),\"--\")","v":"--"},{"$f":"IF(AND(M21>180,N21=\"R\"),(ROUND(M21/60,2)-3)*I21*$L$16*0.1*O21/100,\"--\")","v":"--"},{"$f":"IF(N21=\"RF\",ROUND(M21/60,2)*I21*$L$16*0.1,\"--\")","v":"--"},{"$f":"IF(N21=\"RR\",ROUND(M21/60,2)*I21*$L$16*0.1*O21/100,\"--\")","v":"--"},"SI",1837.7135979233094]
[null,null,3,292994,293,"MINETTI - SAN JUANCITO",132,26,133.69304,"2015-10-06T15:07:00","2015-10-06T15:33:00",{"$f":"IF(F22=\"\",\"\",(K22-J22)*24)","v":0.43333333334885538},{"$f":"IF(F22=\"\",\"\",ROUND((K22-J22)*24*60,0))","v":26},"FM",{"$f":"IF(F22=\"\",\"\",\"--\")","v":"--"},{"$f":"IF(N22=\"P\",ROUND(M22/60,2)*I22*$L$16*0.01,\"--\")","v":"--"},{"$f":"IF(N22=\"RP\",I22*O22*ROUND(L22/60,2)*0.01*M22/100,\"--\")","v":"--"},0,{"$f":"IF(AND(M22>10,N22=\"F\"),I22*$L$16*IF(M22>180,3,ROUND((M22)/60,2)),\"--\")","v":"--"},{"$f":"IF(AND(M22>180,N22=\"F\"),(ROUND(M22/60,2)-3)*I22*$L$16*0.1,\"--\")","v":"--"},{"$f":"IF(N22=\"R\",I22*$L$16*O22/100,\"--\")","v":"--"},{"$f":"IF(AND(M22>10,N22=\"R\"),I22*$L$16*O22/100*IF(M22>180,3,ROUND(M22/60,2)),\"--\")","v":"--"},{"$f":"IF(AND(M22>180,N22=\"R\"),(ROUND(M22/60,2)-3)*I22*$L$16*0.1*O22/100,\"--\")","v":"--"},{"$f":"IF(N22=\"RF\",ROUND(M22/60,2)*I22*$L$16*0.1,\"--\")","v":"--"},{"$f":"IF(N22=\"RR\",ROUND(M22/60,2)*I22*$L$16*0.1*O22/100,\"--\")","v":"--"},"SI",1724.6402159999998]
[null,null,31,294020,281,"GÜEMES - SAN JUANCITO 1",132,36.240001678466797,186.3475382307434,"2015-10-30T11:58:00","2015-10-30T14:21:00",{"$f":"IF(F23=\"\",\"\",(K23-J23)*24)","v":2.3833333332440816},{"$f":"IF(F23=\"\",\"\",ROUND((K23-J23)*24*60,0))","v":143},"FM",{"$f":"IF(F23=\"\",\"\",\"--\")","v":"--"},{"$f":"IF(N23=\"P\",ROUND(M23/60,2)*I23*$L$16*0.01,\"--\")","v":"--"},{"$f":"IF(N23=\"RP\",I23*O23*ROUND(L23/60,2)*0.01*M23/100,\"--\")","v":"--"},0,{"$f":"IF(AND(M23>10,N23=\"F\"),I23*$L$16*IF(M23>180,3,ROUND((M23)/60,2)),\"--\")","v":"--"},{"$f":"IF(AND(M23>180,N23=\"F\"),(ROUND(M23/60,2)-3)*I23*$L$16*0.1,\"--\")","v":"--"},"--","--","--","--","--","SI",13305.214229675079]
[null,null,null,null,null,null,null,null,128.55099999999999,null,null,null,null,null,null,null,null,null,null,null,null,null,null,null,null,null,{"$f":"IF(F24=\"\",\"\",SUM(P24:Y24)*IF(Z24=\"SI\",1,2))","v":""}]
[null,null,null,null,null,null,null,null,{"$f":"$G$16/100*IF(H25>25,H25,25)","v":128.55099999999999},null,null,null,null,null,null,null,null,null,null,null,null,null,null,null,null,null,""]
[null,null,null,null,null,null,null,null,128.55099999999999,null,null,null,null,null,null,null,null,null,null,null,null,null,null,null,null,null,""]
[null,null,null,null,null,null,null,null,128.55099999999999,null,null,{"$f":"IF(F27=\"\",\"\",(K27-J27)*24)","v":""},{"$f":"IF(F27=\"\",\"\",ROUND((K27-J27)*24*60,0))","v":""},null,null,null,null,null,null,null,null,null,null,null,null,null,{"$f":"IF(F27=\"\",\"\",SUM(P27:Y27)*IF(Z27=\"SI\",1,2))","v":""}]
[]
[null,null,"(²)","F - FORZADA",null,null,null,null,null,null,null,null,null,null,null,{"$f":"SUM(P19:P28)","v":0},0,0,0,0,0,0,0,0,0,null,{"$f":"ROUND(SUM(AA19:AA28),2)","v":16867.57}]
[null,null,"FM :","Fuerza Mayor"]

{"sheet":"T-10 (1)","index":4,"n_rows":49,"n_cols":29,"rows_kept":49,"cut":false,"hidden":false,"merged":[]}
[]
[null,{"$f":"+'TOT-1015'!B2","v":"ANEXO I  al Memorandum   D.T.E.E. N°      356    / 2017"}]
[]
[" ENTE NACIONAL REGULADOR"]
["       DE LA ELECTRICIDAD"]
[]
[]
[null,null,null,null,null,"SISTEMA DE TRANSPORTE DE ENERGÍA ELÉCTRICA POR DISTRIBUCIÓN TRONCAL - TRANSNOA S.A."]
[]
[null,null,null,null,null,"2.- CONEXIÓN"]
[]
[null,null,null,null,null,"2.1.- Transformación"]
[]
[null,null,null,null,null,"2.1.1.- Equipamiento propio"]
[]
[null,{"$f":"'TOT-1015'!B14","v":"Desde el 01 al 31 de octubre de 2015"}]
[]
[null,null,null,null,null,"Por Transformador por MVA    $ =",null,null,1.79]
[null,null,null,null,null,"Coeficiente de penalización por salida forzada   =",null,null,{"$f":"30*'TOT-1015'!B13","v":30},null,{"$f":"IF(I19=30,\" \",IF(I19=60,\"  Coeficiente duplicado por tasa de falla >4 Sal. x año/100 km.\",\"REVISAR COEFICIENTE\"))","v":" "}]
[null,null,3,4,5,6,7,8,9,10,11,12,13,14,15,16,17,18,19,20,21,22,23,24,25,26,27,28,29]
[null,null,"N°","INDISP","ID EQUIPO","ESTACIÓN\nTRANSFORMADORA","EQUIPO","POT.\n[MVA]","U\n[kV]","$/h","Salida","Entrada","Hs\nIndisp.","Mtos.\nIndisp.","Tipo \nSal.(²)","AUT.","C.R.\n%","E.N.S.","K (P;ENS)","PENALIZ.\nPROGRAM.","REDUCC.\nPROGRAM.","PENALIZAC. FORZADA\nPor Salida       hs. Restantes",null,"REDUCC. FORZADA\nPor Salida       hs. Restantes",null,"RESTANTE\nFORZADA","REDUCC.\nRESTANTE","Informó\nen Térm.","TOTAL\nPENALIZAC."]
[]
[null,null,32,291078,4228,"SUNCHO CORRAL","TRP2",15,"132/33/13,2",{"$f":"H23*$I$18","v":26.85},"2015-10-01","2015-10-31T23:59:59",{"$f":"IF(F23=\"\",\"\",(L23-K23)*24)","v":743.99972222215729},{"$f":"IF(F23=\"\",\"\",ROUND((L23-K23)*24*60,0))","v":44640},"P",{"$f":"IF(F23=\"\",\"\",IF(OR(O23=\"P\",O23=\"RP\"),\"--\",\"NO\"))","v":"--"},"0,000","NO",{"$f":"$I$19*IF(R23=\"SI\",1,0.1)*IF(OR(O23=\"P\",O23=\"RP\"),0.1,1)","v":0.30000000000000004},{"$f":"IF(O23=\"P\",J23*S23*ROUND(N23/60,2),\"--\")","v":5992.920000000001},{"$f":"IF(O23=\"RP\",J23*S23*Q23/100*ROUND(N23/60,2),\"--\")","v":"--"},{"$f":"IF(AND(O23=\"F\",P23=\"NO\"),J23*S23,\"--\")","v":"--"},{"$f":"IF(O23=\"F\",J23*S23*ROUND(N23/60,2),\"--\")","v":"--"},{"$f":"IF(AND(O23=\"R\",P23=\"NO\"),J23*S23*Q23/100,\"--\")","v":"--"},{"$f":"IF(O23=\"R\",J23*S23*ROUND(N23/60,2)*Q23/100,\"--\")","v":"--"},{"$f":"IF(O23=\"RF\",J23*S23*ROUND(N23/60,2),\"--\")","v":"--"},{"$f":"IF(O23=\"RR\",J23*S23*ROUND(N23/60,2)*Q23/100,\"--\")","v":"--"},"SI",{"$f":"IF(F23=\"\",\"\",SUM(T23:AA23)*IF(AB23=\"SI\",1,2))","v":5992.920000000001}]
[null,null,33,291787,3580,"ANDALGALA","TRAFO 1",15,"132/33/13,2",26.85,"2015-10-01","2015-10-09T16:46:00",208.76666666666279,12526,"P","--","0,000","NO",0.30000000000000004,1681.6423500000003,"--","--","--","--","--","--","--","SI",1681.6423500000003]
[null,null,34,291878,562,"METAN ","TRAFO 1",7.5,"132/33/13,2",13.425000000000001,"2015-10-01","2015-10-31T23:59:59",743.99972222215729,44640,"P","--","0,000","NO",0.30000000000000004,2996.4600000000005,"--","--","--","--","--","--","--","SI",2996.4600000000005]
[]
[null,null,36,292902,556,"LA BANDA ","TRAFO 1",30,"132/33/13,2",53.7,"2015-10-01T08:35:00","2015-10-01T15:53:00",7.3000000000465661,438,"P","--","0,000","NO",0.30000000000000004,117.60300000000002,"--","--","--","--","--","--","--","SI",117.60300000000002]
[null,null,37,292903,5567,"ESTATICA","TRAFO 3",30,"132/13,2",53.7,"2015-10-01T09:09:00","2015-10-01T11:52:00",2.71666666661622,163,"P","--","0,000","NO",0.30000000000000004,43.819200000000009,"--","--","--","--","--","--","--","SI",43.819200000000009]
[null,null,38,292904,3836,"HUACRA ","TRAFO 1",15,"132/33/13,2",26.85,"2015-10-01T13:51:00","2015-10-01T17:40:00",3.8166666667093523,229,"R","NO",60,"NO",3,"--","--","--","--",48.330000000000013,184.62060000000002,"--","--","SI",232.95060000000004]
[null,null,39,292906,556,"LA BANDA ","TRAFO 1",30,"132/33/13,2",{"$f":"H30*$I$18","v":53.7},"2015-10-02T08:52:00","2015-10-02T16:31:00",{"$f":"IF(F30=\"\",\"\",(L30-K30)*24)","v":7.6500000001396984},{"$f":"IF(F30=\"\",\"\",ROUND((L30-K30)*24*60,0))","v":459},"P",{"$f":"IF(F30=\"\",\"\",IF(OR(O30=\"P\",O30=\"RP\"),\"--\",\"NO\"))","v":"--"},"0,000","NO",{"$f":"$I$19*IF(R30=\"SI\",1,0.1)*IF(OR(O30=\"P\",O30=\"RP\"),0.1,1)","v":0.30000000000000004},{"$f":"IF(O30=\"P\",J30*S30*ROUND(N30/60,2),\"--\")","v":123.24150000000003},{"$f":"IF(O30=\"RP\",J30*S30*Q30/100*ROUND(N30/60,2),\"--\")","v":"--"},{"$f":"IF(AND(O30=\"F\",P30=\"NO\"),J30*S30,\"--\")","v":"--"},{"$f":"IF(O30=\"F\",J30*S30*ROUND(N30/60,2),\"--\")","v":"--"},{"$f":"IF(AND(O30=\"R\",P30=\"NO\"),J30*S30*Q30/100,\"--\")","v":"--"},{"$f":"IF(O30=\"R\",J30*S30*ROUND(N30/60,2)*Q30/100,\"--\")","v":"--"},{"$f":"IF(O30=\"RF\",J30*S30*ROUND(N30/60,2),\"--\")","v":"--"},{"$f":"IF(O30=\"RR\",J30*S30*ROUND(N30/60,2)*Q30/100,\"--\")","v":"--"},"SI",{"$f":"IF(F30=\"\",\"\",SUM(T30:AA30)*IF(AB30=\"SI\",1,2))","v":123.24150000000003}]
[null,null,40,292907,4956,"LA PAZ","TRAFO 1",10,"132/33/13,2",17.899999999999999,"2015-10-04T08:25:00","2015-10-04T12:44:00",4.316666666592937,259,"P","--","0,000","NO",0.30000000000000004,23.198400000000003,"--","--","--","--","--","--","--","SI",23.198400000000003]
[null,null,41,292908,561,"LIBERTADOR JUJUY","TRP1",15,"132/33/13,2",26.85,"2015-10-04T09:28:00","2015-10-04T12:59:00",3.5166666667792015,211,"P","--","0,000","NO",0.30000000000000004,28.353600000000004,"--","--","--","--","--","--","--","SI",28.353600000000004]
[null,null,43,292980,2624,"TUCUMAN NORTE ","TRAFO 1",30,"132/33/13,2",53.7,"2015-10-05T10:51:00","2015-10-05T11:31:00",0.66666666674427688,40,"F","NO","0,000","SI",30,"--","--",1611,1079.3700000000001,"--","--","--","--","SI",2690.37]
[null,null,44,292981,1867,"TUCUMAN NORTE ","TRAFO 2",30,"132/33/13,2",53.7,"2015-10-05T10:51:00","2015-10-05T11:35:00",0.73333333345362917,44,"F","NO","0,000","SI",30,"--","--",1611,1176.03,"--","--","--","--","SI",2787.0299999999997]
[null,null,45,292997,5411,"CAMPO GALLO","TRAFO 1",15,"132/33/13,2",26.85,"2015-10-07T13:11:00","2015-10-07T19:54:00",6.7166666667326353,403,"P","--","0,000","SI",3,541.29600000000005,"--","--","--","--","--","--","--","SI",541.29600000000005]
[null,null,46,292998,5416,"CAMPO GALLO","TRAFO 2",15,"132/33/13,2",26.85,"2015-10-07T13:11:00","2015-10-07T19:54:00",6.7166666667326353,403,"P","--","0,000","SI",3,541.29600000000005,"--","--","--","--","--","--","--","SI",541.29600000000005]
[null,null,47,293031,3623,"BURRUYACU","TRAFO 1",15,"132/33/13,2",26.85,"2015-10-08T09:48:00","2015-10-08T12:56:00",3.1333333334187046,188,"P","--","0,000","NO",0.30000000000000004,25.212150000000005,"--","--","--","--","--","--","--","SI",25.212150000000005]
[null,null,48,293032,4867,"PICHANAL","TRAFO 1 (RESERV.)",30,"132/33/13,2",53.7,"2015-10-09T07:15:00","2015-10-09T08:16:00",1.0166666666627862,61,"RP","--",40,"NO",0.30000000000000004,"--",6.5728800000000014,"--","--","--","--","--","--","SI",6.5728800000000014]
[null,null,49,293033,3581,"ANDALGALA","TRAFO 2",15,"132/33/13,2",26.85,"2015-10-09T16:38:00","2015-10-09T16:55:00",0.28333333320915699,17,"F","NO","0,000","SI",30,"--","--",805.5,225.54000000000002,"--","--","--","--","SI",1031.04]
[null,null,50,293039,3581,"ANDALGALA","TRAFO 2",15,"132/33/13,2",26.85,"2015-10-09T16:55:00","2015-10-09T17:11:00",0.26666666666278616,16,"RF","NO","0,000","NO",3,"--","--","--","--","--","--",21.748500000000003,"--","SI",21.748500000000003]
[null,null,51,293040,5609,"SALTA SUR","TRAFO 6",30,"132/33/13,2",53.7,"2015-10-11T07:40:00","2015-10-11T08:53:00",1.21666666661622,73,"RP","--",60,"NO",0.30000000000000004,"--",11.792520000000003,"--","--","--","--","--","--","SI",11.792520000000003]
[null,null,52,293279,5609,"SALTA SUR","TRAFO 6",30,"132/33/13,2",53.7,"2015-10-12T07:33:00","2015-10-12T15:58:00",8.4166666666860692,505,"P","--","0,000","NO",0.30000000000000004,135.64620000000002,"--","--","--","--","--","--","--","SI",135.64620000000002]
[null,null,53,293285,5584,"FERNANDEZ","TRAFO 1",15,"132/33/13,2",26.85,"2015-10-13T10:47:00","2015-10-13T12:54:00",2.1166666665812954,127,"P","--","0,000","NO",0.30000000000000004,17.076600000000003,"--","--","--","--","--","--","--","SI",17.076600000000003]
[null,null,54,293287,3580,"ANDALGALA","TRAFO 1",15,"132/33/13,2",26.85,"2015-10-13T11:09:00","2015-10-20T14:55:00",171.76666666672099,10306,"P","--","0,000","NO",0.30000000000000004,1383.6073500000005,"--","--","--","--","--","--","--","SI",1383.6073500000005]
[null,null,55,293290,5003,"ANATUYA","TRAFO 2",15,"132/33/13,2",26.85,"2015-10-14T10:13:00","2015-10-14T17:28:00",{"$f":"IF(F45=\"\",\"\",(L45-K45)*24)","v":7.2500000000582077},{"$f":"IF(F45=\"\",\"\",ROUND((L45-K45)*24*60,0))","v":435},"P","--","0,000","NO",{"$f":"$I$19*IF(R45=\"SI\",1,0.1)*IF(OR(O45=\"P\",O45=\"RP\"),0.1,1)","v":0.30000000000000004},{"$f":"IF(O45=\"P\",J45*S45*ROUND(N45/60,2),\"--\")","v":58.398750000000014},{"$f":"IF(O45=\"RP\",J45*S45*Q45/100*ROUND(N45/60,2),\"--\")","v":"--"},{"$f":"IF(AND(O45=\"F\",P45=\"NO\"),J45*S45,\"--\")","v":"--"},{"$f":"IF(O45=\"F\",J45*S45*ROUND(N45/60,2),\"--\")","v":"--"},{"$f":"IF(AND(O45=\"R\",P45=\"NO\"),J45*S45*Q45/100,\"--\")","v":"--"},{"$f":"IF(O45=\"R\",J45*S45*ROUND(N45/60,2)*Q45/100,\"--\")","v":"--"},{"$f":"IF(O45=\"RF\",J45*S45*ROUND(N45/60,2),\"--\")","v":"--"},{"$f":"IF(O45=\"RR\",J45*S45*ROUND(N45/60,2)*Q45/100,\"--\")","v":"--"},"SI",{"$f":"IF(F45=\"\",\"\",SUM(T45:AA45)*IF(AB45=\"SI\",1,2))","v":58.398750000000014}]
[null,null,56,293298,4689,"ACONQUIJA","TRAFO 1",7.5,"132/33/13,2",13.425000000000001,"2015-10-14T16:57:00","2015-10-14T21:19:00",{"$f":"IF(F46=\"\",\"\",(L46-K46)*24)","v":4.3666666665812954},{"$f":"IF(F46=\"\",\"\",ROUND((L46-K46)*24*60,0))","v":262},"F","NO","0,000","SI",{"$f":"$I$19*IF(R46=\"SI\",1,0.1)*IF(OR(O46=\"P\",O46=\"RP\"),0.1,1)","v":30},{"$f":"IF(O46=\"P\",J46*S46*ROUND(N46/60,2),\"--\")","v":"--"},{"$f":"IF(O46=\"RP\",J46*S46*Q46/100*ROUND(N46/60,2),\"--\")","v":"--"},{"$f":"IF(AND(O46=\"F\",P46=\"NO\"),J46*S46,\"--\")","v":402.75},{"$f":"IF(O46=\"F\",J46*S46*ROUND(N46/60,2),\"--\")","v":1760.0175000000002},{"$f":"IF(AND(O46=\"R\",P46=\"NO\"),J46*S46*Q46/100,\"--\")","v":"--"},{"$f":"IF(O46=\"R\",J46*S46*ROUND(N46/60,2)*Q46/100,\"--\")","v":"--"},{"$f":"IF(O46=\"RF\",J46*S46*ROUND(N46/60,2),\"--\")","v":"--"},{"$f":"IF(O46=\"RR\",J46*S46*ROUND(N46/60,2)*Q46/100,\"--\")","v":"--"},"SI",{"$f":"IF(F46=\"\",\"\",SUM(T46:AA46)*IF(AB46=\"SI\",1,2))","v":2162.7674999999999}]
[null,null,57,293300,5003,"ANATUYA","TRAFO 2",15,"132/33/13,2",26.85,"2015-10-15T07:55:00","2015-10-15T16:42:00",{"$f":"IF(F47=\"\",\"\",(L47-K47)*24)","v":8.7833333333255723},{"$f":"IF(F47=\"\",\"\",ROUND((L47-K47)*24*60,0))","v":527},"P","--","0,000","NO",{"$f":"$I$19*IF(R47=\"SI\",1,0.1)*IF(OR(O47=\"P\",O47=\"RP\"),0.1,1)","v":0.30000000000000004},{"$f":"IF(O47=\"P\",J47*S47*ROUND(N47/60,2),\"--\")","v":70.72290000000001},{"$f":"IF(O47=\"RP\",J47*S47*Q47/100*ROUND(N47/60,2),\"--\")","v":"--"},{"$f":"IF(AND(O47=\"F\",P47=\"NO\"),J47*S47,\"--\")","v":"--"},{"$f":"IF(O47=\"F\",J47*S47*ROUND(N47/60,2),\"--\")","v":"--"},{"$f":"IF(AND(O47=\"R\",P47=\"NO\"),J47*S47*Q47/100,\"--\")","v":"--"},{"$f":"IF(O47=\"R\",J47*S47*ROUND(N47/60,2)*Q47/100,\"--\")","v":"--"},{"$f":"IF(O47=\"RF\",J47*S47*ROUND(N47/60,2),\"--\")","v":"--"},{"$f":"IF(O47=\"RR\",J47*S47*ROUND(N47/60,2)*Q47/100,\"--\")","v":"--"},"SI",{"$f":"IF(F47=\"\",\"\",SUM(T47:AA47)*IF(AB47=\"SI\",1,2))","v":70.72290000000001}]
[]
[null,null,"(²)","P - PROGRAMADA  ; F - FORZADA  ; R - REDUCCIÓN FORZADA  ; RP - REDUCCIÓN PROGRAMADA",null,null,null,null,null,null,null,null,null,null,null,null,null,null,null,{"$f":"SUM(T22:T48)","v":13780.494000000001},18.365400000000005,4430.25,4240.9575000000004,48.330000000000013,184.62060000000002,21.748500000000003,0,null,{"$f":"ROUND(SUM(AC22:AC48),2)","v":22724.77}]

{"sheet":"T-10 (2)","index":5,"n_rows":48,"n_cols":29,"rows_kept":48,"cut":false,"hidden":false,"merged":[]}
[]
[null,{"$f":"+'TOT-1015'!B2","v":"ANEXO I  al Memorandum   D.T.E.E. N°      356    / 2017"}]
[]
[" ENTE NACIONAL REGULADOR"]
["       DE LA ELECTRICIDAD"]
[]
[]
[null,null,null,null,null,"SISTEMA DE TRANSPORTE DE ENERGÍA ELÉCTRICA POR DISTRIBUCIÓN TRONCAL - TRANSNOA S.A."]
[]
[null,null,null,null,null,"2.- CONEXIÓN"]
[]
[null,null,null,null,null,"2.1.- Transformación"]
[]
[null,null,null,null,null,"2.1.1.- Equipamiento propio"]
[]
[null,{"$f":"'TOT-1015'!B14","v":"Desde el 01 al 31 de octubre de 2015"}]
[]
[null,null,null,null,null,"Por Transformador por MVA    $ =",null,null,1.79]
[null,null,null,null,null,"Coeficiente de penalización por salida forzada   =",null,null,{"$f":"30*'TOT-1015'!B13","v":30},null,{"$f":"IF(I19=30,\" \",IF(I19=60,\"  Coeficiente duplicado por tasa de falla >4 Sal. x año/100 km.\",\"REVISAR COEFICIENTE\"))","v":" "}]
[null,null,3,4,5,6,7,8,9,10,11,12,13,14,15,16,17,18,19,20,21,22,23,24,25,26,27,28,29]
[null,null,"N°","INDISP","ID EQUIPO","ESTACIÓN\nTRANSFORMADORA","EQUIPO","POT.\n[MVA]","U\n[kV]","$/h","Salida","Entrada","Hs\nIndisp.","Mtos.\nIndisp.","Tipo \nSal.(²)","AUT.","C.R.\n%","E.N.S.","K (P;ENS)","PENALIZ.\nPROGRAM.","REDUCC.\nPROGRAM.","PENALIZAC. FORZADA\nPor Salida       hs. Restantes",null,"REDUCC. FORZADA\nPor Salida       hs. Restantes",null,"RESTANTE\nFORZADA","REDUCC.\nRESTANTE","Informó\nen Térm.","TOTAL\nPENALIZAC."]
[null,null,null,null,null,null,null,null,null,null,null,null,null,null,null,null,null,null,null,null,null,null,null,null,null,null,null,null,{"$f":"'T-10 (1)'!AC49","v":22724.77}]
[]
[null,null,58,293302,5062,"QUIMILI","TRAFO 1",15,"132/33/13,2",{"$f":"H24*$I$18","v":26.85},"2015-10-15T10:18:00","2015-10-15T11:12:00",{"$f":"IF(F24=\"\",\"\",(L24-K24)*24)","v":0.8999999999650754},{"$f":"IF(F24=\"\",\"\",ROUND((L24-K24)*24*60,0))","v":54},"P",{"$f":"IF(F24=\"\",\"\",IF(OR(O24=\"P\",O24=\"RP\"),\"--\",\"NO\"))","v":"--"},"0,000","NO",{"$f":"$I$19*IF(R24=\"SI\",1,0.1)*IF(OR(O24=\"P\",O24=\"RP\"),0.1,1)","v":0.30000000000000004},{"$f":"IF(O24=\"P\",J24*S24*ROUND(N24/60,2),\"--\")","v":7.2495000000000012},{"$f":"IF(O24=\"RP\",J24*S24*Q24/100*ROUND(N24/60,2),\"--\")","v":"--"},{"$f":"IF(AND(O24=\"F\",P24=\"NO\"),J24*S24,\"--\")","v":"--"},{"$f":"IF(O24=\"F\",J24*S24*ROUND(N24/60,2),\"--\")","v":"--"},{"$f":"IF(AND(O24=\"R\",P24=\"NO\"),J24*S24*Q24/100,\"--\")","v":"--"},{"$f":"IF(O24=\"R\",J24*S24*ROUND(N24/60,2)*Q24/100,\"--\")","v":"--"},{"$f":"IF(O24=\"RF\",J24*S24*ROUND(N24/60,2),\"--\")","v":"--"},{"$f":"IF(O24=\"RR\",J24*S24*ROUND(N24/60,2)*Q24/100,\"--\")","v":"--"},"SI",{"$f":"IF(F24=\"\",\"\",SUM(T24:AA24)*IF(AB24=\"SI\",1,2))","v":7.2495000000000012}]
[null,null,59,293303,3947,"CATAMARCA ","TRAFO 2",30,"132/33/13,2",{"$f":"H25*$I$18","v":53.7},"2015-10-16T08:06:00","2015-10-16T09:25:00",{"$f":"IF(F25=\"\",\"\",(L25-K25)*24)","v":1.316666666592937},{"$f":"IF(F25=\"\",\"\",ROUND((L25-K25)*24*60,0))","v":79},"P",{"$f":"IF(F25=\"\",\"\",IF(OR(O25=\"P\",O25=\"RP\"),\"--\",\"NO\"))","v":"--"},"0,000","NO",{"$f":"$I$19*IF(R25=\"SI\",1,0.1)*IF(OR(O25=\"P\",O25=\"RP\"),0.1,1)","v":0.30000000000000004},{"$f":"IF(O25=\"P\",J25*S25*ROUND(N25/60,2),\"--\")","v":21.265200000000004},{"$f":"IF(O25=\"RP\",J25*S25*Q25/100*ROUND(N25/60,2),\"--\")","v":"--"},{"$f":"IF(AND(O25=\"F\",P25=\"NO\"),J25*S25,\"--\")","v":"--"},{"$f":"IF(O25=\"F\",J25*S25*ROUND(N25/60,2),\"--\")","v":"--"},{"$f":"IF(AND(O25=\"R\",P25=\"NO\"),J25*S25*Q25/100,\"--\")","v":"--"},{"$f":"IF(O25=\"R\",J25*S25*ROUND(N25/60,2)*Q25/100,\"--\")","v":"--"},{"$f":"IF(O25=\"RF\",J25*S25*ROUND(N25/60,2),\"--\")","v":"--"},{"$f":"IF(O25=\"RR\",J25*S25*ROUND(N25/60,2)*Q25/100,\"--\")","v":"--"},"SI",{"$f":"IF(F25=\"\",\"\",SUM(T25:AA25)*IF(AB25=\"SI\",1,2))","v":21.265200000000004}]
[null,null,60,293304,3694,"SANTIAGO CENTRO ","TRAFO 1",30,"132/33/13,2",53.7,"2015-10-17T06:16:00","2015-10-17T10:26:00",4.1666666666278616,250,"P","--","0,000","NO",0.30000000000000004,67.178700000000006,"--","--","--","--","--","--","--","SI",67.178700000000006]
[null,null,61,293305,3105,"SANTIAGO CENTRO ","TRAFO 2",30,"132/33/13,2",53.7,"2015-10-17T06:17:00","2015-10-17T10:26:00",4.1499999999068677,249,"P","--","0,000","NO",0.30000000000000004,66.856500000000011,"--","--","--","--","--","--","--","SI",66.856500000000011]
[null,null,62,293309,563,"METAN ","TRAFO 2",7.5,"132/33/13,2",13.425000000000001,"2015-10-17T08:33:00","2015-10-17T08:43:00",0.16666666668606922,10,"F","NO","0,000","SI",30,"--","--",402.75,68.467500000000001,"--","--","--","--","SI",471.21749999999997]
[null,null,63,293312,579,"SARMIENTO ","TRAFO 2",30,"132/13,2",53.7,"2015-10-17T09:26:00","2015-10-17T14:45:00",5.3166666667093523,319,"F","NO","0,000","NO",3,"--","--",161.10000000000002,857.05200000000013,"--","--","--","--","SI",1018.1520000000002]
[null,null,64,293313,5264,"SARMIENTO ","TRAFO 3",30,"132/33/13,2",53.7,"2015-10-17T09:38:00","2015-10-17T14:43:00",5.0833333333139308,305,"F","NO","0,000","NO",3,"--","--",161.10000000000002,818.38800000000015,"--","--","--","--","SI",979.48800000000017]
[null,null,65,293314,2668,"JUJUY ESTE","TRAFO 1",15,"132/33/13,2",26.85,"2015-10-18T08:53:00","2015-10-18T10:29:00",1.5999999999767169,96,"P","--","0,000","NO",0.30000000000000004,12.888000000000003,"--","--","--","--","--","--","--","SI",12.888000000000003]
[null,null,66,294360,5691,"JUJUY ESTE","TRAFO 3",30,"132/33/13,2",53.7,"2015-10-18T08:53:00","2015-10-18T10:29:00",1.5999999999767169,96,"P","--","0,000","NO",0.30000000000000004,25.776000000000007,"--","--","--","--","--","--","--","SI",25.776000000000007]
[null,null,67,293455,557,"LA BANDA ","TRAFO 2",30,"132/33/13,2",53.7,"2015-10-19T08:15:00","2015-10-19T15:55:00",7.6666666666860692,460,"P","--","0,000","NO",0.30000000000000004,123.56370000000003,"--","--","--","--","--","--","--","SI",123.56370000000003]
[null,null,68,293457,4956,"LA PAZ","TRAFO 1",10,"132/33/13,2",17.899999999999999,"2015-10-19T12:37:00","2015-10-19T13:00:00",0.38333333336049691,23,"R","NO",60,"SI",30,"--","--","--","--",322.2,122.43600000000001,"--","--","SI",444.63599999999997]
[null,null,69,293461,4896,"BANDERA","TRAFO 1",15,"132/33/13,2",26.85,"2015-10-19T14:23:00","2015-10-19T14:40:00",0.28333333320915699,17,"RP","--",60,"NO",0.30000000000000004,"--",1.3532400000000004,"--","--","--","--","--","--","SI",1.3532400000000004]
[null,null,70,293462,4897,"BANDERA","TRAFO 2",15,"132/33/13,2",26.85,"2015-10-19T14:50:00","2015-10-19T15:02:00",0.19999999995343387,12,"RP","--",60,"NO",0.30000000000000004,"--",0.96660000000000024,"--","--","--","--","--","--","SI",0.96660000000000024]
[null,null,71,293465,3819,"BELEN","TRAFO 2",7.5,"132/33/13,2",13.425000000000001,"2015-10-19T16:09:00","2015-10-19T16:11:00",3.3333333267364651E-2,2,"F","NO","0,000","SI",30,"--","--",402.75,12.0825,"--","--","--","--","SI",414.83249999999998]
[null,null,72,293466,557,"LA BANDA ","TRAFO 2",30,"132/33/13,2",53.7,"2015-10-20T08:16:00","2015-10-20T15:47:00",7.5166666665463708,451,"P","--","0,000","NO",0.30000000000000004,121.14720000000001,"--","--","--","--","--","--","--","SI",121.14720000000001]
[null,null,73,293467,4768,"LULES","TRAFO 1",15,"132/33/13,2",26.85,"2015-10-20T08:30:00","2015-10-20T11:30:00",3,180,"P","--","0,000","NO",0.30000000000000004,24.165000000000006,"--","--","--","--","--","--","--","SI",24.165000000000006]
[null,null,74,293468,534,"AGUILARES ","TRAFO 2",15,"132/33/13,2",26.85,"2015-10-20T10:02:00","2015-10-20T13:29:00",3.4499999998952262,207,"P","--","0,000","NO",0.30000000000000004,27.789750000000005,"--","--","--","--","--","--","--","SI",27.789750000000005]
[null,null,75,293470,4484,"AGUA BLANCA","TRP1",30,"132/33/13,2",53.7,"2015-10-21T08:49:00","2015-10-21T13:08:00",{"$f":"IF(F41=\"\",\"\",(L41-K41)*24)","v":4.3166666667675599},{"$f":"IF(F41=\"\",\"\",ROUND((L41-K41)*24*60,0))","v":259},"P","--","0,000","NO",{"$f":"$I$19*IF(R41=\"SI\",1,0.1)*IF(OR(O41=\"P\",O41=\"RP\"),0.1,1)","v":0.30000000000000004},{"$f":"IF(O41=\"P\",J41*S41*ROUND(N41/60,2),\"--\")","v":69.59520000000002},{"$f":"IF(O41=\"RP\",J41*S41*Q41/100*ROUND(N41/60,2),\"--\")","v":"--"},{"$f":"IF(AND(O41=\"F\",P41=\"NO\"),J41*S41,\"--\")","v":"--"},{"$f":"IF(O41=\"F\",J41*S41*ROUND(N41/60,2),\"--\")","v":"--"},{"$f":"IF(AND(O41=\"R\",P41=\"NO\"),J41*S41*Q41/100,\"--\")","v":"--"},{"$f":"IF(O41=\"R\",J41*S41*ROUND(N41/60,2)*Q41/100,\"--\")","v":"--"},{"$f":"IF(O41=\"RF\",J41*S41*ROUND(N41/60,2),\"--\")","v":"--"},{"$f":"IF(O41=\"RR\",J41*S41*ROUND(N41/60,2)*Q41/100,\"--\")","v":"--"},"SI",{"$f":"IF(F41=\"\",\"\",SUM(T41:AA41)*IF(AB41=\"SI\",1,2))","v":69.59520000000002}]
[null,null,76,293472,5584,"FERNANDEZ","TRAFO 1",15,"132/33/13,2",26.85,"2015-10-22T08:10:00","2015-10-22T11:40:00",3.4999999998835847,210,"P","--","0,000","NO",0.30000000000000004,28.192500000000006,"--","--","--","--","--","--","--","SI",28.192500000000006]
[null,null,77,294005,4993,"PALPALA","TRAFO 2",15,"132/33/13,2",26.85,"2015-10-28T08:25:00","2015-10-31T23:59:59",87.583055555471219,5255,"P","--","0,000","NO",0.30000000000000004,705.45690000000013,"--","--","--","--","--","--","--","SI",705.45690000000013]
[null,null,78,294007,5570,"SANTIAGO ESTE ","TRAFO 2",30,"132/13,2",53.7,"2015-10-29T08:18:00","2015-10-29T11:07:00",2.816666666592937,169,"P",{"$f":"IF(F44=\"\",\"\",IF(OR(O44=\"P\",O44=\"RP\"),\"--\",\"NO\"))","v":"--"},"0,000","NO",0.30000000000000004,45.430200000000006,"--","--","--","--","--","--","--","SI",45.430200000000006]
[null,null,79,294009,4956,"LA PAZ","TRAFO 1",10,"132/33/13,2",17.899999999999999,"2015-10-29T13:38:00","2015-10-29T13:42:00",6.6666666534729302E-2,4,"R",{"$f":"IF(F45=\"\",\"\",IF(OR(O45=\"P\",O45=\"RP\"),\"--\",\"NO\"))","v":"NO"},40,"SI",30,"--","--","--","--",214.8,15.036000000000001,"--","--","SI",229.83600000000001]
[null,null,80,294016,4956,"LA PAZ","TRAFO 1",10,"132/33/13,2",17.899999999999999,"2015-10-30T08:29:00","2015-10-30T08:37:00",0.13333333324408159,8,"R",{"$f":"IF(F46=\"\",\"\",IF(OR(O46=\"P\",O46=\"RP\"),\"--\",\"NO\"))","v":"NO"},60,"SI",30,"--","--","--","--",322.2,41.886000000000003,"--","--","SI",364.08600000000001]
[]
[null,null,"(²)","P - PROGRAMADA  ; F - FORZADA  ; R - REDUCCIÓN FORZADA  ; RP - REDUCCIÓN PROGRAMADA",null,null,null,null,null,null,null,null,null,null,null,null,null,null,null,{"$f":"SUM(T22:T47)","v":1346.5543500000001},2.3198400000000006,1127.7,1755.9900000000002,859.2,179.358,0,0,null,{"$f":"ROUND(SUM(AC22:AC47),2)","v":27995.89}]

{"sheet":"SA-10 (1)","index":6,"n_rows":44,"n_cols":22,"rows_kept":44,"cut":false,"hidden":false,"merged":[]}
[]
[null,{"$f":"+'TOT-1015'!B2","v":"ANEXO I  al Memorandum   D.T.E.E. N°      356    / 2017"}]
[]
[" ENTE NACIONAL REGULADOR"]
["       DE LA ELECTRICIDAD"]
[]
[]
[null,null,null,null,null,"SISTEMA DE TRANSPORTE DE ENERGÍA ELÉCTRICA POR DISTRIBUCIÓN TRONCAL -  TRANSNOA S.A."]
[]
[null,null,null,null,null,"2.2.- Salidas"]
[]
[null,null,null,null,null,"2.2.1.- Equipamiento propio"]
[]
[null,{"$f":"'TOT-1015'!B14","v":"Desde el 01 al 31 de octubre de 2015"}]
[]
[null,null,null,null,null,"Salida en 132 kV o 66 kV = ",23.905000000000001,{"$f":"50*'TOT-1015'!B13","v":50},null,{"$f":"IF(H16=50,\" \",IF(H16=100,\"  Coeficiente duplicado por tasa de falla >4 Sal. x año/100 km.\",\"REVISAR COEFICIENTE\"))","v":" "}]
[null,null,null,null,null,"Salida en 33 kV ",17.934999999999999,{"$f":"25*'TOT-1015'!B13","v":25},null,{"$f":"IF(H17=25,\" \",IF(H17=50,\"  Coeficiente duplicado por tasa de falla >4 Sal. x año/100 km.\",\"REVISAR COEFICIENTE\"))","v":" "}]
[null,null,null,null,null,"Salida en 13,2 kV =",17.934999999999999,{"$f":"20*'TOT-1015'!B13","v":20},null,{"$f":"IF(H18=20,\" \",IF(H18=40,\"  Coeficiente duplicado por tasa de falla >4 Sal. x año/100 km.\",\"REVISAR COEFICIENTE\"))","v":" "}]
[null,null,3,4,5,6,7,8,9,10,11,12,13,14,15,16,17,18,19,20,21,22]
[null,null,"N°","INDISP","ID EQUIPO","ESTACIÓN\nTRANSFORMADORA","EQUIPO","U\n[kV]","$/h","Salida","Entrada","Hs.\nIndisp.","Mtos.\nIndisp.","Tipo \nSal.(²)","AUT.","K","PENALIZ.\nPROGRAM.","PENALIZAC. FORZADA\nPor Salida       hs. Restantes",null,"RESTANTE\nFORZADA","Informó\nen Térm.","TOTAL\nPENALIZAC."]
[]
[]
[null,null,81,292999,5417,"CAMPO GALLO","SALIDA 1",13.2,{"$f":"IF(OR(H23=132,H23=66),$G$16,IF(H23=33,$G$17,$G$18))","v":17.934999999999999},"2015-10-07T13:11:00","2015-10-07T19:54:00",{"$f":"IF(F23=\"\",\"\",(K23-J23)*24)","v":6.7166666667326353},{"$f":"IF(F23=\"\",\"\",ROUND((K23-J23)*24*60,0))","v":403},"P",{"$f":"IF(F23=\"\",\"\",IF(OR(N23=\"P\",N23=\"RP\"),\"--\",\"NO\"))","v":"--"},{"$f":"IF(H23>33,$H$16,IF(H23=33,$H$17,$H$18))","v":20},{"$f":"IF(N23=\"P\",I23*P23*ROUND(M23/60,2)*0.1,\"--\")","v":241.04640000000001},{"$f":"IF(AND(N23=\"F\",O23=\"NO\"),I23*P23,\"--\")","v":"--"},{"$f":"IF(N23=\"F\",I23*P23*ROUND(M23/60,2),\"--\")","v":"--"},{"$f":"IF(N23=\"RF\",I23*P23*ROUND(M23/60,2),\"--\")","v":"--"},"SI",{"$f":"IF(F23=\"\",\"\",SUM(Q23:T23)*IF(U23=\"SI\",1,2)*IF(H23=\"500/220\",0,1))","v":241.04640000000001}]
[null,null,82,293000,5418,"CAMPO GALLO","SALIDA 4",13.2,17.934999999999999,"2015-10-07T13:11:00","2015-10-07T19:54:00",6.7166666667326353,403,"P","--",20,241.04640000000001,"--","--","--","SI",241.04640000000001]
[null,null,83,293001,5419,"CAMPO GALLO","SALIDA A TINTINA",33,17.934999999999999,"2015-10-07T13:11:00","2015-10-07T19:54:00",6.7166666667326353,403,"P","--",25,301.30799999999994,"--","--","--","SI",301.30799999999994]
[null,null,84,293002,5420,"CAMPO GALLO","SALIDA A SACHA",33,17.934999999999999,"2015-10-07T13:11:00","2015-10-07T19:54:00",6.7166666667326353,403,"P","--",25,301.30799999999994,"--","--","--","SI",301.30799999999994]
[null,null,null,null,null,null,null,null,null,null,null,null,null,null,{"$f":"IF(F27=\"\",\"\",IF(OR(N27=\"P\",N27=\"RP\"),\"--\",\"NO\"))","v":""},{"$f":"IF(H27>33,$H$16,IF(H27=33,$H$17,$H$18))","v":20},{"$f":"IF(N27=\"P\",I27*P27*ROUND(M27/60,2)*0.1,\"--\")","v":"--"},{"$f":"IF(AND(N27=\"F\",O27=\"NO\"),I27*P27,\"--\")","v":"--"},{"$f":"IF(N27=\"F\",I27*P27*ROUND(M27/60,2),\"--\")","v":"--"},{"$f":"IF(N27=\"RF\",I27*P27*ROUND(M27/60,2),\"--\")","v":"--"},{"$f":"IF(F27=\"\",\"\",\"SI\")","v":""}]
[null,null,null,null,null,null,null,null,null,null,null,null,null,null,"",20,"--","--","--","--",""]
[null,null,null,null,null,null,null,null,null,null,null,null,null,null,"",20,"--","--","--","--",""]
[null,null,null,null,null,null,null,null,null,null,null,null,null,null,"",20,"--","--","--","--",""]
[null,null,null,null,null,null,null,null,null,null,null,null,null,null,"",20,"--","--","--","--",""]
[null,null,null,null,null,null,null,null,null,null,null,null,null,null,"",20,"--","--","--","--",""]
[null,null,null,null,null,null,null,null,17.934999999999999,null,null,"","",null,"",20,"--","--","--","--",{"$f":"IF(F33=\"\",\"\",\"SI\")","v":""},""]
[null,null,null,null,null,null,null,null,17.934999999999999,null,null,"","",null,"",20,"--","--","--","--","",""]
[null,null,null,null,null,null,null,null,17.934999999999999,null,null,"","",null,"",20,"--","--","--","--","",""]
[null,null,null,null,null,null,null,null,17.934999999999999,null,null,"","",null,"",20,"--","--","--","--","",""]
[null,null,null,null,null,null,null,null,17.934999999999999,null,null,"","",null,"",20,"--","--","--","--","",""]
[null,null,null,null,null,null,null,null,17.934999999999999,null,null,"","",null,"",20,"--","--","--","--","",""]
[null,null,null,null,null,null,null,null,17.934999999999999,null,null,"","",null,"",20,"--","--","--","--","",""]
[null,null,null,null,null,null,null,null,17.934999999999999,null,null,{"$f":"IF(F40=\"\",\"\",(K40-J40)*24)","v":""},{"$f":"IF(F40=\"\",\"\",ROUND((K40-J40)*24*60,0))","v":""},null,"",{"$f":"IF(H40>33,$H$16,IF(H40=33,$H$17,$H$18))","v":20},{"$f":"IF(N40=\"P\",I40*P40*ROUND(M40/60,2)*0.1,\"--\")","v":"--"},{"$f":"IF(AND(N40=\"F\",O40=\"NO\"),I40*P40,\"--\")","v":"--"},{"$f":"IF(N40=\"F\",I40*P40*ROUND(M40/60,2),\"--\")","v":"--"},{"$f":"IF(N40=\"RF\",I40*P40*ROUND(M40/60,2),\"--\")","v":"--"},{"$f":"IF(F40=\"\",\"\",\"SI\")","v":""},{"$f":"IF(F40=\"\",\"\",SUM(Q40:T40)*IF(U40=\"SI\",1,2)*IF(H40=\"500/220\",0,1))","v":""}]
[null,null,null,null,null,null,null,null,17.934999999999999,null,null,{"$f":"IF(F41=\"\",\"\",(K41-J41)*24)","v":""},{"$f":"IF(F41=\"\",\"\",ROUND((K41-J41)*24*60,0))","v":""},null,"",{"$f":"IF(H41>33,$H$16,IF(H41=33,$H$17,$H$18))","v":20},{"$f":"IF(N41=\"P\",I41*P41*ROUND(M41/60,2)*0.1,\"--\")","v":"--"},{"$f":"IF(AND(N41=\"F\",O41=\"NO\"),I41*P41,\"--\")","v":"--"},{"$f":"IF(N41=\"F\",I41*P41*ROUND(M41/60,2),\"--\")","v":"--"},{"$f":"IF(N41=\"RF\",I41*P41*ROUND(M41/60,2),\"--\")","v":"--"},{"$f":"IF(F41=\"\",\"\",\"SI\")","v":""},{"$f":"IF(F41=\"\",\"\",SUM(Q41:T41)*IF(U41=\"SI\",1,2)*IF(H41=\"500/220\",0,1))","v":""}]
[null,null,null,null,null,null,null,null,17.934999999999999,null,null,{"$f":"IF(F42=\"\",\"\",(K42-J42)*24)","v":""},{"$f":"IF(F42=\"\",\"\",ROUND((K42-J42)*24*60,0))","v":""},null,"",{"$f":"IF(H42>33,$H$16,IF(H42=33,$H$17,$H$18))","v":20},{"$f":"IF(N42=\"P\",I42*P42*ROUND(M42/60,2)*0.1,\"--\")","v":"--"},{"$f":"IF(AND(N42=\"F\",O42=\"NO\"),I42*P42,\"--\")","v":"--"},{"$f":"IF(N42=\"F\",I42*P42*ROUND(M42/60,2),\"--\")","v":"--"},{"$f":"IF(N42=\"RF\",I42*P42*ROUND(M42/60,2),\"--\")","v":"--"},{"$f":"IF(F42=\"\",\"\",\"SI\")","v":""},{"$f":"IF(F42=\"\",\"\",SUM(Q42:T42)*IF(U42=\"SI\",1,2)*IF(H42=\"500/220\",0,1))","v":""}]
[]
[null,null,"(²)","P - PROGRAMADA ",null,null,null,null,null,null,null,null,null,null,null,null,{"$f":"SUM(Q21:Q43)","v":1084.7087999999999},{"$f":"SUM(R21:R43)","v":0},{"$f":"SUM(S21:S43)","v":0},{"$f":"SUM(T21:T43)","v":0},null,{"$f":"ROUND(SUM(V21:V43),2)","v":1084.71}]

{"sheet":"Tasa de Falla","index":7,"n_rows":153,"n_cols":19,"rows_kept":153,"cut":false,"hidden":false,"merged":[[2,0,2,2],[3,0,3,2],[152,11,152,12]]}
[]
[null,{"$f":"'TOT-1015'!B2","v":"ANEXO I  al Memorandum   D.T.E.E. N°      356    / 2017"}]
["ENTE NACIONAL REGULADOR "]
["DE LA ELECTRICIDAD"]
[]
[null,"SISTEMA DE TRANSPORTE DE ENERGÍA ELÉCTRICA POR DISTRIBUCIÓN TRONCAL "]
[]
[null,"TRANSNOA S.A."]
[]
[null,"INDISPONIBILIDADES FORZADAS DE LÍNEAS - TASA DE FALLA"]
[]
[]
[null,"y",null,{"$f":"'TOT-1015'!B14","v":"Desde el 01 al 31 de octubre de 2015"}]
[]
[null,null,"N°","LÍNEAS","U\n[kV]","Long.\n[km]","2014-10-01","2014-11-01","2014-12-01","2015-01-01","2015-02-01","2015-03-01","2015-04-01","2015-05-01","2015-06-01","2015-07-01","2015-08-01","2015-09-01","2015-10-01"]
[]
[null,null,{"$f":"'[3]Tasa de Falla'!C17","v":1},{"$f":"'[3]Tasa de Falla'!D17","v":"AGUA BLANCA - VILLA QUINTEROS"},{"$f":"'[3]Tasa de Falla'!E17","v":132},{"$f":"'[3]Tasa de Falla'!F17","v":23.8},{"$f":"IF('[3]Tasa de Falla'!IQ17=0,\"\",'[3]Tasa de Falla'!IQ17)","v":""},{"$f":"IF('[3]Tasa de Falla'!IR17=0,\"\",'[3]Tasa de Falla'!IR17)","v":""},{"$f":"IF('[3]Tasa de Falla'!IS17=0,\"\",'[3]Tasa de Falla'!IS17)","v":""},{"$f":"IF('[3]Tasa de Falla'!IT17=0,\"\",'[3]Tasa de Falla'!IT17)","v":""},{"$f":"IF('[3]Tasa de Falla'!IU17=0,\"\",'[3]Tasa de Falla'!IU17)","v":""},{"$f":"IF('[3]Tasa de Falla'!IV17=0,\"\",'[3]Tasa de Falla'!IV17)","v":""},{"$f":"IF('[3]Tasa de Falla'!IW17=0,\"\",'[3]Tasa de Falla'!IW17)","v":""},{"$f":"IF('[3]Tasa de Falla'!IX17=0,\"\",'[3]Tasa de Falla'!IX17)","v":""},{"$f":"IF('[3]Tasa de Falla'!IY17=0,\"\",'[3]Tasa de Falla'!IY17)","v":""},{"$f":"IF('[3]Tasa de Falla'!IZ17=0,\"\",'[3]Tasa de Falla'!IZ17)","v":""},{"$f":"IF('[3]Tasa de Falla'!JA17=0,\"\",'[3]Tasa de Falla'!JA17)","v":""},{"$f":"IF('[3]Tasa de Falla'!JB17=0,\"\",'[3]Tasa de Falla'!JB17)","v":""}]
[null,null,{"$f":"'[3]Tasa de Falla'!C18","v":2},{"$f":"'[3]Tasa de Falla'!D18","v":"AGUILARES - ESCABA"},{"$f":"'[3]Tasa de Falla'!E18","v":132},{"$f":"'[3]Tasa de Falla'!F18","v":27},{"$f":"IF('[3]Tasa de Falla'!IQ18=0,\"\",'[3]Tasa de Falla'!IQ18)","v":""},{"$f":"IF('[3]Tasa de Falla'!IR18=0,\"\",'[3]Tasa de Falla'!IR18)","v":""},{"$f":"IF('[3]Tasa de Falla'!IS18=0,\"\",'[3]Tasa de Falla'!IS18)","v":""},{"$f":"IF('[3]Tasa de Falla'!IT18=0,\"\",'[3]Tasa de Falla'!IT18)","v":""},{"$f":"IF('[3]Tasa de Falla'!IU18=0,\"\",'[3]Tasa de Falla'!IU18)","v":""},{"$f":"IF('[3]Tasa de Falla'!IV18=0,\"\",'[3]Tasa de Falla'!IV18)","v":""},{"$f":"IF('[3]Tasa de Falla'!IW18=0,\"\",'[3]Tasa de Falla'!IW18)","v":""},{"$f":"IF('[3]Tasa de Falla'!IX18=0,\"\",'[3]Tasa de Falla'!IX18)","v":""},{"$f":"IF('[3]Tasa de Falla'!IY18=0,\"\",'[3]Tasa de Falla'!IY18)","v":""},{"$f":"IF('[3]Tasa de Falla'!IZ18=0,\"\",'[3]Tasa de Falla'!IZ18)","v":""},{"$f":"IF('[3]Tasa de Falla'!JA18=0,\"\",'[3]Tasa de Falla'!JA18)","v":2},{"$f":"IF('[3]Tasa de Falla'!JB18=0,\"\",'[3]Tasa de Falla'!JB18)","v":""}]
[null,null,{"$f":"'[3]Tasa de Falla'!C19","v":3},{"$f":"'[3]Tasa de Falla'!D19","v":"CABRA CORRAL - SALTA SUR"},{"$f":"'[3]Tasa de Falla'!E19","v":132},{"$f":"'[3]Tasa de Falla'!F19","v":62},{"$f":"IF('[3]Tasa de Falla'!IQ19=0,\"\",'[3]Tasa de Falla'!IQ19)","v":"XXXX"},{"$f":"IF('[3]Tasa de Falla'!IR19=0,\"\",'[3]Tasa de Falla'!IR19)","v":"XXXX"},{"$f":"IF('[3]Tasa de Falla'!IS19=0,\"\",'[3]Tasa de Falla'!IS19)","v":"XXXX"},{"$f":"IF('[3]Tasa de Falla'!IT19=0,\"\",'[3]Tasa de Falla'!IT19)","v":"XXXX"},{"$f":"IF('[3]Tasa de Falla'!IU19=0,\"\",'[3]Tasa de Falla'!IU19)","v":"XXXX"},{"$f":"IF('[3]Tasa de Falla'!IV19=0,\"\",'[3]Tasa de Falla'!IV19)","v":"XXXX"},{"$f":"IF('[3]Tasa de Falla'!IW19=0,\"\",'[3]Tasa de Falla'!IW19)","v":"XXXX"},{"$f":"IF('[3]Tasa de Falla'!IX19=0,\"\",'[3]Tasa de Falla'!IX19)","v":"XXXX"},{"$f":"IF('[3]Tasa de Falla'!IY19=0,\"\",'[3]Tasa de Falla'!IY19)","v":"XXXX"},{"$f":"IF('[3]Tasa de Falla'!IZ19=0,\"\",'[3]Tasa de Falla'!IZ19)","v":"XXXX"},{"$f":"IF('[3]Tasa de Falla'!JA19=0,\"\",'[3]Tasa de Falla'!JA19)","v":"XXXX"},{"$f":"IF('[3]Tasa de Falla'!JB19=0,\"\",'[3]Tasa de Falla'!JB19)","v":"XXXX"}]
[null,null,{"$f":"'[3]Tasa de Falla'!C20","v":4},{"$f":"'[3]Tasa de Falla'!D20","v":"CEVIL POZO - TUCUMAN NORTE"},{"$f":"'[3]Tasa de Falla'!E20","v":132},{"$f":"'[3]Tasa de Falla'!F20","v":14.5},{"$f":"IF('[3]Tasa de Falla'!IQ20=0,\"\",'[3]Tasa de Falla'!IQ20)","v":""},{"$f":"IF('[3]Tasa de Falla'!IR20=0,\"\",'[3]Tasa de Falla'!IR20)","v":""},{"$f":"IF('[3]Tasa de Falla'!IS20=0,\"\",'[3]Tasa de Falla'!IS20)","v":""},{"$f":"IF('[3]Tasa de Falla'!IT20=0,\"\",'[3]Tasa de Falla'!IT20)","v":""},{"$f":"IF('[3]Tasa de Falla'!IU20=0,\"\",'[3]Tasa de Falla'!IU20)","v":""},{"$f":"IF('[3]Tasa de Falla'!IV20=0,\"\",'[3]Tasa de Falla'!IV20)","v":""},{"$f":"IF('[3]Tasa de Falla'!IW20=0,\"\",'[3]Tasa de Falla'!IW20)","v":""},{"$f":"IF('[3]Tasa de Falla'!IX20=0,\"\",'[3]Tasa de Falla'!IX20)","v":""},{"$f":"IF('[3]Tasa de Falla'!IY20=0,\"\",'[3]Tasa de Falla'!IY20)","v":""},{"$f":"IF('[3]Tasa de Falla'!IZ20=0,\"\",'[3]Tasa de Falla'!IZ20)","v":""},{"$f":"IF('[3]Tasa de Falla'!JA20=0,\"\",'[3]Tasa de Falla'!JA20)","v":""},{"$f":"IF('[3]Tasa de Falla'!JB20=0,\"\",'[3]Tasa de Falla'!JB20)","v":""}]
[null,null,{"$f":"'[3]Tasa de Falla'!C21","v":5},{"$f":"'[3]Tasa de Falla'!D21","v":"CAMPO SANTO - MINETTI"},{"$f":"'[3]Tasa de Falla'!E21","v":132},{"$f":"'[3]Tasa de Falla'!F21","v":29.9},{"$f":"IF('[3]Tasa de Falla'!IQ21=0,\"\",'[3]Tasa de Falla'!IQ21)","v":"XXXX"},{"$f":"IF('[3]Tasa de Falla'!IR21=0,\"\",'[3]Tasa de Falla'!IR21)","v":"XXXX"},{"$f":"IF('[3]Tasa de Falla'!IS21=0,\"\",'[3]Tasa de Falla'!IS21)","v":"XXXX"},{"$f":"IF('[3]Tasa de Falla'!IT21=0,\"\",'[3]Tasa de Falla'!IT21)","v":"XXXX"},{"$f":"IF('[3]Tasa de Falla'!IU21=0,\"\",'[3]Tasa de Falla'!IU21)","v":"XXXX"},{"$f":"IF('[3]Tasa de Falla'!IV21=0,\"\",'[3]Tasa de Falla'!IV21)","v":"XXXX"},{"$f":"IF('[3]Tasa de Falla'!IW21=0,\"\",'[3]Tasa de Falla'!IW21)","v":"XXXX"},{"$f":"IF('[3]Tasa de Falla'!IX21=0,\"\",'[3]Tasa de Falla'!IX21)","v":"XXXX"},{"$f":"IF('[3]Tasa de Falla'!IY21=0,\"\",'[3]Tasa de Falla'!IY21)","v":"XXXX"},{"$f":"IF('[3]Tasa de Falla'!IZ21=0,\"\",'[3]Tasa de Falla'!IZ21)","v":"XXXX"},{"$f":"IF('[3]Tasa de Falla'!JA21=0,\"\",'[3]Tasa de Falla'!JA21)","v":"XXXX"},{"$f":"IF('[3]Tasa de Falla'!JB21=0,\"\",'[3]Tasa de Falla'!JB21)","v":"XXXX"}]
[null,null,{"$f":"'[3]Tasa de Falla'!C22","v":6},{"$f":"'[3]Tasa de Falla'!D22","v":"ESCABA - HUACRA"},{"$f":"'[3]Tasa de Falla'!E22","v":132},{"$f":"'[3]Tasa de Falla'!F22","v":49.9},{"$f":"IF('[3]Tasa de Falla'!IQ22=0,\"\",'[3]Tasa de Falla'!IQ22)","v":"XXXX"},{"$f":"IF('[3]Tasa de Falla'!IR22=0,\"\",'[3]Tasa de Falla'!IR22)","v":"XXXX"},{"$f":"IF('[3]Tasa de Falla'!IS22=0,\"\",'[3]Tasa de Falla'!IS22)","v":"XXXX"},{"$f":"IF('[3]Tasa de Falla'!IT22=0,\"\",'[3]Tasa de Falla'!IT22)","v":"XXXX"},{"$f":"IF('[3]Tasa de Falla'!IU22=0,\"\",'[3]Tasa de Falla'!IU22)","v":"XXXX"},{"$f":"IF('[3]Tasa de Falla'!IV22=0,\"\",'[3]Tasa de Falla'!IV22)","v":"XXXX"},{"$f":"IF('[3]Tasa de Falla'!IW22=0,\"\",'[3]Tasa de Falla'!IW22)","v":"XXXX"},{"$f":"IF('[3]Tasa de Falla'!IX22=0,\"\",'[3]Tasa de Falla'!IX22)","v":"XXXX"},{"$f":"IF('[3]Tasa de Falla'!IY22=0,\"\",'[3]Tasa de Falla'!IY22)","v":"XXXX"},{"$f":"IF('[3]Tasa de Falla'!IZ22=0,\"\",'[3]Tasa de Falla'!IZ22)","v":"XXXX"},{"$f":"IF('[3]Tasa de Falla'!JA22=0,\"\",'[3]Tasa de Falla'!JA22)","v":"XXXX"},{"$f":"IF('[3]Tasa de Falla'!JB22=0,\"\",'[3]Tasa de Falla'!JB22)","v":"XXXX"}]
[null,null,{"$f":"'[3]Tasa de Falla'!C23","v":7},{"$f":"'[3]Tasa de Falla'!D23","v":"ESTATICA SUR - EL BRACHO"},{"$f":"'[3]Tasa de Falla'!E23","v":132},{"$f":"'[3]Tasa de Falla'!F23","v":19.600000000000001},{"$f":"IF('[3]Tasa de Falla'!IQ23=0,\"\",'[3]Tasa de Falla'!IQ23)","v":""},{"$f":"IF('[3]Tasa de Falla'!IR23=0,\"\",'[3]Tasa de Falla'!IR23)","v":""},{"$f":"IF('[3]Tasa de Falla'!IS23=0,\"\",'[3]Tasa de Falla'!IS23)","v":""},{"$f":"IF('[3]Tasa de Falla'!IT23=0,\"\",'[3]Tasa de Falla'!IT23)","v":""},{"$f":"IF('[3]Tasa de Falla'!IU23=0,\"\",'[3]Tasa de Falla'!IU23)","v":""},{"$f":"IF('[3]Tasa de Falla'!IV23=0,\"\",'[3]Tasa de Falla'!IV23)","v":"XXXX"},{"$f":"IF('[3]Tasa de Falla'!IW23=0,\"\",'[3]Tasa de Falla'!IW23)","v":"XXXX"},{"$f":"IF('[3]Tasa de Falla'!IX23=0,\"\",'[3]Tasa de Falla'!IX23)","v":"XXXX"},{"$f":"IF('[3]Tasa de Falla'!IY23=0,\"\",'[3]Tasa de Falla'!IY23)","v":"XXXX"},{"$f":"IF('[3]Tasa de Falla'!IZ23=0,\"\",'[3]Tasa de Falla'!IZ23)","v":"XXXX"},{"$f":"IF('[3]Tasa de Falla'!JA23=0,\"\",'[3]Tasa de Falla'!JA23)","v":"XXXX"},{"$f":"IF('[3]Tasa de Falla'!JB23=0,\"\",'[3]Tasa de Falla'!JB23)","v":"XXXX"}]
[null,null,{"$f":"'[3]Tasa de Falla'!C24","v":8},{"$f":"'[3]Tasa de Falla'!D24","v":"ESTATICA SUR - INDEPENDENCIA 1 (O.F.)"},{"$f":"'[3]Tasa de Falla'!E24","v":132},{"$f":"'[3]Tasa de Falla'!F24","v":2.6},{"$f":"IF('[3]Tasa de Falla'!IQ24=0,\"\",'[3]Tasa de Falla'!IQ24)","v":""},{"$f":"IF('[3]Tasa de Falla'!IR24=0,\"\",'[3]Tasa de Falla'!IR24)","v":""},{"$f":"IF('[3]Tasa de Falla'!IS24=0,\"\",'[3]Tasa de Falla'!IS24)","v":""},{"$f":"IF('[3]Tasa de Falla'!IT24=0,\"\",'[3]Tasa de Falla'!IT24)","v":""},{"$f":"IF('[3]Tasa de Falla'!IU24=0,\"\",'[3]Tasa de Falla'!IU24)","v":""},{"$f":"IF('[3]Tasa de Falla'!IV24=0,\"\",'[3]Tasa de Falla'!IV24)","v":""},{"$f":"IF('[3]Tasa de Falla'!IW24=0,\"\",'[3]Tasa de Falla'!IW24)","v":""},{"$f":"IF('[3]Tasa de Falla'!IX24=0,\"\",'[3]Tasa de Falla'!IX24)","v":""},{"$f":"IF('[3]Tasa de Falla'!IY24=0,\"\",'[3]Tasa de Falla'!IY24)","v":""},{"$f":"IF('[3]Tasa de Falla'!IZ24=0,\"\",'[3]Tasa de Falla'!IZ24)","v":1},{"$f":"IF('[3]Tasa de Falla'!JA24=0,\"\",'[3]Tasa de Falla'!JA24)","v":""},{"$f":"IF('[3]Tasa de Falla'!JB24=0,\"\",'[3]Tasa de Falla'!JB24)","v":""}]
[null,null,{"$f":"'[3]Tasa de Falla'!C25","v":9},{"$f":"'[3]Tasa de Falla'!D25","v":"ESTATICA SUR - SARMIENTO \"TRANSNOA S.A.\""},{"$f":"'[3]Tasa de Falla'!E25","v":132},{"$f":"'[3]Tasa de Falla'!F25","v":4.4000000000000004},{"$f":"IF('[3]Tasa de Falla'!IQ25=0,\"\",'[3]Tasa de Falla'!IQ25)","v":""},{"$f":"IF('[3]Tasa de Falla'!IR25=0,\"\",'[3]Tasa de Falla'!IR25)","v":""},{"$f":"IF('[3]Tasa de Falla'!IS25=0,\"\",'[3]Tasa de Falla'!IS25)","v":""},{"$f":"IF('[3]Tasa de Falla'!IT25=0,\"\",'[3]Tasa de Falla'!IT25)","v":""},{"$f":"IF('[3]Tasa de Falla'!IU25=0,\"\",'[3]Tasa de Falla'!IU25)","v":""},{"$f":"IF('[3]Tasa de Falla'!IV25=0,\"\",'[3]Tasa de Falla'!IV25)","v":""},{"$f":"IF('[3]Tasa de Falla'!IW25=0,\"\",'[3]Tasa de Falla'!IW25)","v":""},{"$f":"IF('[3]Tasa de Falla'!IX25=0,\"\",'[3]Tasa de Falla'!IX25)","v":""},{"$f":"IF('[3]Tasa de Falla'!IY25=0,\"\",'[3]Tasa de Falla'!IY25)","v":""},{"$f":"IF('[3]Tasa de Falla'!IZ25=0,\"\",'[3]Tasa de Falla'!IZ25)","v":""},{"$f":"IF('[3]Tasa de Falla'!JA25=0,\"\",'[3]Tasa de Falla'!JA25)","v":""},{"$f":"IF('[3]Tasa de Falla'!JB25=0,\"\",'[3]Tasa de Falla'!JB25)","v":""}]
[null,null,{"$f":"'[3]Tasa de Falla'!C26","v":10},{"$f":"'[3]Tasa de Falla'!D26","v":"GÜEMES - EL BRACHO"},{"$f":"'[3]Tasa de Falla'!E26","v":132},{"$f":"'[3]Tasa de Falla'!F26","v":308},{"$f":"IF('[3]Tasa de Falla'!IQ26=0,\"\",'[3]Tasa de Falla'!IQ26)","v":"XXXX"},{"$f":"IF('[3]Tasa de Falla'!IR26=0,\"\",'[3]Tasa de Falla'!IR26)","v":"XXXX"},{"$f":"IF('[3]Tasa de Falla'!IS26=0,\"\",'[3]Tasa de Falla'!IS26)","v":"XXXX"},{"$f":"IF('[3]Tasa de Falla'!IT26=0,\"\",'[3]Tasa de Falla'!IT26)","v":"XXXX"},{"$f":"IF('[3]Tasa de Falla'!IU26=0,\"\",'[3]Tasa de Falla'!IU26)","v":"XXXX"},{"$f":"IF('[3]Tasa de Falla'!IV26=0,\"\",'[3]Tasa de Falla'!IV26)","v":"XXXX"},{"$f":"IF('[3]Tasa de Falla'!IW26=0,\"\",'[3]Tasa de Falla'!IW26)","v":"XXXX"},{"$f":"IF('[3]Tasa de Falla'!IX26=0,\"\",'[3]Tasa de Falla'!IX26)","v":"XXXX"},{"$f":"IF('[3]Tasa de Falla'!IY26=0,\"\",'[3]Tasa de Falla'!IY26)","v":"XXXX"},{"$f":"IF('[3]Tasa de Falla'!IZ26=0,\"\",'[3]Tasa de Falla'!IZ26)","v":"XXXX"},{"$f":"IF('[3]Tasa de Falla'!JA26=0,\"\",'[3]Tasa de Falla'!JA26)","v":"XXXX"},{"$f":"IF('[3]Tasa de Falla'!JB26=0,\"\",'[3]Tasa de Falla'!JB26)","v":"XXXX"}]
[null,null,{"$f":"'[3]Tasa de Falla'!C27","v":11},{"$f":"'[3]Tasa de Falla'!D27","v":"CAMPO SANTO - GÜEMES"},{"$f":"'[3]Tasa de Falla'!E27","v":132},{"$f":"'[3]Tasa de Falla'!F27","v":6.2},{"$f":"IF('[3]Tasa de Falla'!IQ27=0,\"\",'[3]Tasa de Falla'!IQ27)","v":"XXXX"},{"$f":"IF('[3]Tasa de Falla'!IR27=0,\"\",'[3]Tasa de Falla'!IR27)","v":"XXXX"},{"$f":"IF('[3]Tasa de Falla'!IS27=0,\"\",'[3]Tasa de Falla'!IS27)","v":"XXXX"},{"$f":"IF('[3]Tasa de Falla'!IT27=0,\"\",'[3]Tasa de Falla'!IT27)","v":"XXXX"},{"$f":"IF('[3]Tasa de Falla'!IU27=0,\"\",'[3]Tasa de Falla'!IU27)","v":"XXXX"},{"$f":"IF('[3]Tasa de Falla'!IV27=0,\"\",'[3]Tasa de Falla'!IV27)","v":"XXXX"},{"$f":"IF('[3]Tasa de Falla'!IW27=0,\"\",'[3]Tasa de Falla'!IW27)","v":"XXXX"},{"$f":"IF('[3]Tasa de Falla'!IX27=0,\"\",'[3]Tasa de Falla'!IX27)","v":"XXXX"},{"$f":"IF('[3]Tasa de Falla'!IY27=0,\"\",'[3]Tasa de Falla'!IY27)","v":"XXXX"},{"$f":"IF('[3]Tasa de Falla'!IZ27=0,\"\",'[3]Tasa de Falla'!IZ27)","v":"XXXX"},{"$f":"IF('[3]Tasa de Falla'!JA27=0,\"\",'[3]Tasa de Falla'!JA27)","v":"XXXX"},{"$f":"IF('[3]Tasa de Falla'!JB27=0,\"\",'[3]Tasa de Falla'!JB27)","v":"XXXX"}]
[null,null,{"$f":"'[3]Tasa de Falla'!C28","v":12},{"$f":"'[3]Tasa de Falla'!D28","v":"GÜEMES - SAN JUANCITO"},{"$f":"'[3]Tasa de Falla'!E28","v":132},{"$f":"'[3]Tasa de Falla'!F28","v":36.24},{"$f":"IF('[3]Tasa de Falla'!IQ28=0,\"\",'[3]Tasa de Falla'!IQ28)","v":""},{"$f":"IF('[3]Tasa de Falla'!IR28=0,\"\",'[3]Tasa de Falla'!IR28)","v":""},{"$f":"IF('[3]Tasa de Falla'!IS28=0,\"\",'[3]Tasa de Falla'!IS28)","v":""},{"$f":"IF('[3]Tasa de Falla'!IT28=0,\"\",'[3]Tasa de Falla'!IT28)","v":""},{"$f":"IF('[3]Tasa de Falla'!IU28=0,\"\",'[3]Tasa de Falla'!IU28)","v":""},{"$f":"IF('[3]Tasa de Falla'!IV28=0,\"\",'[3]Tasa de Falla'!IV28)","v":""},{"$f":"IF('[3]Tasa de Falla'!IW28=0,\"\",'[3]Tasa de Falla'!IW28)","v":3},{"$f":"IF('[3]Tasa de Falla'!IX28=0,\"\",'[3]Tasa de Falla'!IX28)","v":1},{"$f":"IF('[3]Tasa de Falla'!IY28=0,\"\",'[3]Tasa de Falla'!IY28)","v":""},{"$f":"IF('[3]Tasa de Falla'!IZ28=0,\"\",'[3]Tasa de Falla'!IZ28)","v":""},{"$f":"IF('[3]Tasa de Falla'!JA28=0,\"\",'[3]Tasa de Falla'!JA28)","v":""},{"$f":"IF('[3]Tasa de Falla'!JB28=0,\"\",'[3]Tasa de Falla'!JB28)","v":""}]
[null,null,{"$f":"'[3]Tasa de Falla'!C29","v":13},{"$f":"'[3]Tasa de Falla'!D29","v":"CATAMARCA - HUACRA"},{"$f":"'[3]Tasa de Falla'!E29","v":132},{"$f":"'[3]Tasa de Falla'!F29","v":67.3},{"$f":"IF('[3]Tasa de Falla'!IQ29=0,\"\",'[3]Tasa de Falla'!IQ29)","v":""},{"$f":"IF('[3]Tasa de Falla'!IR29=0,\"\",'[3]Tasa de Falla'!IR29)","v":""},{"$f":"IF('[3]Tasa de Falla'!IS29=0,\"\",'[3]Tasa de Falla'!IS29)","v":""},{"$f":"IF('[3]Tasa de Falla'!IT29=0,\"\",'[3]Tasa de Falla'!IT29)","v":""},{"$f":"IF('[3]Tasa de Falla'!IU29=0,\"\",'[3]Tasa de Falla'!IU29)","v":""},{"$f":"IF('[3]Tasa de Falla'!IV29=0,\"\",'[3]Tasa de Falla'!IV29)","v":""},{"$f":"IF('[3]Tasa de Falla'!IW29=0,\"\",'[3]Tasa de Falla'!IW29)","v":1},{"$f":"IF('[3]Tasa de Falla'!IX29=0,\"\",'[3]Tasa de Falla'!IX29)","v":""},{"$f":"IF('[3]Tasa de Falla'!IY29=0,\"\",'[3]Tasa de Falla'!IY29)","v":""},{"$f":"IF('[3]Tasa de Falla'!IZ29=0,\"\",'[3]Tasa de Falla'!IZ29)","v":""},{"$f":"IF('[3]Tasa de Falla'!JA29=0,\"\",'[3]Tasa de Falla'!JA29)","v":""},{"$f":"IF('[3]Tasa de Falla'!JB29=0,\"\",'[3]Tasa de Falla'!JB29)","v":""}]
[null,null,{"$f":"'[3]Tasa de Falla'!C30","v":14},{"$f":"'[3]Tasa de Falla'!D30","v":"HUACRA - LA CALERA"},{"$f":"'[3]Tasa de Falla'!E30","v":132},{"$f":"'[3]Tasa de Falla'!F30","v":91.2},{"$f":"IF('[3]Tasa de Falla'!IQ30=0,\"\",'[3]Tasa de Falla'!IQ30)","v":""},{"$f":"IF('[3]Tasa de Falla'!IR30=0,\"\",'[3]Tasa de Falla'!IR30)","v":""},{"$f":"IF('[3]Tasa de Falla'!IS30=0,\"\",'[3]Tasa de Falla'!IS30)","v":""},{"$f":"IF('[3]Tasa de Falla'!IT30=0,\"\",'[3]Tasa de Falla'!IT30)","v":""},{"$f":"IF('[3]Tasa de Falla'!IU30=0,\"\",'[3]Tasa de Falla'!IU30)","v":""},{"$f":"IF('[3]Tasa de Falla'!IV30=0,\"\",'[3]Tasa de Falla'!IV30)","v":""},{"$f":"IF('[3]Tasa de Falla'!IW30=0,\"\",'[3]Tasa de Falla'!IW30)","v":""},{"$f":"IF('[3]Tasa de Falla'!IX30=0,\"\",'[3]Tasa de Falla'!IX30)","v":1},{"$f":"IF('[3]Tasa de Falla'!IY30=0,\"\",'[3]Tasa de Falla'!IY30)","v":""},{"$f":"IF('[3]Tasa de Falla'!IZ30=0,\"\",'[3]Tasa de Falla'!IZ30)","v":""},{"$f":"IF('[3]Tasa de Falla'!JA30=0,\"\",'[3]Tasa de Falla'!JA30)","v":""},{"$f":"IF('[3]Tasa de Falla'!JB30=0,\"\",'[3]Tasa de Falla'!JB30)","v":""}]
[null,null,{"$f":"'[3]Tasa de Falla'!C31","v":15},{"$f":"'[3]Tasa de Falla'!D31","v":"AGUA BLANCA - INDEPENDENCIA"},{"$f":"'[3]Tasa de Falla'!E31","v":132},{"$f":"'[3]Tasa de Falla'!F31","v":34.14},{"$f":"IF('[3]Tasa de Falla'!IQ31=0,\"\",'[3]Tasa de Falla'!IQ31)","v":1},{"$f":"IF('[3]Tasa de Falla'!IR31=0,\"\",'[3]Tasa de Falla'!IR31)","v":""},{"$f":"IF('[3]Tasa de Falla'!IS31=0,\"\",'[3]Tasa de Falla'!IS31)","v":""},{"$f":"IF('[3]Tasa de Falla'!IT31=0,\"\",'[3]Tasa de Falla'!IT31)","v":1},{"$f":"IF('[3]Tasa de Falla'!IU31=0,\"\",'[3]Tasa de Falla'!IU31)","v":""},{"$f":"IF('[3]Tasa de Falla'!IV31=0,\"\",'[3]Tasa de Falla'!IV31)","v":""},{"$f":"IF('[3]Tasa de Falla'!IW31=0,\"\",'[3]Tasa de Falla'!IW31)","v":""},{"$f":"IF('[3]Tasa de Falla'!IX31=0,\"\",'[3]Tasa de Falla'!IX31)","v":""},{"$f":"IF('[3]Tasa de Falla'!IY31=0,\"\",'[3]Tasa de Falla'!IY31)","v":""},{"$f":"IF('[3]Tasa de Falla'!IZ31=0,\"\",'[3]Tasa de Falla'!IZ31)","v":""},{"$f":"IF('[3]Tasa de Falla'!JA31=0,\"\",'[3]Tasa de Falla'!JA31)","v":""},{"$f":"IF('[3]Tasa de Falla'!JB31=0,\"\",'[3]Tasa de Falla'!JB31)","v":1}]
[null,null,{"$f":"'[3]Tasa de Falla'!C32","v":16},{"$f":"'[3]Tasa de Falla'!D32","v":"INDEPENDENCIA - EL BRACHO 1"},{"$f":"'[3]Tasa de Falla'!E32","v":132},{"$f":"'[3]Tasa de Falla'!F32","v":17.100000000000001},{"$f":"IF('[3]Tasa de Falla'!IQ32=0,\"\",'[3]Tasa de Falla'!IQ32)","v":""},{"$f":"IF('[3]Tasa de Falla'!IR32=0,\"\",'[3]Tasa de Falla'!IR32)","v":""},{"$f":"IF('[3]Tasa de Falla'!IS32=0,\"\",'[3]Tasa de Falla'!IS32)","v":""},{"$f":"IF('[3]Tasa de Falla'!IT32=0,\"\",'[3]Tasa de Falla'!IT32)","v":1},{"$f":"IF('[3]Tasa de Falla'!IU32=0,\"\",'[3]Tasa de Falla'!IU32)","v":""},{"$f":"IF('[3]Tasa de Falla'!IV32=0,\"\",'[3]Tasa de Falla'!IV32)","v":""},{"$f":"IF('[3]Tasa de Falla'!IW32=0,\"\",'[3]Tasa de Falla'!IW32)","v":""},{"$f":"IF('[3]Tasa de Falla'!IX32=0,\"\",'[3]Tasa de Falla'!IX32)","v":""},{"$f":"IF('[3]Tasa de Falla'!IY32=0,\"\",'[3]Tasa de Falla'!IY32)","v":""},{"$f":"IF('[3]Tasa de Falla'!IZ32=0,\"\",'[3]Tasa de Falla'!IZ32)","v":""},{"$f":"IF('[3]Tasa de Falla'!JA32=0,\"\",'[3]Tasa de Falla'!JA32)","v":1},{"$f":"IF('[3]Tasa de Falla'!JB32=0,\"\",'[3]Tasa de Falla'!JB32)","v":""}]
[null,null,{"$f":"'[3]Tasa de Falla'!C33","v":17},{"$f":"'[3]Tasa de Falla'!D33","v":"INDEPENDENCIA - LULES - PAPEL TUCUMAN"},{"$f":"'[3]Tasa de Falla'!E33","v":132},{"$f":"'[3]Tasa de Falla'!F33","v":19.3},{"$f":"IF('[3]Tasa de Falla'!IQ33=0,\"\",'[3]Tasa de Falla'!IQ33)","v":""},{"$f":"IF('[3]Tasa de Falla'!IR33=0,\"\",'[3]Tasa de Falla'!IR33)","v":""},{"$f":"IF('[3]Tasa de Falla'!IS33=0,\"\",'[3]Tasa de Falla'!IS33)","v":""},{"$f":"IF('[3]Tasa de Falla'!IT33=0,\"\",'[3]Tasa de Falla'!IT33)","v":""},{"$f":"IF('[3]Tasa de Falla'!IU33=0,\"\",'[3]Tasa de Falla'!IU33)","v":""},{"$f":"IF('[3]Tasa de Falla'!IV33=0,\"\",'[3]Tasa de Falla'!IV33)","v":""},{"$f":"IF('[3]Tasa de Falla'!IW33=0,\"\",'[3]Tasa de Falla'!IW33)","v":""},{"$f":"IF('[3]Tasa de Falla'!IX33=0,\"\",'[3]Tasa de Falla'!IX33)","v":""},{"$f":"IF('[3]Tasa de Falla'!IY33=0,\"\",'[3]Tasa de Falla'!IY33)","v":""},{"$f":"IF('[3]Tasa de Falla'!IZ33=0,\"\",'[3]Tasa de Falla'!IZ33)","v":""},{"$f":"IF('[3]Tasa de Falla'!JA33=0,\"\",'[3]Tasa de Falla'!JA33)","v":""},{"$f":"IF('[3]Tasa de Falla'!JB33=0,\"\",'[3]Tasa de Falla'!JB33)","v":""}]
[null,null,{"$f":"'[3]Tasa de Falla'!C34","v":18},{"$f":"'[3]Tasa de Falla'!D34","v":"FRIAS - LA CALERA NOA."},{"$f":"'[3]Tasa de Falla'!E34","v":132},{"$f":"'[3]Tasa de Falla'!F34","v":27.3},{"$f":"IF('[3]Tasa de Falla'!IQ34=0,\"\",'[3]Tasa de Falla'!IQ34)","v":""},{"$f":"IF('[3]Tasa de Falla'!IR34=0,\"\",'[3]Tasa de Falla'!IR34)","v":""},{"$f":"IF('[3]Tasa de Falla'!IS34=0,\"\",'[3]Tasa de Falla'!IS34)","v":1},{"$f":"IF('[3]Tasa de Falla'!IT34=0,\"\",'[3]Tasa de Falla'!IT34)","v":""},{"$f":"IF('[3]Tasa de Falla'!IU34=0,\"\",'[3]Tasa de Falla'!IU34)","v":""},{"$f":"IF('[3]Tasa de Falla'!IV34=0,\"\",'[3]Tasa de Falla'!IV34)","v":""},{"$f":"IF('[3]Tasa de Falla'!IW34=0,\"\",'[3]Tasa de Falla'!IW34)","v":""},{"$f":"IF('[3]Tasa de Falla'!IX34=0,\"\",'[3]Tasa de Falla'!IX34)","v":""},{"$f":"IF('[3]Tasa de Falla'!IY34=0,\"\",'[3]Tasa de Falla'!IY34)","v":""},{"$f":"IF('[3]Tasa de Falla'!IZ34=0,\"\",'[3]Tasa de Falla'!IZ34)","v":""},{"$f":"IF('[3]Tasa de Falla'!JA34=0,\"\",'[3]Tasa de Falla'!JA34)","v":""},{"$f":"IF('[3]Tasa de Falla'!JB34=0,\"\",'[3]Tasa de Falla'!JB34)","v":""}]
[null,null,{"$f":"'[3]Tasa de Falla'!C35","v":19},{"$f":"'[3]Tasa de Falla'!D35","v":"LA BANDA - SANTIAGO CENTRO"},{"$f":"'[3]Tasa de Falla'!E35","v":132},{"$f":"'[3]Tasa de Falla'!F35","v":10.91},{"$f":"IF('[3]Tasa de Falla'!IQ35=0,\"\",'[3]Tasa de Falla'!IQ35)","v":""},{"$f":"IF('[3]Tasa de Falla'!IR35=0,\"\",'[3]Tasa de Falla'!IR35)","v":""},{"$f":"IF('[3]Tasa de Falla'!IS35=0,\"\",'[3]Tasa de Falla'!IS35)","v":""},{"$f":"IF('[3]Tasa de Falla'!IT35=0,\"\",'[3]Tasa de Falla'!IT35)","v":""},{"$f":"IF('[3]Tasa de Falla'!IU35=0,\"\",'[3]Tasa de Falla'!IU35)","v":""},{"$f":"IF('[3]Tasa de Falla'!IV35=0,\"\",'[3]Tasa de Falla'!IV35)","v":1},{"$f":"IF('[3]Tasa de Falla'!IW35=0,\"\",'[3]Tasa de Falla'!IW35)","v":""},{"$f":"IF('[3]Tasa de Falla'!IX35=0,\"\",'[3]Tasa de Falla'!IX35)","v":""},{"$f":"IF('[3]Tasa de Falla'!IY35=0,\"\",'[3]Tasa de Falla'!IY35)","v":"XXXX"},{"$f":"IF('[3]Tasa de Falla'!IZ35=0,\"\",'[3]Tasa de Falla'!IZ35)","v":"XXXX"},{"$f":"IF('[3]Tasa de Falla'!JA35=0,\"\",'[3]Tasa de Falla'!JA35)","v":"XXXX"},{"$f":"IF('[3]Tasa de Falla'!JB35=0,\"\",'[3]Tasa de Falla'!JB35)","v":"XXXX"}]
[null,null,{"$f":"'[3]Tasa de Falla'!C36","v":20},{"$f":"'[3]Tasa de Falla'!D36","v":"LIBERTADOR NOA. - PICHANAL"},{"$f":"'[3]Tasa de Falla'!E36","v":132},{"$f":"'[3]Tasa de Falla'!F36","v":76},{"$f":"IF('[3]Tasa de Falla'!IQ36=0,\"\",'[3]Tasa de Falla'!IQ36)","v":""},{"$f":"IF('[3]Tasa de Falla'!IR36=0,\"\",'[3]Tasa de Falla'!IR36)","v":2},{"$f":"IF('[3]Tasa de Falla'!IS36=0,\"\",'[3]Tasa de Falla'!IS36)","v":""},{"$f":"IF('[3]Tasa de Falla'!IT36=0,\"\",'[3]Tasa de Falla'!IT36)","v":1},{"$f":"IF('[3]Tasa de Falla'!IU36=0,\"\",'[3]Tasa de Falla'!IU36)","v":1},{"$f":"IF('[3]Tasa de Falla'!IV36=0,\"\",'[3]Tasa de Falla'!IV36)","v":4},{"$f":"IF('[3]Tasa de Falla'!IW36=0,\"\",'[3]Tasa de Falla'!IW36)","v":""},{"$f":"IF('[3]Tasa de Falla'!IX36=0,\"\",'[3]Tasa de Falla'!IX36)","v":""},{"$f":"IF('[3]Tasa de Falla'!IY36=0,\"\",'[3]Tasa de Falla'!IY36)","v":""},{"$f":"IF('[3]Tasa de Falla'!IZ36=0,\"\",'[3]Tasa de Falla'!IZ36)","v":""},{"$f":"IF('[3]Tasa de Falla'!JA36=0,\"\",'[3]Tasa de Falla'!JA36)","v":""},{"$f":"IF('[3]Tasa de Falla'!JB36=0,\"\",'[3]Tasa de Falla'!JB36)","v":""}]
[null,null,{"$f":"'[3]Tasa de Falla'!C37","v":21},{"$f":"'[3]Tasa de Falla'!D37","v":"GÜEMES - METAN"},{"$f":"'[3]Tasa de Falla'!E37","v":132},{"$f":"'[3]Tasa de Falla'!F37","v":97.13},{"$f":"IF('[3]Tasa de Falla'!IQ37=0,\"\",'[3]Tasa de Falla'!IQ37)","v":"XXXX"},{"$f":"IF('[3]Tasa de Falla'!IR37=0,\"\",'[3]Tasa de Falla'!IR37)","v":"XXXX"},{"$f":"IF('[3]Tasa de Falla'!IS37=0,\"\",'[3]Tasa de Falla'!IS37)","v":"XXXX"},{"$f":"IF('[3]Tasa de Falla'!IT37=0,\"\",'[3]Tasa de Falla'!IT37)","v":"XXXX"},{"$f":"IF('[3]Tasa de Falla'!IU37=0,\"\",'[3]Tasa de Falla'!IU37)","v":"XXXX"},{"$f":"IF('[3]Tasa de Falla'!IV37=0,\"\",'[3]Tasa de Falla'!IV37)","v":"XXXX"},{"$f":"IF('[3]Tasa de Falla'!IW37=0,\"\",'[3]Tasa de Falla'!IW37)","v":"XXXX"},{"$f":"IF('[3]Tasa de Falla'!IX37=0,\"\",'[3]Tasa de Falla'!IX37)","v":"XXXX"},{"$f":"IF('[3]Tasa de Falla'!IY37=0,\"\",'[3]Tasa de Falla'!IY37)","v":"XXXX"},{"$f":"IF('[3]Tasa de Falla'!IZ37=0,\"\",'[3]Tasa de Falla'!IZ37)","v":"XXXX"},{"$f":"IF('[3]Tasa de Falla'!JA37=0,\"\",'[3]Tasa de Falla'!JA37)","v":"XXXX"},{"$f":"IF('[3]Tasa de Falla'!JB37=0,\"\",'[3]Tasa de Falla'!JB37)","v":"XXXX"}]
[null,null,{"$f":"'[3]Tasa de Falla'!C38","v":22},{"$f":"'[3]Tasa de Falla'!D38","v":"MINETTI - SAN JUANCITO"},{"$f":"'[3]Tasa de Falla'!E38","v":132},{"$f":"'[3]Tasa de Falla'!F38","v":26},{"$f":"IF('[3]Tasa de Falla'!IQ38=0,\"\",'[3]Tasa de Falla'!IQ38)","v":""},{"$f":"IF('[3]Tasa de Falla'!IR38=0,\"\",'[3]Tasa de Falla'!IR38)","v":""},{"$f":"IF('[3]Tasa de Falla'!IS38=0,\"\",'[3]Tasa de Falla'!IS38)","v":""},{"$f":"IF('[3]Tasa de Falla'!IT38=0,\"\",'[3]Tasa de Falla'!IT38)","v":""},{"$f":"IF('[3]Tasa de Falla'!IU38=0,\"\",'[3]Tasa de Falla'!IU38)","v":""},{"$f":"IF('[3]Tasa de Falla'!IV38=0,\"\",'[3]Tasa de Falla'!IV38)","v":""},{"$f":"IF('[3]Tasa de Falla'!IW38=0,\"\",'[3]Tasa de Falla'!IW38)","v":""},{"$f":"IF('[3]Tasa de Falla'!IX38=0,\"\",'[3]Tasa de Falla'!IX38)","v":2},{"$f":"IF('[3]Tasa de Falla'!IY38=0,\"\",'[3]Tasa de Falla'!IY38)","v":""},{"$f":"IF('[3]Tasa de Falla'!IZ38=0,\"\",'[3]Tasa de Falla'!IZ38)","v":""},{"$f":"IF('[3]Tasa de Falla'!JA38=0,\"\",'[3]Tasa de Falla'!JA38)","v":1},{"$f":"IF('[3]Tasa de Falla'!JB38=0,\"\",'[3]Tasa de Falla'!JB38)","v":""}]
[null,null,{"$f":"'[3]Tasa de Falla'!C39","v":23},{"$f":"'[3]Tasa de Falla'!D39","v":"PALPALA - JUJUY SUR"},{"$f":"'[3]Tasa de Falla'!E39","v":132},{"$f":"'[3]Tasa de Falla'!F39","v":14},{"$f":"IF('[3]Tasa de Falla'!IQ39=0,\"\",'[3]Tasa de Falla'!IQ39)","v":"XXXX"},{"$f":"IF('[3]Tasa de Falla'!IR39=0,\"\",'[3]Tasa de Falla'!IR39)","v":"XXXX"},{"$f":"IF('[3]Tasa de Falla'!IS39=0,\"\",'[3]Tasa de Falla'!IS39)","v":"XXXX"},{"$f":"IF('[3]Tasa de Falla'!IT39=0,\"\",'[3]Tasa de Falla'!IT39)","v":"XXXX"},{"$f":"IF('[3]Tasa de Falla'!IU39=0,\"\",'[3]Tasa de Falla'!IU39)","v":"XXXX"},{"$f":"IF('[3]Tasa de Falla'!IV39=0,\"\",'[3]Tasa de Falla'!IV39)","v":"XXXX"},{"$f":"IF('[3]Tasa de Falla'!IW39=0,\"\",'[3]Tasa de Falla'!IW39)","v":"XXXX"},{"$f":"IF('[3]Tasa de Falla'!IX39=0,\"\",'[3]Tasa de Falla'!IX39)","v":"XXXX"},{"$f":"IF('[3]Tasa de Falla'!IY39=0,\"\",'[3]Tasa de Falla'!IY39)","v":"XXXX"},{"$f":"IF('[3]Tasa de Falla'!IZ39=0,\"\",'[3]Tasa de Falla'!IZ39)","v":"XXXX"},{"$f":"IF('[3]Tasa de Falla'!JA39=0,\"\",'[3]Tasa de Falla'!JA39)","v":"XXXX"},{"$f":"IF('[3]Tasa de Falla'!JB39=0,\"\",'[3]Tasa de Falla'!JB39)","v":"XXXX"}]
[null,null,{"$f":"'[3]Tasa de Falla'!C40","v":24},{"$f":"'[3]Tasa de Falla'!D40","v":"ORAN - PICHANAL"},{"$f":"'[3]Tasa de Falla'!E40","v":132},{"$f":"'[3]Tasa de Falla'!F40","v":17},{"$f":"IF('[3]Tasa de Falla'!IQ40=0,\"\",'[3]Tasa de Falla'!IQ40)","v":"XXXX"},{"$f":"IF('[3]Tasa de Falla'!IR40=0,\"\",'[3]Tasa de Falla'!IR40)","v":"XXXX"},{"$f":"IF('[3]Tasa de Falla'!IS40=0,\"\",'[3]Tasa de Falla'!IS40)","v":"XXXX"},{"$f":"IF('[3]Tasa de Falla'!IT40=0,\"\",'[3]Tasa de Falla'!IT40)","v":"XXXX"},{"$f":"IF('[3]Tasa de Falla'!IU40=0,\"\",'[3]Tasa de Falla'!IU40)","v":"XXXX"},{"$f":"IF('[3]Tasa de Falla'!IV40=0,\"\",'[3]Tasa de Falla'!IV40)","v":"XXXX"},{"$f":"IF('[3]Tasa de Falla'!IW40=0,\"\",'[3]Tasa de Falla'!IW40)","v":"XXXX"},{"$f":"IF('[3]Tasa de Falla'!IX40=0,\"\",'[3]Tasa de Falla'!IX40)","v":"XXXX"},{"$f":"IF('[3]Tasa de Falla'!IY40=0,\"\",'[3]Tasa de Falla'!IY40)","v":"XXXX"},{"$f":"IF('[3]Tasa de Falla'!IZ40=0,\"\",'[3]Tasa de Falla'!IZ40)","v":"XXXX"},{"$f":"IF('[3]Tasa de Falla'!JA40=0,\"\",'[3]Tasa de Falla'!JA40)","v":"XXXX"},{"$f":"IF('[3]Tasa de Falla'!JB40=0,\"\",'[3]Tasa de Falla'!JB40)","v":"XXXX"}]
[null,null,{"$f":"'[3]Tasa de Falla'!C41","v":25},{"$f":"'[3]Tasa de Falla'!D41","v":"PICHANAL - TARTAGAL"},{"$f":"'[3]Tasa de Falla'!E41","v":132},{"$f":"'[3]Tasa de Falla'!F41","v":105},{"$f":"IF('[3]Tasa de Falla'!IQ41=0,\"\",'[3]Tasa de Falla'!IQ41)","v":1},{"$f":"IF('[3]Tasa de Falla'!IR41=0,\"\",'[3]Tasa de Falla'!IR41)","v":1},{"$f":"IF('[3]Tasa de Falla'!IS41=0,\"\",'[3]Tasa de Falla'!IS41)","v":""},{"$f":"IF('[3]Tasa de Falla'!IT41=0,\"\",'[3]Tasa de Falla'!IT41)","v":""},{"$f":"IF('[3]Tasa de Falla'!IU41=0,\"\",'[3]Tasa de Falla'!IU41)","v":""},{"$f":"IF('[3]Tasa de Falla'!IV41=0,\"\",'[3]Tasa de Falla'!IV41)","v":"XXXX"},{"$f":"IF('[3]Tasa de Falla'!IW41=0,\"\",'[3]Tasa de Falla'!IW41)","v":"XXXX"},{"$f":"IF('[3]Tasa de Falla'!IX41=0,\"\",'[3]Tasa de Falla'!IX41)","v":"XXXX"},{"$f":"IF('[3]Tasa de Falla'!IY41=0,\"\",'[3]Tasa de Falla'!IY41)","v":"XXXX"},{"$f":"IF('[3]Tasa de Falla'!IZ41=0,\"\",'[3]Tasa de Falla'!IZ41)","v":"XXXX"},{"$f":"IF('[3]Tasa de Falla'!JA41=0,\"\",'[3]Tasa de Falla'!JA41)","v":"XXXX"},{"$f":"IF('[3]Tasa de Falla'!JB41=0,\"\",'[3]Tasa de Falla'!JB41)","v":"XXXX"}]
[null,null,{"$f":"'[3]Tasa de Falla'!C42","v":26},{"$f":"'[3]Tasa de Falla'!D42","v":"C.H. RIO HONDO - LA BANDA"},{"$f":"'[3]Tasa de Falla'!E42","v":132},{"$f":"'[3]Tasa de Falla'!F42","v":76.5},{"$f":"IF('[3]Tasa de Falla'!IQ42=0,\"\",'[3]Tasa de Falla'!IQ42)","v":""},{"$f":"IF('[3]Tasa de Falla'!IR42=0,\"\",'[3]Tasa de Falla'!IR42)","v":""},{"$f":"IF('[3]Tasa de Falla'!IS42=0,\"\",'[3]Tasa de Falla'!IS42)","v":""},{"$f":"IF('[3]Tasa de Falla'!IT42=0,\"\",'[3]Tasa de Falla'!IT42)","v":2},{"$f":"IF('[3]Tasa de Falla'!IU42=0,\"\",'[3]Tasa de Falla'!IU42)","v":""},{"$f":"IF('[3]Tasa de Falla'!IV42=0,\"\",'[3]Tasa de Falla'!IV42)","v":1},{"$f":"IF('[3]Tasa de Falla'!IW42=0,\"\",'[3]Tasa de Falla'!IW42)","v":""},{"$f":"IF('[3]Tasa de Falla'!IX42=0,\"\",'[3]Tasa de Falla'!IX42)","v":""},{"$f":"IF('[3]Tasa de Falla'!IY42=0,\"\",'[3]Tasa de Falla'!IY42)","v":""},{"$f":"IF('[3]Tasa de Falla'!IZ42=0,\"\",'[3]Tasa de Falla'!IZ42)","v":""},{"$f":"IF('[3]Tasa de Falla'!JA42=0,\"\",'[3]Tasa de Falla'!JA42)","v":""},{"$f":"IF('[3]Tasa de Falla'!JB42=0,\"\",'[3]Tasa de Falla'!JB42)","v":""}]
[null,null,{"$f":"'[3]Tasa de Falla'!C43","v":27},{"$f":"'[3]Tasa de Falla'!D43","v":"LA RIOJA - RECREO  2"},{"$f":"'[3]Tasa de Falla'!E43","v":132},{"$f":"'[3]Tasa de Falla'!F43","v":220},{"$f":"IF('[3]Tasa de Falla'!IQ43=0,\"\",'[3]Tasa de Falla'!IQ43)","v":"XXXX"},{"$f":"IF('[3]Tasa de Falla'!IR43=0,\"\",'[3]Tasa de Falla'!IR43)","v":"XXXX"},{"$f":"IF('[3]Tasa de Falla'!IS43=0,\"\",'[3]Tasa de Falla'!IS43)","v":"XXXX"},{"$f":"IF('[3]Tasa de Falla'!IT43=0,\"\",'[3]Tasa de Falla'!IT43)","v":"XXXX"},{"$f":"IF('[3]Tasa de Falla'!IU43=0,\"\",'[3]Tasa de Falla'!IU43)","v":"XXXX"},{"$f":"IF('[3]Tasa de Falla'!IV43=0,\"\",'[3]Tasa de Falla'!IV43)","v":"XXXX"},{"$f":"IF('[3]Tasa de Falla'!IW43=0,\"\",'[3]Tasa de Falla'!IW43)","v":"XXXX"},{"$f":"IF('[3]Tasa de Falla'!IX43=0,\"\",'[3]Tasa de Falla'!IX43)","v":"XXXX"},{"$f":"IF('[3]Tasa de Falla'!IY43=0,\"\",'[3]Tasa de Falla'!IY43)","v":"XXXX"},{"$f":"IF('[3]Tasa de Falla'!IZ43=0,\"\",'[3]Tasa de Falla'!IZ43)","v":"XXXX"},{"$f":"IF('[3]Tasa de Falla'!JA43=0,\"\",'[3]Tasa de Falla'!JA43)","v":"XXXX"},{"$f":"IF('[3]Tasa de Falla'!JB43=0,\"\",'[3]Tasa de Falla'!JB43)","v":"XXXX"}]
[null,null,{"$f":"'[3]Tasa de Falla'!C44","v":28},{"$f":"'[3]Tasa de Falla'!D44","v":"CAMPO SANTO - SALTA SUR"},{"$f":"'[3]Tasa de Falla'!E44","v":132},{"$f":"'[3]Tasa de Falla'!F44","v":40.92},{"$f":"IF('[3]Tasa de Falla'!IQ44=0,\"\",'[3]Tasa de Falla'!IQ44)","v":"XXXX"},{"$f":"IF('[3]Tasa de Falla'!IR44=0,\"\",'[3]Tasa de Falla'!IR44)","v":"XXXX"},{"$f":"IF('[3]Tasa de Falla'!IS44=0,\"\",'[3]Tasa de Falla'!IS44)","v":"XXXX"},{"$f":"IF('[3]Tasa de Falla'!IT44=0,\"\",'[3]Tasa de Falla'!IT44)","v":"XXXX"},{"$f":"IF('[3]Tasa de Falla'!IU44=0,\"\",'[3]Tasa de Falla'!IU44)","v":"XXXX"},{"$f":"IF('[3]Tasa de Falla'!IV44=0,\"\",'[3]Tasa de Falla'!IV44)","v":"XXXX"},{"$f":"IF('[3]Tasa de Falla'!IW44=0,\"\",'[3]Tasa de Falla'!IW44)","v":"XXXX"},{"$f":"IF('[3]Tasa de Falla'!IX44=0,\"\",'[3]Tasa de Falla'!IX44)","v":"XXXX"},{"$f":"IF('[3]Tasa de Falla'!IY44=0,\"\",'[3]Tasa de Falla'!IY44)","v":"XXXX"},{"$f":"IF('[3]Tasa de Falla'!IZ44=0,\"\",'[3]Tasa de Falla'!IZ44)","v":"XXXX"},{"$f":"IF('[3]Tasa de Falla'!JA44=0,\"\",'[3]Tasa de Falla'!JA44)","v":"XXXX"},{"$f":"IF('[3]Tasa de Falla'!JB44=0,\"\",'[3]Tasa de Falla'!JB44)","v":"XXXX"}]
[null,null,{"$f":"'[3]Tasa de Falla'!C45","v":29},{"$f":"'[3]Tasa de Falla'!D45","v":"PALPALA - SAN JUANCITO"},{"$f":"'[3]Tasa de Falla'!E45","v":132},{"$f":"'[3]Tasa de Falla'!F45","v":23.9},{"$f":"IF('[3]Tasa de Falla'!IQ45=0,\"\",'[3]Tasa de Falla'!IQ45)","v":""},{"$f":"IF('[3]Tasa de Falla'!IR45=0,\"\",'[3]Tasa de Falla'!IR45)","v":""},{"$f":"IF('[3]Tasa de Falla'!IS45=0,\"\",'[3]Tasa de Falla'!IS45)","v":""},{"$f":"IF('[3]Tasa de Falla'!IT45=0,\"\",'[3]Tasa de Falla'!IT45)","v":2},{"$f":"IF('[3]Tasa de Falla'!IU45=0,\"\",'[3]Tasa de Falla'!IU45)","v":""},{"$f":"IF('[3]Tasa de Falla'!IV45=0,\"\",'[3]Tasa de Falla'!IV45)","v":""},{"$f":"IF('[3]Tasa de Falla'!IW45=0,\"\",'[3]Tasa de Falla'!IW45)","v":2},{"$f":"IF('[3]Tasa de Falla'!IX45=0,\"\",'[3]Tasa de Falla'!IX45)","v":2},{"$f":"IF('[3]Tasa de Falla'!IY45=0,\"\",'[3]Tasa de Falla'!IY45)","v":""},{"$f":"IF('[3]Tasa de Falla'!IZ45=0,\"\",'[3]Tasa de Falla'!IZ45)","v":""},{"$f":"IF('[3]Tasa de Falla'!JA45=0,\"\",'[3]Tasa de Falla'!JA45)","v":""},{"$f":"IF('[3]Tasa de Falla'!JB45=0,\"\",'[3]Tasa de Falla'!JB45)","v":""}]
[null,null,{"$f":"'[3]Tasa de Falla'!C46","v":30},{"$f":"'[3]Tasa de Falla'!D46","v":"SAN JUANCITO - SAN PEDRO JUJUY"},{"$f":"'[3]Tasa de Falla'!E46","v":132},{"$f":"'[3]Tasa de Falla'!F46","v":27},{"$f":"IF('[3]Tasa de Falla'!IQ46=0,\"\",'[3]Tasa de Falla'!IQ46)","v":""},{"$f":"IF('[3]Tasa de Falla'!IR46=0,\"\",'[3]Tasa de Falla'!IR46)","v":""},{"$f":"IF('[3]Tasa de Falla'!IS46=0,\"\",'[3]Tasa de Falla'!IS46)","v":""},{"$f":"IF('[3]Tasa de Falla'!IT46=0,\"\",'[3]Tasa de Falla'!IT46)","v":""},{"$f":"IF('[3]Tasa de Falla'!IU46=0,\"\",'[3]Tasa de Falla'!IU46)","v":""},{"$f":"IF('[3]Tasa de Falla'!IV46=0,\"\",'[3]Tasa de Falla'!IV46)","v":""},{"$f":"IF('[3]Tasa de Falla'!IW46=0,\"\",'[3]Tasa de Falla'!IW46)","v":""},{"$f":"IF('[3]Tasa de Falla'!IX46=0,\"\",'[3]Tasa de Falla'!IX46)","v":""},{"$f":"IF('[3]Tasa de Falla'!IY46=0,\"\",'[3]Tasa de Falla'!IY46)","v":""},{"$f":"IF('[3]Tasa de Falla'!IZ46=0,\"\",'[3]Tasa de Falla'!IZ46)","v":""},{"$f":"IF('[3]Tasa de Falla'!JA46=0,\"\",'[3]Tasa de Falla'!JA46)","v":""},{"$f":"IF('[3]Tasa de Falla'!JB46=0,\"\",'[3]Tasa de Falla'!JB46)","v":""}]
[null,null,{"$f":"'[3]Tasa de Falla'!C47","v":31},{"$f":"'[3]Tasa de Falla'!D47","v":"SAN MARTIN - CATAMARCA"},{"$f":"'[3]Tasa de Falla'!E47","v":132},{"$f":"'[3]Tasa de Falla'!F47","v":88},{"$f":"IF('[3]Tasa de Falla'!IQ47=0,\"\",'[3]Tasa de Falla'!IQ47)","v":"XXXX"},{"$f":"IF('[3]Tasa de Falla'!IR47=0,\"\",'[3]Tasa de Falla'!IR47)","v":"XXXX"},{"$f":"IF('[3]Tasa de Falla'!IS47=0,\"\",'[3]Tasa de Falla'!IS47)","v":"XXXX"},{"$f":"IF('[3]Tasa de Falla'!IT47=0,\"\",'[3]Tasa de Falla'!IT47)","v":"XXXX"},{"$f":"IF('[3]Tasa de Falla'!IU47=0,\"\",'[3]Tasa de Falla'!IU47)","v":"XXXX"},{"$f":"IF('[3]Tasa de Falla'!IV47=0,\"\",'[3]Tasa de Falla'!IV47)","v":"XXXX"},{"$f":"IF('[3]Tasa de Falla'!IW47=0,\"\",'[3]Tasa de Falla'!IW47)","v":"XXXX"},{"$f":"IF('[3]Tasa de Falla'!IX47=0,\"\",'[3]Tasa de Falla'!IX47)","v":"XXXX"},{"$f":"IF('[3]Tasa de Falla'!IY47=0,\"\",'[3]Tasa de Falla'!IY47)","v":"XXXX"},{"$f":"IF('[3]Tasa de Falla'!IZ47=0,\"\",'[3]Tasa de Falla'!IZ47)","v":"XXXX"},{"$f":"IF('[3]Tasa de Falla'!JA47=0,\"\",'[3]Tasa de Falla'!JA47)","v":"XXXX"},{"$f":"IF('[3]Tasa de Falla'!JB47=0,\"\",'[3]Tasa de Falla'!JB47)","v":"XXXX"}]
[null,null,{"$f":"'[3]Tasa de Falla'!C48","v":32},{"$f":"'[3]Tasa de Falla'!D48","v":"SAN MARTIN - RECREO"},{"$f":"'[3]Tasa de Falla'!E48","v":132},{"$f":"'[3]Tasa de Falla'!F48","v":115},{"$f":"IF('[3]Tasa de Falla'!IQ48=0,\"\",'[3]Tasa de Falla'!IQ48)","v":"XXXX"},{"$f":"IF('[3]Tasa de Falla'!IR48=0,\"\",'[3]Tasa de Falla'!IR48)","v":"XXXX"},{"$f":"IF('[3]Tasa de Falla'!IS48=0,\"\",'[3]Tasa de Falla'!IS48)","v":"XXXX"},{"$f":"IF('[3]Tasa de Falla'!IT48=0,\"\",'[3]Tasa de Falla'!IT48)","v":"XXXX"},{"$f":"IF('[3]Tasa de Falla'!IU48=0,\"\",'[3]Tasa de Falla'!IU48)","v":"XXXX"},{"$f":"IF('[3]Tasa de Falla'!IV48=0,\"\",'[3]Tasa de Falla'!IV48)","v":"XXXX"},{"$f":"IF('[3]Tasa de Falla'!IW48=0,\"\",'[3]Tasa de Falla'!IW48)","v":"XXXX"},{"$f":"IF('[3]Tasa de Falla'!IX48=0,\"\",'[3]Tasa de Falla'!IX48)","v":"XXXX"},{"$f":"IF('[3]Tasa de Falla'!IY48=0,\"\",'[3]Tasa de Falla'!IY48)","v":"XXXX"},{"$f":"IF('[3]Tasa de Falla'!IZ48=0,\"\",'[3]Tasa de Falla'!IZ48)","v":"XXXX"},{"$f":"IF('[3]Tasa de Falla'!JA48=0,\"\",'[3]Tasa de Falla'!JA48)","v":"XXXX"},{"$f":"IF('[3]Tasa de Falla'!JB48=0,\"\",'[3]Tasa de Falla'!JB48)","v":"XXXX"}]
[null,null,{"$f":"'[3]Tasa de Falla'!C49","v":33},{"$f":"'[3]Tasa de Falla'!D49","v":"SAN MARTIN C. - LA RIOJA"},{"$f":"'[3]Tasa de Falla'!E49","v":132},{"$f":"'[3]Tasa de Falla'!F49","v":105},{"$f":"IF('[3]Tasa de Falla'!IQ49=0,\"\",'[3]Tasa de Falla'!IQ49)","v":"XXXX"},{"$f":"IF('[3]Tasa de Falla'!IR49=0,\"\",'[3]Tasa de Falla'!IR49)","v":"XXXX"},{"$f":"IF('[3]Tasa de Falla'!IS49=0,\"\",'[3]Tasa de Falla'!IS49)","v":"XXXX"},{"$f":"IF('[3]Tasa de Falla'!IT49=0,\"\",'[3]Tasa de Falla'!IT49)","v":"XXXX"},{"$f":"IF('[3]Tasa de Falla'!IU49=0,\"\",'[3]Tasa de Falla'!IU49)","v":"XXXX"},{"$f":"IF('[3]Tasa de Falla'!IV49=0,\"\",'[3]Tasa de Falla'!IV49)","v":"XXXX"},{"$f":"IF('[3]Tasa de Falla'!IW49=0,\"\",'[3]Tasa de Falla'!IW49)","v":"XXXX"},{"$f":"IF('[3]Tasa de Falla'!IX49=0,\"\",'[3]Tasa de Falla'!IX49)","v":"XXXX"},{"$f":"IF('[3]Tasa de Falla'!IY49=0,\"\",'[3]Tasa de Falla'!IY49)","v":"XXXX"},{"$f":"IF('[3]Tasa de Falla'!IZ49=0,\"\",'[3]Tasa de Falla'!IZ49)","v":"XXXX"},{"$f":"IF('[3]Tasa de Falla'!JA49=0,\"\",'[3]Tasa de Falla'!JA49)","v":"XXXX"},{"$f":"IF('[3]Tasa de Falla'!JB49=0,\"\",'[3]Tasa de Falla'!JB49)","v":"XXXX"}]
[null,null,{"$f":"'[3]Tasa de Falla'!C50","v":34},{"$f":"'[3]Tasa de Falla'!D50","v":"SAN PEDRO JUJUY - LIBERTADOR NOA."},{"$f":"'[3]Tasa de Falla'!E50","v":132},{"$f":"'[3]Tasa de Falla'!F50","v":49},{"$f":"IF('[3]Tasa de Falla'!IQ50=0,\"\",'[3]Tasa de Falla'!IQ50)","v":""},{"$f":"IF('[3]Tasa de Falla'!IR50=0,\"\",'[3]Tasa de Falla'!IR50)","v":1},{"$f":"IF('[3]Tasa de Falla'!IS50=0,\"\",'[3]Tasa de Falla'!IS50)","v":""},{"$f":"IF('[3]Tasa de Falla'!IT50=0,\"\",'[3]Tasa de Falla'!IT50)","v":""},{"$f":"IF('[3]Tasa de Falla'!IU50=0,\"\",'[3]Tasa de Falla'!IU50)","v":""},{"$f":"IF('[3]Tasa de Falla'!IV50=0,\"\",'[3]Tasa de Falla'!IV50)","v":""},{"$f":"IF('[3]Tasa de Falla'!IW50=0,\"\",'[3]Tasa de Falla'!IW50)","v":""},{"$f":"IF('[3]Tasa de Falla'!IX50=0,\"\",'[3]Tasa de Falla'!IX50)","v":""},{"$f":"IF('[3]Tasa de Falla'!IY50=0,\"\",'[3]Tasa de Falla'!IY50)","v":""},{"$f":"IF('[3]Tasa de Falla'!IZ50=0,\"\",'[3]Tasa de Falla'!IZ50)","v":""},{"$f":"IF('[3]Tasa de Falla'!JA50=0,\"\",'[3]Tasa de Falla'!JA50)","v":""},{"$f":"IF('[3]Tasa de Falla'!JB50=0,\"\",'[3]Tasa de Falla'!JB50)","v":""}]
[null,null,{"$f":"'[3]Tasa de Falla'!C51","v":35},{"$f":"'[3]Tasa de Falla'!D51","v":"TUCUMAN NORTE - EL BRACHO"},{"$f":"'[3]Tasa de Falla'!E51","v":132},{"$f":"'[3]Tasa de Falla'!F51","v":31.5},{"$f":"IF('[3]Tasa de Falla'!IQ51=0,\"\",'[3]Tasa de Falla'!IQ51)","v":""},{"$f":"IF('[3]Tasa de Falla'!IR51=0,\"\",'[3]Tasa de Falla'!IR51)","v":1},{"$f":"IF('[3]Tasa de Falla'!IS51=0,\"\",'[3]Tasa de Falla'!IS51)","v":""},{"$f":"IF('[3]Tasa de Falla'!IT51=0,\"\",'[3]Tasa de Falla'!IT51)","v":""},{"$f":"IF('[3]Tasa de Falla'!IU51=0,\"\",'[3]Tasa de Falla'!IU51)","v":""},{"$f":"IF('[3]Tasa de Falla'!IV51=0,\"\",'[3]Tasa de Falla'!IV51)","v":""},{"$f":"IF('[3]Tasa de Falla'!IW51=0,\"\",'[3]Tasa de Falla'!IW51)","v":""},{"$f":"IF('[3]Tasa de Falla'!IX51=0,\"\",'[3]Tasa de Falla'!IX51)","v":""},{"$f":"IF('[3]Tasa de Falla'!IY51=0,\"\",'[3]Tasa de Falla'!IY51)","v":""},{"$f":"IF('[3]Tasa de Falla'!IZ51=0,\"\",'[3]Tasa de Falla'!IZ51)","v":""},{"$f":"IF('[3]Tasa de Falla'!JA51=0,\"\",'[3]Tasa de Falla'!JA51)","v":1},{"$f":"IF('[3]Tasa de Falla'!JB51=0,\"\",'[3]Tasa de Falla'!JB51)","v":""}]
[null,null,{"$f":"'[3]Tasa de Falla'!C52","v":36},{"$f":"'[3]Tasa de Falla'!D52","v":"C.H. EL CADILLAL - TUCUMAN NORTE"},{"$f":"'[3]Tasa de Falla'!E52","v":132},{"$f":"'[3]Tasa de Falla'!F52","v":21.8},{"$f":"IF('[3]Tasa de Falla'!IQ52=0,\"\",'[3]Tasa de Falla'!IQ52)","v":""},{"$f":"IF('[3]Tasa de Falla'!IR52=0,\"\",'[3]Tasa de Falla'!IR52)","v":""},{"$f":"IF('[3]Tasa de Falla'!IS52=0,\"\",'[3]Tasa de Falla'!IS52)","v":""},{"$f":"IF('[3]Tasa de Falla'!IT52=0,\"\",'[3]Tasa de Falla'!IT52)","v":1},{"$f":"IF('[3]Tasa de Falla'!IU52=0,\"\",'[3]Tasa de Falla'!IU52)","v":2},{"$f":"IF('[3]Tasa de Falla'!IV52=0,\"\",'[3]Tasa de Falla'!IV52)","v":""},{"$f":"IF('[3]Tasa de Falla'!IW52=0,\"\",'[3]Tasa de Falla'!IW52)","v":1},{"$f":"IF('[3]Tasa de Falla'!IX52=0,\"\",'[3]Tasa de Falla'!IX52)","v":""},{"$f":"IF('[3]Tasa de Falla'!IY52=0,\"\",'[3]Tasa de Falla'!IY52)","v":""},{"$f":"IF('[3]Tasa de Falla'!IZ52=0,\"\",'[3]Tasa de Falla'!IZ52)","v":""},{"$f":"IF('[3]Tasa de Falla'!JA52=0,\"\",'[3]Tasa de Falla'!JA52)","v":""},{"$f":"IF('[3]Tasa de Falla'!JB52=0,\"\",'[3]Tasa de Falla'!JB52)","v":""}]
[null,null,{"$f":"'[3]Tasa de Falla'!C53","v":37},{"$f":"'[3]Tasa de Falla'!D53","v":"TUCUMAN NORTE - CABRA CORRAL"},{"$f":"'[3]Tasa de Falla'!E53","v":132},{"$f":"'[3]Tasa de Falla'!F53","v":190},{"$f":"IF('[3]Tasa de Falla'!IQ53=0,\"\",'[3]Tasa de Falla'!IQ53)","v":"XXXX"},{"$f":"IF('[3]Tasa de Falla'!IR53=0,\"\",'[3]Tasa de Falla'!IR53)","v":"XXXX"},{"$f":"IF('[3]Tasa de Falla'!IS53=0,\"\",'[3]Tasa de Falla'!IS53)","v":"XXXX"},{"$f":"IF('[3]Tasa de Falla'!IT53=0,\"\",'[3]Tasa de Falla'!IT53)","v":"XXXX"},{"$f":"IF('[3]Tasa de Falla'!IU53=0,\"\",'[3]Tasa de Falla'!IU53)","v":"XXXX"},{"$f":"IF('[3]Tasa de Falla'!IV53=0,\"\",'[3]Tasa de Falla'!IV53)","v":"XXXX"},{"$f":"IF('[3]Tasa de Falla'!IW53=0,\"\",'[3]Tasa de Falla'!IW53)","v":"XXXX"},{"$f":"IF('[3]Tasa de Falla'!IX53=0,\"\",'[3]Tasa de Falla'!IX53)","v":"XXXX"},{"$f":"IF('[3]Tasa de Falla'!IY53=0,\"\",'[3]Tasa de Falla'!IY53)","v":"XXXX"},{"$f":"IF('[3]Tasa de Falla'!IZ53=0,\"\",'[3]Tasa de Falla'!IZ53)","v":"XXXX"},{"$f":"IF('[3]Tasa de Falla'!JA53=0,\"\",'[3]Tasa de Falla'!JA53)","v":"XXXX"},{"$f":"IF('[3]Tasa de Falla'!JB53=0,\"\",'[3]Tasa de Falla'!JB53)","v":"XXXX"}]
[null,null,{"$f":"'[3]Tasa de Falla'!C54","v":38},{"$f":"'[3]Tasa de Falla'!D54","v":"METAN - TUCUMAN NORTE"},{"$f":"'[3]Tasa de Falla'!E54","v":132},{"$f":"'[3]Tasa de Falla'!F54","v":155.6},{"$f":"IF('[3]Tasa de Falla'!IQ54=0,\"\",'[3]Tasa de Falla'!IQ54)","v":""},{"$f":"IF('[3]Tasa de Falla'!IR54=0,\"\",'[3]Tasa de Falla'!IR54)","v":1},{"$f":"IF('[3]Tasa de Falla'!IS54=0,\"\",'[3]Tasa de Falla'!IS54)","v":1},{"$f":"IF('[3]Tasa de Falla'!IT54=0,\"\",'[3]Tasa de Falla'!IT54)","v":1},{"$f":"IF('[3]Tasa de Falla'!IU54=0,\"\",'[3]Tasa de Falla'!IU54)","v":""},{"$f":"IF('[3]Tasa de Falla'!IV54=0,\"\",'[3]Tasa de Falla'!IV54)","v":""},{"$f":"IF('[3]Tasa de Falla'!IW54=0,\"\",'[3]Tasa de Falla'!IW54)","v":""},{"$f":"IF('[3]Tasa de Falla'!IX54=0,\"\",'[3]Tasa de Falla'!IX54)","v":""},{"$f":"IF('[3]Tasa de Falla'!IY54=0,\"\",'[3]Tasa de Falla'!IY54)","v":""},{"$f":"IF('[3]Tasa de Falla'!IZ54=0,\"\",'[3]Tasa de Falla'!IZ54)","v":""},{"$f":"IF('[3]Tasa de Falla'!JA54=0,\"\",'[3]Tasa de Falla'!JA54)","v":""},{"$f":"IF('[3]Tasa de Falla'!JB54=0,\"\",'[3]Tasa de Falla'!JB54)","v":""}]
[null,null,{"$f":"'[3]Tasa de Falla'!C55","v":39},{"$f":"'[3]Tasa de Falla'!D55","v":"SARMIENTO - TUCUMAN NORTE (O.F.)"},{"$f":"'[3]Tasa de Falla'!E55","v":132},{"$f":"'[3]Tasa de Falla'!F55","v":3.3},{"$f":"IF('[3]Tasa de Falla'!IQ55=0,\"\",'[3]Tasa de Falla'!IQ55)","v":""},{"$f":"IF('[3]Tasa de Falla'!IR55=0,\"\",'[3]Tasa de Falla'!IR55)","v":""},{"$f":"IF('[3]Tasa de Falla'!IS55=0,\"\",'[3]Tasa de Falla'!IS55)","v":""},{"$f":"IF('[3]Tasa de Falla'!IT55=0,\"\",'[3]Tasa de Falla'!IT55)","v":""},{"$f":"IF('[3]Tasa de Falla'!IU55=0,\"\",'[3]Tasa de Falla'!IU55)","v":""},{"$f":"IF('[3]Tasa de Falla'!IV55=0,\"\",'[3]Tasa de Falla'!IV55)","v":""},{"$f":"IF('[3]Tasa de Falla'!IW55=0,\"\",'[3]Tasa de Falla'!IW55)","v":""},{"$f":"IF('[3]Tasa de Falla'!IX55=0,\"\",'[3]Tasa de Falla'!IX55)","v":""},{"$f":"IF('[3]Tasa de Falla'!IY55=0,\"\",'[3]Tasa de Falla'!IY55)","v":""},{"$f":"IF('[3]Tasa de Falla'!IZ55=0,\"\",'[3]Tasa de Falla'!IZ55)","v":""},{"$f":"IF('[3]Tasa de Falla'!JA55=0,\"\",'[3]Tasa de Falla'!JA55)","v":""},{"$f":"IF('[3]Tasa de Falla'!JB55=0,\"\",'[3]Tasa de Falla'!JB55)","v":""}]
[null,null,{"$f":"'[3]Tasa de Falla'!C56","v":40},{"$f":"'[3]Tasa de Falla'!D56","v":"TUCUMAN OESTE - TUCUMAN NORTE"},{"$f":"'[3]Tasa de Falla'!E56","v":132},{"$f":"'[3]Tasa de Falla'!F56","v":7},{"$f":"IF('[3]Tasa de Falla'!IQ56=0,\"\",'[3]Tasa de Falla'!IQ56)","v":""},{"$f":"IF('[3]Tasa de Falla'!IR56=0,\"\",'[3]Tasa de Falla'!IR56)","v":1},{"$f":"IF('[3]Tasa de Falla'!IS56=0,\"\",'[3]Tasa de Falla'!IS56)","v":""},{"$f":"IF('[3]Tasa de Falla'!IT56=0,\"\",'[3]Tasa de Falla'!IT56)","v":""},{"$f":"IF('[3]Tasa de Falla'!IU56=0,\"\",'[3]Tasa de Falla'!IU56)","v":""},{"$f":"IF('[3]Tasa de Falla'!IV56=0,\"\",'[3]Tasa de Falla'!IV56)","v":""},{"$f":"IF('[3]Tasa de Falla'!IW56=0,\"\",'[3]Tasa de Falla'!IW56)","v":""},{"$f":"IF('[3]Tasa de Falla'!IX56=0,\"\",'[3]Tasa de Falla'!IX56)","v":""},{"$f":"IF('[3]Tasa de Falla'!IY56=0,\"\",'[3]Tasa de Falla'!IY56)","v":""},{"$f":"IF('[3]Tasa de Falla'!IZ56=0,\"\",'[3]Tasa de Falla'!IZ56)","v":1},{"$f":"IF('[3]Tasa de Falla'!JA56=0,\"\",'[3]Tasa de Falla'!JA56)","v":1},{"$f":"IF('[3]Tasa de Falla'!JB56=0,\"\",'[3]Tasa de Falla'!JB56)","v":""}]
[null,null,{"$f":"'[3]Tasa de Falla'!C57","v":41},{"$f":"'[3]Tasa de Falla'!D57","v":"AGUILARES - VILLA QUINTEROS"},{"$f":"'[3]Tasa de Falla'!E57","v":132},{"$f":"'[3]Tasa de Falla'!F57","v":21},{"$f":"IF('[3]Tasa de Falla'!IQ57=0,\"\",'[3]Tasa de Falla'!IQ57)","v":""},{"$f":"IF('[3]Tasa de Falla'!IR57=0,\"\",'[3]Tasa de Falla'!IR57)","v":""},{"$f":"IF('[3]Tasa de Falla'!IS57=0,\"\",'[3]Tasa de Falla'!IS57)","v":""},{"$f":"IF('[3]Tasa de Falla'!IT57=0,\"\",'[3]Tasa de Falla'!IT57)","v":""},{"$f":"IF('[3]Tasa de Falla'!IU57=0,\"\",'[3]Tasa de Falla'!IU57)","v":""},{"$f":"IF('[3]Tasa de Falla'!IV57=0,\"\",'[3]Tasa de Falla'!IV57)","v":""},{"$f":"IF('[3]Tasa de Falla'!IW57=0,\"\",'[3]Tasa de Falla'!IW57)","v":1},{"$f":"IF('[3]Tasa de Falla'!IX57=0,\"\",'[3]Tasa de Falla'!IX57)","v":""},{"$f":"IF('[3]Tasa de Falla'!IY57=0,\"\",'[3]Tasa de Falla'!IY57)","v":""},{"$f":"IF('[3]Tasa de Falla'!IZ57=0,\"\",'[3]Tasa de Falla'!IZ57)","v":""},{"$f":"IF('[3]Tasa de Falla'!JA57=0,\"\",'[3]Tasa de Falla'!JA57)","v":""},{"$f":"IF('[3]Tasa de Falla'!JB57=0,\"\",'[3]Tasa de Falla'!JB57)","v":""}]
[null,null,{"$f":"'[3]Tasa de Falla'!C58","v":42},{"$f":"'[3]Tasa de Falla'!D58","v":"C.H. PUEBLO VIEJO - VILLA QUINTEROS "},{"$f":"'[3]Tasa de Falla'!E58","v":132},{"$f":"'[3]Tasa de Falla'!F58","v":24.5},{"$f":"IF('[3]Tasa de Falla'!IQ58=0,\"\",'[3]Tasa de Falla'!IQ58)","v":""},{"$f":"IF('[3]Tasa de Falla'!IR58=0,\"\",'[3]Tasa de Falla'!IR58)","v":3},{"$f":"IF('[3]Tasa de Falla'!IS58=0,\"\",'[3]Tasa de Falla'!IS58)","v":""},{"$f":"IF('[3]Tasa de Falla'!IT58=0,\"\",'[3]Tasa de Falla'!IT58)","v":""},{"$f":"IF('[3]Tasa de Falla'!IU58=0,\"\",'[3]Tasa de Falla'!IU58)","v":""},{"$f":"IF('[3]Tasa de Falla'!IV58=0,\"\",'[3]Tasa de Falla'!IV58)","v":1},{"$f":"IF('[3]Tasa de Falla'!IW58=0,\"\",'[3]Tasa de Falla'!IW58)","v":""},{"$f":"IF('[3]Tasa de Falla'!IX58=0,\"\",'[3]Tasa de Falla'!IX58)","v":""},{"$f":"IF('[3]Tasa de Falla'!IY58=0,\"\",'[3]Tasa de Falla'!IY58)","v":""},{"$f":"IF('[3]Tasa de Falla'!IZ58=0,\"\",'[3]Tasa de Falla'!IZ58)","v":""},{"$f":"IF('[3]Tasa de Falla'!JA58=0,\"\",'[3]Tasa de Falla'!JA58)","v":""},{"$f":"IF('[3]Tasa de Falla'!JB58=0,\"\",'[3]Tasa de Falla'!JB58)","v":""}]
[null,null,{"$f":"'[3]Tasa de Falla'!C59","v":43},{"$f":"'[3]Tasa de Falla'!D59","v":"C.H. RIO HONDO - VILLA QUINTEROS"},{"$f":"'[3]Tasa de Falla'!E59","v":132},{"$f":"'[3]Tasa de Falla'!F59","v":75.400000000000006},{"$f":"IF('[3]Tasa de Falla'!IQ59=0,\"\",'[3]Tasa de Falla'!IQ59)","v":""},{"$f":"IF('[3]Tasa de Falla'!IR59=0,\"\",'[3]Tasa de Falla'!IR59)","v":""},{"$f":"IF('[3]Tasa de Falla'!IS59=0,\"\",'[3]Tasa de Falla'!IS59)","v":""},{"$f":"IF('[3]Tasa de Falla'!IT59=0,\"\",'[3]Tasa de Falla'!IT59)","v":""},{"$f":"IF('[3]Tasa de Falla'!IU59=0,\"\",'[3]Tasa de Falla'!IU59)","v":""},{"$f":"IF('[3]Tasa de Falla'!IV59=0,\"\",'[3]Tasa de Falla'!IV59)","v":""},{"$f":"IF('[3]Tasa de Falla'!IW59=0,\"\",'[3]Tasa de Falla'!IW59)","v":""},{"$f":"IF('[3]Tasa de Falla'!IX59=0,\"\",'[3]Tasa de Falla'!IX59)","v":""},{"$f":"IF('[3]Tasa de Falla'!IY59=0,\"\",'[3]Tasa de Falla'!IY59)","v":""},{"$f":"IF('[3]Tasa de Falla'!IZ59=0,\"\",'[3]Tasa de Falla'!IZ59)","v":""},{"$f":"IF('[3]Tasa de Falla'!JA59=0,\"\",'[3]Tasa de Falla'!JA59)","v":""},{"$f":"IF('[3]Tasa de Falla'!JB59=0,\"\",'[3]Tasa de Falla'!JB59)","v":1}]
[null,null,{"$f":"'[3]Tasa de Falla'!C60","v":44},{"$f":"'[3]Tasa de Falla'!D60","v":"C.H. RIO HONDO - SANTIAGO CENTRO"},{"$f":"'[3]Tasa de Falla'!E60","v":132},{"$f":"'[3]Tasa de Falla'!F60","v":79},{"$f":"IF('[3]Tasa de Falla'!IQ60=0,\"\",'[3]Tasa de Falla'!IQ60)","v":"XXXX"},{"$f":"IF('[3]Tasa de Falla'!IR60=0,\"\",'[3]Tasa de Falla'!IR60)","v":"XXXX"},{"$f":"IF('[3]Tasa de Falla'!IS60=0,\"\",'[3]Tasa de Falla'!IS60)","v":"XXXX"},{"$f":"IF('[3]Tasa de Falla'!IT60=0,\"\",'[3]Tasa de Falla'!IT60)","v":"XXXX"},{"$f":"IF('[3]Tasa de Falla'!IU60=0,\"\",'[3]Tasa de Falla'!IU60)","v":"XXXX"},{"$f":"IF('[3]Tasa de Falla'!IV60=0,\"\",'[3]Tasa de Falla'!IV60)","v":"XXXX"},{"$f":"IF('[3]Tasa de Falla'!IW60=0,\"\",'[3]Tasa de Falla'!IW60)","v":"XXXX"},{"$f":"IF('[3]Tasa de Falla'!IX60=0,\"\",'[3]Tasa de Falla'!IX60)","v":"XXXX"},{"$f":"IF('[3]Tasa de Falla'!IY60=0,\"\",'[3]Tasa de Falla'!IY60)","v":"XXXX"},{"$f":"IF('[3]Tasa de Falla'!IZ60=0,\"\",'[3]Tasa de Falla'!IZ60)","v":"XXXX"},{"$f":"IF('[3]Tasa de Falla'!JA60=0,\"\",'[3]Tasa de Falla'!JA60)","v":"XXXX"},{"$f":"IF('[3]Tasa de Falla'!JB60=0,\"\",'[3]Tasa de Falla'!JB60)","v":"XXXX"}]
[null,null,{"$f":"'[3]Tasa de Falla'!C61","v":45},{"$f":"'[3]Tasa de Falla'!D61","v":"C.H. RIO HONDO - EL BRACHO"},{"$f":"'[3]Tasa de Falla'!E61","v":132},{"$f":"'[3]Tasa de Falla'!F61","v":80.66},{"$f":"IF('[3]Tasa de Falla'!IQ61=0,\"\",'[3]Tasa de Falla'!IQ61)","v":""},{"$f":"IF('[3]Tasa de Falla'!IR61=0,\"\",'[3]Tasa de Falla'!IR61)","v":""},{"$f":"IF('[3]Tasa de Falla'!IS61=0,\"\",'[3]Tasa de Falla'!IS61)","v":"XXXX"},{"$f":"IF('[3]Tasa de Falla'!IT61=0,\"\",'[3]Tasa de Falla'!IT61)","v":"XXXX"},{"$f":"IF('[3]Tasa de Falla'!IU61=0,\"\",'[3]Tasa de Falla'!IU61)","v":"XXXX"},{"$f":"IF('[3]Tasa de Falla'!IV61=0,\"\",'[3]Tasa de Falla'!IV61)","v":"XXXX"},{"$f":"IF('[3]Tasa de Falla'!IW61=0,\"\",'[3]Tasa de Falla'!IW61)","v":"XXXX"},{"$f":"IF('[3]Tasa de Falla'!IX61=0,\"\",'[3]Tasa de Falla'!IX61)","v":"XXXX"},{"$f":"IF('[3]Tasa de Falla'!IY61=0,\"\",'[3]Tasa de Falla'!IY61)","v":"XXXX"},{"$f":"IF('[3]Tasa de Falla'!IZ61=0,\"\",'[3]Tasa de Falla'!IZ61)","v":"XXXX"},{"$f":"IF('[3]Tasa de Falla'!JA61=0,\"\",'[3]Tasa de Falla'!JA61)","v":"XXXX"},{"$f":"IF('[3]Tasa de Falla'!JB61=0,\"\",'[3]Tasa de Falla'!JB61)","v":"XXXX"}]
[null,null,{"$f":"'[3]Tasa de Falla'!C62","v":46},{"$f":"'[3]Tasa de Falla'!D62","v":"SALTA SUR - SALTA NORTE"},{"$f":"'[3]Tasa de Falla'!E62","v":132},{"$f":"'[3]Tasa de Falla'!F62","v":10},{"$f":"IF('[3]Tasa de Falla'!IQ62=0,\"\",'[3]Tasa de Falla'!IQ62)","v":""},{"$f":"IF('[3]Tasa de Falla'!IR62=0,\"\",'[3]Tasa de Falla'!IR62)","v":""},{"$f":"IF('[3]Tasa de Falla'!IS62=0,\"\",'[3]Tasa de Falla'!IS62)","v":""},{"$f":"IF('[3]Tasa de Falla'!IT62=0,\"\",'[3]Tasa de Falla'!IT62)","v":""},{"$f":"IF('[3]Tasa de Falla'!IU62=0,\"\",'[3]Tasa de Falla'!IU62)","v":""},{"$f":"IF('[3]Tasa de Falla'!IV62=0,\"\",'[3]Tasa de Falla'!IV62)","v":""},{"$f":"IF('[3]Tasa de Falla'!IW62=0,\"\",'[3]Tasa de Falla'!IW62)","v":""},{"$f":"IF('[3]Tasa de Falla'!IX62=0,\"\",'[3]Tasa de Falla'!IX62)","v":""},{"$f":"IF('[3]Tasa de Falla'!IY62=0,\"\",'[3]Tasa de Falla'!IY62)","v":""},{"$f":"IF('[3]Tasa de Falla'!IZ62=0,\"\",'[3]Tasa de Falla'!IZ62)","v":""},{"$f":"IF('[3]Tasa de Falla'!JA62=0,\"\",'[3]Tasa de Falla'!JA62)","v":""},{"$f":"IF('[3]Tasa de Falla'!JB62=0,\"\",'[3]Tasa de Falla'!JB62)","v":""}]
[null,null,{"$f":"'[3]Tasa de Falla'!C63","v":47},{"$f":"'[3]Tasa de Falla'!D63","v":"PALPALA - JUJUY ESTE"},{"$f":"'[3]Tasa de Falla'!E63","v":132},{"$f":"'[3]Tasa de Falla'!F63","v":12.3},{"$f":"IF('[3]Tasa de Falla'!IQ63=0,\"\",'[3]Tasa de Falla'!IQ63)","v":""},{"$f":"IF('[3]Tasa de Falla'!IR63=0,\"\",'[3]Tasa de Falla'!IR63)","v":""},{"$f":"IF('[3]Tasa de Falla'!IS63=0,\"\",'[3]Tasa de Falla'!IS63)","v":""},{"$f":"IF('[3]Tasa de Falla'!IT63=0,\"\",'[3]Tasa de Falla'!IT63)","v":1},{"$f":"IF('[3]Tasa de Falla'!IU63=0,\"\",'[3]Tasa de Falla'!IU63)","v":""},{"$f":"IF('[3]Tasa de Falla'!IV63=0,\"\",'[3]Tasa de Falla'!IV63)","v":""},{"$f":"IF('[3]Tasa de Falla'!IW63=0,\"\",'[3]Tasa de Falla'!IW63)","v":1},{"$f":"IF('[3]Tasa de Falla'!IX63=0,\"\",'[3]Tasa de Falla'!IX63)","v":""},{"$f":"IF('[3]Tasa de Falla'!IY63=0,\"\",'[3]Tasa de Falla'!IY63)","v":""},{"$f":"IF('[3]Tasa de Falla'!IZ63=0,\"\",'[3]Tasa de Falla'!IZ63)","v":""},{"$f":"IF('[3]Tasa de Falla'!JA63=0,\"\",'[3]Tasa de Falla'!JA63)","v":""},{"$f":"IF('[3]Tasa de Falla'!JB63=0,\"\",'[3]Tasa de Falla'!JB63)","v":""}]
[null,null,{"$f":"'[3]Tasa de Falla'!C64","v":48},{"$f":"'[3]Tasa de Falla'!D64","v":"JUJUY ESTE - JUJUY SUR"},{"$f":"'[3]Tasa de Falla'!E64","v":132},{"$f":"'[3]Tasa de Falla'!F64","v":4.3},{"$f":"IF('[3]Tasa de Falla'!IQ64=0,\"\",'[3]Tasa de Falla'!IQ64)","v":""},{"$f":"IF('[3]Tasa de Falla'!IR64=0,\"\",'[3]Tasa de Falla'!IR64)","v":""},{"$f":"IF('[3]Tasa de Falla'!IS64=0,\"\",'[3]Tasa de Falla'!IS64)","v":""},{"$f":"IF('[3]Tasa de Falla'!IT64=0,\"\",'[3]Tasa de Falla'!IT64)","v":""},{"$f":"IF('[3]Tasa de Falla'!IU64=0,\"\",'[3]Tasa de Falla'!IU64)","v":""},{"$f":"IF('[3]Tasa de Falla'!IV64=0,\"\",'[3]Tasa de Falla'!IV64)","v":""},{"$f":"IF('[3]Tasa de Falla'!IW64=0,\"\",'[3]Tasa de Falla'!IW64)","v":""},{"$f":"IF('[3]Tasa de Falla'!IX64=0,\"\",'[3]Tasa de Falla'!IX64)","v":""},{"$f":"IF('[3]Tasa de Falla'!IY64=0,\"\",'[3]Tasa de Falla'!IY64)","v":""},{"$f":"IF('[3]Tasa de Falla'!IZ64=0,\"\",'[3]Tasa de Falla'!IZ64)","v":""},{"$f":"IF('[3]Tasa de Falla'!JA64=0,\"\",'[3]Tasa de Falla'!JA64)","v":""},{"$f":"IF('[3]Tasa de Falla'!JB64=0,\"\",'[3]Tasa de Falla'!JB64)","v":""}]
[null,null,{"$f":"'[3]Tasa de Falla'!C65","v":49},{"$f":"'[3]Tasa de Falla'!D65","v":"CEVIL POZO - GUEMES"},{"$f":"'[3]Tasa de Falla'!E65","v":132},{"$f":"'[3]Tasa de Falla'!F65","v":291},{"$f":"IF('[3]Tasa de Falla'!IQ65=0,\"\",'[3]Tasa de Falla'!IQ65)","v":"XXXX"},{"$f":"IF('[3]Tasa de Falla'!IR65=0,\"\",'[3]Tasa de Falla'!IR65)","v":"XXXX"},{"$f":"IF('[3]Tasa de Falla'!IS65=0,\"\",'[3]Tasa de Falla'!IS65)","v":"XXXX"},{"$f":"IF('[3]Tasa de Falla'!IT65=0,\"\",'[3]Tasa de Falla'!IT65)","v":"XXXX"},{"$f":"IF('[3]Tasa de Falla'!IU65=0,\"\",'[3]Tasa de Falla'!IU65)","v":"XXXX"},{"$f":"IF('[3]Tasa de Falla'!IV65=0,\"\",'[3]Tasa de Falla'!IV65)","v":"XXXX"},{"$f":"IF('[3]Tasa de Falla'!IW65=0,\"\",'[3]Tasa de Falla'!IW65)","v":"XXXX"},{"$f":"IF('[3]Tasa de Falla'!IX65=0,\"\",'[3]Tasa de Falla'!IX65)","v":"XXXX"},{"$f":"IF('[3]Tasa de Falla'!IY65=0,\"\",'[3]Tasa de Falla'!IY65)","v":"XXXX"},{"$f":"IF('[3]Tasa de Falla'!IZ65=0,\"\",'[3]Tasa de Falla'!IZ65)","v":"XXXX"},{"$f":"IF('[3]Tasa de Falla'!JA65=0,\"\",'[3]Tasa de Falla'!JA65)","v":"XXXX"},{"$f":"IF('[3]Tasa de Falla'!JB65=0,\"\",'[3]Tasa de Falla'!JB65)","v":"XXXX"}]
[null,null,{"$f":"'[3]Tasa de Falla'!C66","v":50},{"$f":"'[3]Tasa de Falla'!D66","v":"CEVIL POZO - EL BRACHO"},{"$f":"'[3]Tasa de Falla'!E66","v":132},{"$f":"'[3]Tasa de Falla'!F66","v":17},{"$f":"IF('[3]Tasa de Falla'!IQ66=0,\"\",'[3]Tasa de Falla'!IQ66)","v":""},{"$f":"IF('[3]Tasa de Falla'!IR66=0,\"\",'[3]Tasa de Falla'!IR66)","v":""},{"$f":"IF('[3]Tasa de Falla'!IS66=0,\"\",'[3]Tasa de Falla'!IS66)","v":""},{"$f":"IF('[3]Tasa de Falla'!IT66=0,\"\",'[3]Tasa de Falla'!IT66)","v":""},{"$f":"IF('[3]Tasa de Falla'!IU66=0,\"\",'[3]Tasa de Falla'!IU66)","v":""},{"$f":"IF('[3]Tasa de Falla'!IV66=0,\"\",'[3]Tasa de Falla'!IV66)","v":""},{"$f":"IF('[3]Tasa de Falla'!IW66=0,\"\",'[3]Tasa de Falla'!IW66)","v":""},{"$f":"IF('[3]Tasa de Falla'!IX66=0,\"\",'[3]Tasa de Falla'!IX66)","v":""},{"$f":"IF('[3]Tasa de Falla'!IY66=0,\"\",'[3]Tasa de Falla'!IY66)","v":""},{"$f":"IF('[3]Tasa de Falla'!IZ66=0,\"\",'[3]Tasa de Falla'!IZ66)","v":""},{"$f":"IF('[3]Tasa de Falla'!JA66=0,\"\",'[3]Tasa de Falla'!JA66)","v":""},{"$f":"IF('[3]Tasa de Falla'!JB66=0,\"\",'[3]Tasa de Falla'!JB66)","v":""}]
[null,null,{"$f":"'[3]Tasa de Falla'!C67","v":0},{"$f":"'[3]Tasa de Falla'!D67","v":0},{"$f":"'[3]Tasa de Falla'!E67","v":0},{"$f":"'[3]Tasa de Falla'!F67","v":0},{"$f":"IF('[3]Tasa de Falla'!IQ67=0,\"\",'[3]Tasa de Falla'!IQ67)","v":""},{"$f":"IF('[3]Tasa de Falla'!IR67=0,\"\",'[3]Tasa de Falla'!IR67)","v":""},{"$f":"IF('[3]Tasa de Falla'!IS67=0,\"\",'[3]Tasa de Falla'!IS67)","v":""},{"$f":"IF('[3]Tasa de Falla'!IT67=0,\"\",'[3]Tasa de Falla'!IT67)","v":""},{"$f":"IF('[3]Tasa de Falla'!IU67=0,\"\",'[3]Tasa de Falla'!IU67)","v":""},{"$f":"IF('[3]Tasa de Falla'!IV67=0,\"\",'[3]Tasa de Falla'!IV67)","v":""},{"$f":"IF('[3]Tasa de Falla'!IW67=0,\"\",'[3]Tasa de Falla'!IW67)","v":""},{"$f":"IF('[3]Tasa de Falla'!IX67=0,\"\",'[3]Tasa de Falla'!IX67)","v":""},{"$f":"IF('[3]Tasa de Falla'!IY67=0,\"\",'[3]Tasa de Falla'!IY67)","v":""},{"$f":"IF('[3]Tasa de Falla'!IZ67=0,\"\",'[3]Tasa de Falla'!IZ67)","v":""},{"$f":"IF('[3]Tasa de Falla'!JA67=0,\"\",'[3]Tasa de Falla'!JA67)","v":""},{"$f":"IF('[3]Tasa de Falla'!JB67=0,\"\",'[3]Tasa de Falla'!JB67)","v":""}]
[null,null,{"$f":"'[3]Tasa de Falla'!C68","v":51},{"$f":"'[3]Tasa de Falla'!D68","v":"METAN - EL TUNAL"},{"$f":"'[3]Tasa de Falla'!E68","v":132},{"$f":"'[3]Tasa de Falla'!F68","v":75.599999999999994},{"$f":"IF('[3]Tasa de Falla'!IQ68=0,\"\",'[3]Tasa de Falla'!IQ68)","v":""},{"$f":"IF('[3]Tasa de Falla'!IR68=0,\"\",'[3]Tasa de Falla'!IR68)","v":""},{"$f":"IF('[3]Tasa de Falla'!IS68=0,\"\",'[3]Tasa de Falla'!IS68)","v":""},{"$f":"IF('[3]Tasa de Falla'!IT68=0,\"\",'[3]Tasa de Falla'!IT68)","v":""},{"$f":"IF('[3]Tasa de Falla'!IU68=0,\"\",'[3]Tasa de Falla'!IU68)","v":""},{"$f":"IF('[3]Tasa de Falla'!IV68=0,\"\",'[3]Tasa de Falla'!IV68)","v":""},{"$f":"IF('[3]Tasa de Falla'!IW68=0,\"\",'[3]Tasa de Falla'!IW68)","v":""},{"$f":"IF('[3]Tasa de Falla'!IX68=0,\"\",'[3]Tasa de Falla'!IX68)","v":""},{"$f":"IF('[3]Tasa de Falla'!IY68=0,\"\",'[3]Tasa de Falla'!IY68)","v":""},{"$f":"IF('[3]Tasa de Falla'!IZ68=0,\"\",'[3]Tasa de Falla'!IZ68)","v":""},{"$f":"IF('[3]Tasa de Falla'!JA68=0,\"\",'[3]Tasa de Falla'!JA68)","v":""},{"$f":"IF('[3]Tasa de Falla'!JB68=0,\"\",'[3]Tasa de Falla'!JB68)","v":""}]
[null,null,{"$f":"'[3]Tasa de Falla'!C69","v":52},{"$f":"'[3]Tasa de Falla'!D69","v":"EL TUNAL - J.V. GONZALEZ"},{"$f":"'[3]Tasa de Falla'!E69","v":132},{"$f":"'[3]Tasa de Falla'!F69","v":41.4},{"$f":"IF('[3]Tasa de Falla'!IQ69=0,\"\",'[3]Tasa de Falla'!IQ69)","v":""},{"$f":"IF('[3]Tasa de Falla'!IR69=0,\"\",'[3]Tasa de Falla'!IR69)","v":""},{"$f":"IF('[3]Tasa de Falla'!IS69=0,\"\",'[3]Tasa de Falla'!IS69)","v":""},{"$f":"IF('[3]Tasa de Falla'!IT69=0,\"\",'[3]Tasa de Falla'!IT69)","v":""},{"$f":"IF('[3]Tasa de Falla'!IU69=0,\"\",'[3]Tasa de Falla'!IU69)","v":""},{"$f":"IF('[3]Tasa de Falla'!IV69=0,\"\",'[3]Tasa de Falla'!IV69)","v":""},{"$f":"IF('[3]Tasa de Falla'!IW69=0,\"\",'[3]Tasa de Falla'!IW69)","v":""},{"$f":"IF('[3]Tasa de Falla'!IX69=0,\"\",'[3]Tasa de Falla'!IX69)","v":""},{"$f":"IF('[3]Tasa de Falla'!IY69=0,\"\",'[3]Tasa de Falla'!IY69)","v":""},{"$f":"IF('[3]Tasa de Falla'!IZ69=0,\"\",'[3]Tasa de Falla'!IZ69)","v":""},{"$f":"IF('[3]Tasa de Falla'!JA69=0,\"\",'[3]Tasa de Falla'!JA69)","v":""},{"$f":"IF('[3]Tasa de Falla'!JB69=0,\"\",'[3]Tasa de Falla'!JB69)","v":""}]
[null,null,{"$f":"'[3]Tasa de Falla'!C70","v":0},{"$f":"'[3]Tasa de Falla'!D70","v":0},{"$f":"'[3]Tasa de Falla'!E70","v":0},{"$f":"'[3]Tasa de Falla'!F70","v":0},{"$f":"IF('[3]Tasa de Falla'!IQ70=0,\"\",'[3]Tasa de Falla'!IQ70)","v":""},{"$f":"IF('[3]Tasa de Falla'!IR70=0,\"\",'[3]Tasa de Falla'!IR70)","v":""},{"$f":"IF('[3]Tasa de Falla'!IS70=0,\"\",'[3]Tasa de Falla'!IS70)","v":""},{"$f":"IF('[3]Tasa de Falla'!IT70=0,\"\",'[3]Tasa de Falla'!IT70)","v":""},{"$f":"IF('[3]Tasa de Falla'!IU70=0,\"\",'[3]Tasa de Falla'!IU70)","v":""},{"$f":"IF('[3]Tasa de Falla'!IV70=0,\"\",'[3]Tasa de Falla'!IV70)","v":""},{"$f":"IF('[3]Tasa de Falla'!IW70=0,\"\",'[3]Tasa de Falla'!IW70)","v":""},{"$f":"IF('[3]Tasa de Falla'!IX70=0,\"\",'[3]Tasa de Falla'!IX70)","v":""},{"$f":"IF('[3]Tasa de Falla'!IY70=0,\"\",'[3]Tasa de Falla'!IY70)","v":""},{"$f":"IF('[3]Tasa de Falla'!IZ70=0,\"\",'[3]Tasa de Falla'!IZ70)","v":""},{"$f":"IF('[3]Tasa de Falla'!JA70=0,\"\",'[3]Tasa de Falla'!JA70)","v":""},{"$f":"IF('[3]Tasa de Falla'!JB70=0,\"\",'[3]Tasa de Falla'!JB70)","v":""}]
[null,null,{"$f":"'[3]Tasa de Falla'!C71","v":53},{"$f":"'[3]Tasa de Falla'!D71","v":"LOS PIZARROS - ESCABA"},{"$f":"'[3]Tasa de Falla'!E71","v":132},{"$f":"'[3]Tasa de Falla'!F71","v":21.4},{"$f":"IF('[3]Tasa de Falla'!IQ71=0,\"\",'[3]Tasa de Falla'!IQ71)","v":""},{"$f":"IF('[3]Tasa de Falla'!IR71=0,\"\",'[3]Tasa de Falla'!IR71)","v":1},{"$f":"IF('[3]Tasa de Falla'!IS71=0,\"\",'[3]Tasa de Falla'!IS71)","v":""},{"$f":"IF('[3]Tasa de Falla'!IT71=0,\"\",'[3]Tasa de Falla'!IT71)","v":1},{"$f":"IF('[3]Tasa de Falla'!IU71=0,\"\",'[3]Tasa de Falla'!IU71)","v":""},{"$f":"IF('[3]Tasa de Falla'!IV71=0,\"\",'[3]Tasa de Falla'!IV71)","v":1},{"$f":"IF('[3]Tasa de Falla'!IW71=0,\"\",'[3]Tasa de Falla'!IW71)","v":""},{"$f":"IF('[3]Tasa de Falla'!IX71=0,\"\",'[3]Tasa de Falla'!IX71)","v":""},{"$f":"IF('[3]Tasa de Falla'!IY71=0,\"\",'[3]Tasa de Falla'!IY71)","v":""},{"$f":"IF('[3]Tasa de Falla'!IZ71=0,\"\",'[3]Tasa de Falla'!IZ71)","v":""},{"$f":"IF('[3]Tasa de Falla'!JA71=0,\"\",'[3]Tasa de Falla'!JA71)","v":""},{"$f":"IF('[3]Tasa de Falla'!JB71=0,\"\",'[3]Tasa de Falla'!JB71)","v":1}]
[null,null,{"$f":"'[3]Tasa de Falla'!C72","v":54},{"$f":"'[3]Tasa de Falla'!D72","v":"LOS PIZARROS - LA COCHA"},{"$f":"'[3]Tasa de Falla'!E72","v":132},{"$f":"'[3]Tasa de Falla'!F72","v":6.5},{"$f":"IF('[3]Tasa de Falla'!IQ72=0,\"\",'[3]Tasa de Falla'!IQ72)","v":""},{"$f":"IF('[3]Tasa de Falla'!IR72=0,\"\",'[3]Tasa de Falla'!IR72)","v":""},{"$f":"IF('[3]Tasa de Falla'!IS72=0,\"\",'[3]Tasa de Falla'!IS72)","v":""},{"$f":"IF('[3]Tasa de Falla'!IT72=0,\"\",'[3]Tasa de Falla'!IT72)","v":""},{"$f":"IF('[3]Tasa de Falla'!IU72=0,\"\",'[3]Tasa de Falla'!IU72)","v":""},{"$f":"IF('[3]Tasa de Falla'!IV72=0,\"\",'[3]Tasa de Falla'!IV72)","v":""},{"$f":"IF('[3]Tasa de Falla'!IW72=0,\"\",'[3]Tasa de Falla'!IW72)","v":""},{"$f":"IF('[3]Tasa de Falla'!IX72=0,\"\",'[3]Tasa de Falla'!IX72)","v":""},{"$f":"IF('[3]Tasa de Falla'!IY72=0,\"\",'[3]Tasa de Falla'!IY72)","v":""},{"$f":"IF('[3]Tasa de Falla'!IZ72=0,\"\",'[3]Tasa de Falla'!IZ72)","v":""},{"$f":"IF('[3]Tasa de Falla'!JA72=0,\"\",'[3]Tasa de Falla'!JA72)","v":""},{"$f":"IF('[3]Tasa de Falla'!JB72=0,\"\",'[3]Tasa de Falla'!JB72)","v":""}]
[null,null,{"$f":"'[3]Tasa de Falla'!C73","v":55},{"$f":"'[3]Tasa de Falla'!D73","v":"HUACRA - LOS PIZARROS"},{"$f":"'[3]Tasa de Falla'!E73","v":132},{"$f":"'[3]Tasa de Falla'!F73","v":28.5},{"$f":"IF('[3]Tasa de Falla'!IQ73=0,\"\",'[3]Tasa de Falla'!IQ73)","v":""},{"$f":"IF('[3]Tasa de Falla'!IR73=0,\"\",'[3]Tasa de Falla'!IR73)","v":""},{"$f":"IF('[3]Tasa de Falla'!IS73=0,\"\",'[3]Tasa de Falla'!IS73)","v":""},{"$f":"IF('[3]Tasa de Falla'!IT73=0,\"\",'[3]Tasa de Falla'!IT73)","v":1},{"$f":"IF('[3]Tasa de Falla'!IU73=0,\"\",'[3]Tasa de Falla'!IU73)","v":1},{"$f":"IF('[3]Tasa de Falla'!IV73=0,\"\",'[3]Tasa de Falla'!IV73)","v":""},{"$f":"IF('[3]Tasa de Falla'!IW73=0,\"\",'[3]Tasa de Falla'!IW73)","v":""},{"$f":"IF('[3]Tasa de Falla'!IX73=0,\"\",'[3]Tasa de Falla'!IX73)","v":""},{"$f":"IF('[3]Tasa de Falla'!IY73=0,\"\",'[3]Tasa de Falla'!IY73)","v":""},{"$f":"IF('[3]Tasa de Falla'!IZ73=0,\"\",'[3]Tasa de Falla'!IZ73)","v":""},{"$f":"IF('[3]Tasa de Falla'!JA73=0,\"\",'[3]Tasa de Falla'!JA73)","v":""},{"$f":"IF('[3]Tasa de Falla'!JB73=0,\"\",'[3]Tasa de Falla'!JB73)","v":""}]
[null,null,{"$f":"'[3]Tasa de Falla'!C74","v":56},{"$f":"'[3]Tasa de Falla'!D74","v":"CEVIL POZO - AVELLANEDA"},{"$f":"'[3]Tasa de Falla'!E74","v":132},{"$f":"'[3]Tasa de Falla'!F74","v":8},{"$f":"IF('[3]Tasa de Falla'!IQ74=0,\"\",'[3]Tasa de Falla'!IQ74)","v":""},{"$f":"IF('[3]Tasa de Falla'!IR74=0,\"\",'[3]Tasa de Falla'!IR74)","v":""},{"$f":"IF('[3]Tasa de Falla'!IS74=0,\"\",'[3]Tasa de Falla'!IS74)","v":""},{"$f":"IF('[3]Tasa de Falla'!IT74=0,\"\",'[3]Tasa de Falla'!IT74)","v":""},{"$f":"IF('[3]Tasa de Falla'!IU74=0,\"\",'[3]Tasa de Falla'!IU74)","v":""},{"$f":"IF('[3]Tasa de Falla'!IV74=0,\"\",'[3]Tasa de Falla'!IV74)","v":""},{"$f":"IF('[3]Tasa de Falla'!IW74=0,\"\",'[3]Tasa de Falla'!IW74)","v":""},{"$f":"IF('[3]Tasa de Falla'!IX74=0,\"\",'[3]Tasa de Falla'!IX74)","v":""},{"$f":"IF('[3]Tasa de Falla'!IY74=0,\"\",'[3]Tasa de Falla'!IY74)","v":""},{"$f":"IF('[3]Tasa de Falla'!IZ74=0,\"\",'[3]Tasa de Falla'!IZ74)","v":""},{"$f":"IF('[3]Tasa de Falla'!JA74=0,\"\",'[3]Tasa de Falla'!JA74)","v":""},{"$f":"IF('[3]Tasa de Falla'!JB74=0,\"\",'[3]Tasa de Falla'!JB74)","v":""}]
[null,null,{"$f":"'[3]Tasa de Falla'!C75","v":57},{"$f":"'[3]Tasa de Falla'!D75","v":"CABRA CORRAL - SALTA ESTE"},{"$f":"'[3]Tasa de Falla'!E75","v":132},{"$f":"'[3]Tasa de Falla'!F75","v":55},{"$f":"IF('[3]Tasa de Falla'!IQ75=0,\"\",'[3]Tasa de Falla'!IQ75)","v":""},{"$f":"IF('[3]Tasa de Falla'!IR75=0,\"\",'[3]Tasa de Falla'!IR75)","v":1},{"$f":"IF('[3]Tasa de Falla'!IS75=0,\"\",'[3]Tasa de Falla'!IS75)","v":""},{"$f":"IF('[3]Tasa de Falla'!IT75=0,\"\",'[3]Tasa de Falla'!IT75)","v":""},{"$f":"IF('[3]Tasa de Falla'!IU75=0,\"\",'[3]Tasa de Falla'!IU75)","v":1},{"$f":"IF('[3]Tasa de Falla'!IV75=0,\"\",'[3]Tasa de Falla'!IV75)","v":""},{"$f":"IF('[3]Tasa de Falla'!IW75=0,\"\",'[3]Tasa de Falla'!IW75)","v":1},{"$f":"IF('[3]Tasa de Falla'!IX75=0,\"\",'[3]Tasa de Falla'!IX75)","v":""},{"$f":"IF('[3]Tasa de Falla'!IY75=0,\"\",'[3]Tasa de Falla'!IY75)","v":""},{"$f":"IF('[3]Tasa de Falla'!IZ75=0,\"\",'[3]Tasa de Falla'!IZ75)","v":1},{"$f":"IF('[3]Tasa de Falla'!JA75=0,\"\",'[3]Tasa de Falla'!JA75)","v":""},{"$f":"IF('[3]Tasa de Falla'!JB75=0,\"\",'[3]Tasa de Falla'!JB75)","v":""}]
[null,null,{"$f":"'[3]Tasa de Falla'!C76","v":58},{"$f":"'[3]Tasa de Falla'!D76","v":"SALTA ESTE - SALTA SUR"},{"$f":"'[3]Tasa de Falla'!E76","v":132},{"$f":"'[3]Tasa de Falla'!F76","v":7},{"$f":"IF('[3]Tasa de Falla'!IQ76=0,\"\",'[3]Tasa de Falla'!IQ76)","v":""},{"$f":"IF('[3]Tasa de Falla'!IR76=0,\"\",'[3]Tasa de Falla'!IR76)","v":""},{"$f":"IF('[3]Tasa de Falla'!IS76=0,\"\",'[3]Tasa de Falla'!IS76)","v":""},{"$f":"IF('[3]Tasa de Falla'!IT76=0,\"\",'[3]Tasa de Falla'!IT76)","v":""},{"$f":"IF('[3]Tasa de Falla'!IU76=0,\"\",'[3]Tasa de Falla'!IU76)","v":""},{"$f":"IF('[3]Tasa de Falla'!IV76=0,\"\",'[3]Tasa de Falla'!IV76)","v":""},{"$f":"IF('[3]Tasa de Falla'!IW76=0,\"\",'[3]Tasa de Falla'!IW76)","v":""},{"$f":"IF('[3]Tasa de Falla'!IX76=0,\"\",'[3]Tasa de Falla'!IX76)","v":""},{"$f":"IF('[3]Tasa de Falla'!IY76=0,\"\",'[3]Tasa de Falla'!IY76)","v":""},{"$f":"IF('[3]Tasa de Falla'!IZ76=0,\"\",'[3]Tasa de Falla'!IZ76)","v":""},{"$f":"IF('[3]Tasa de Falla'!JA76=0,\"\",'[3]Tasa de Falla'!JA76)","v":""},{"$f":"IF('[3]Tasa de Falla'!JB76=0,\"\",'[3]Tasa de Falla'!JB76)","v":""}]
[null,null,{"$f":"'[3]Tasa de Falla'!C77","v":59},{"$f":"'[3]Tasa de Falla'!D77","v":"V. QUINTEROS - ACONQUIJA - ANDALGALA"},{"$f":"'[3]Tasa de Falla'!E77","v":132},{"$f":"'[3]Tasa de Falla'!F77","v":102},{"$f":"IF('[3]Tasa de Falla'!IQ77=0,\"\",'[3]Tasa de Falla'!IQ77)","v":1},{"$f":"IF('[3]Tasa de Falla'!IR77=0,\"\",'[3]Tasa de Falla'!IR77)","v":""},{"$f":"IF('[3]Tasa de Falla'!IS77=0,\"\",'[3]Tasa de Falla'!IS77)","v":""},{"$f":"IF('[3]Tasa de Falla'!IT77=0,\"\",'[3]Tasa de Falla'!IT77)","v":""},{"$f":"IF('[3]Tasa de Falla'!IU77=0,\"\",'[3]Tasa de Falla'!IU77)","v":2},{"$f":"IF('[3]Tasa de Falla'!IV77=0,\"\",'[3]Tasa de Falla'!IV77)","v":1},{"$f":"IF('[3]Tasa de Falla'!IW77=0,\"\",'[3]Tasa de Falla'!IW77)","v":""},{"$f":"IF('[3]Tasa de Falla'!IX77=0,\"\",'[3]Tasa de Falla'!IX77)","v":""},{"$f":"IF('[3]Tasa de Falla'!IY77=0,\"\",'[3]Tasa de Falla'!IY77)","v":""},{"$f":"IF('[3]Tasa de Falla'!IZ77=0,\"\",'[3]Tasa de Falla'!IZ77)","v":""},{"$f":"IF('[3]Tasa de Falla'!JA77=0,\"\",'[3]Tasa de Falla'!JA77)","v":1},{"$f":"IF('[3]Tasa de Falla'!JB77=0,\"\",'[3]Tasa de Falla'!JB77)","v":""}]
[null,null,{"$f":"'[3]Tasa de Falla'!C78","v":60},{"$f":"'[3]Tasa de Falla'!D78","v":"ANDALGALA - BELEN"},{"$f":"'[3]Tasa de Falla'!E78","v":132},{"$f":"'[3]Tasa de Falla'!F78","v":80.3},{"$f":"IF('[3]Tasa de Falla'!IQ78=0,\"\",'[3]Tasa de Falla'!IQ78)","v":""},{"$f":"IF('[3]Tasa de Falla'!IR78=0,\"\",'[3]Tasa de Falla'!IR78)","v":""},{"$f":"IF('[3]Tasa de Falla'!IS78=0,\"\",'[3]Tasa de Falla'!IS78)","v":""},{"$f":"IF('[3]Tasa de Falla'!IT78=0,\"\",'[3]Tasa de Falla'!IT78)","v":""},{"$f":"IF('[3]Tasa de Falla'!IU78=0,\"\",'[3]Tasa de Falla'!IU78)","v":1},{"$f":"IF('[3]Tasa de Falla'!IV78=0,\"\",'[3]Tasa de Falla'!IV78)","v":""},{"$f":"IF('[3]Tasa de Falla'!IW78=0,\"\",'[3]Tasa de Falla'!IW78)","v":""},{"$f":"IF('[3]Tasa de Falla'!IX78=0,\"\",'[3]Tasa de Falla'!IX78)","v":""},{"$f":"IF('[3]Tasa de Falla'!IY78=0,\"\",'[3]Tasa de Falla'!IY78)","v":""},{"$f":"IF('[3]Tasa de Falla'!IZ78=0,\"\",'[3]Tasa de Falla'!IZ78)","v":""},{"$f":"IF('[3]Tasa de Falla'!JA78=0,\"\",'[3]Tasa de Falla'!JA78)","v":""},{"$f":"IF('[3]Tasa de Falla'!JB78=0,\"\",'[3]Tasa de Falla'!JB78)","v":""}]
[null,null,{"$f":"'[3]Tasa de Falla'!C79","v":61},{"$f":"'[3]Tasa de Falla'!D79","v":"TUCUMAN NORTE - TRANCAS"},{"$f":"'[3]Tasa de Falla'!E79","v":132},{"$f":"'[3]Tasa de Falla'!F79","v":75},{"$f":"IF('[3]Tasa de Falla'!IQ79=0,\"\",'[3]Tasa de Falla'!IQ79)","v":""},{"$f":"IF('[3]Tasa de Falla'!IR79=0,\"\",'[3]Tasa de Falla'!IR79)","v":""},{"$f":"IF('[3]Tasa de Falla'!IS79=0,\"\",'[3]Tasa de Falla'!IS79)","v":""},{"$f":"IF('[3]Tasa de Falla'!IT79=0,\"\",'[3]Tasa de Falla'!IT79)","v":""},{"$f":"IF('[3]Tasa de Falla'!IU79=0,\"\",'[3]Tasa de Falla'!IU79)","v":""},{"$f":"IF('[3]Tasa de Falla'!IV79=0,\"\",'[3]Tasa de Falla'!IV79)","v":""},{"$f":"IF('[3]Tasa de Falla'!IW79=0,\"\",'[3]Tasa de Falla'!IW79)","v":""},{"$f":"IF('[3]Tasa de Falla'!IX79=0,\"\",'[3]Tasa de Falla'!IX79)","v":""},{"$f":"IF('[3]Tasa de Falla'!IY79=0,\"\",'[3]Tasa de Falla'!IY79)","v":""},{"$f":"IF('[3]Tasa de Falla'!IZ79=0,\"\",'[3]Tasa de Falla'!IZ79)","v":1},{"$f":"IF('[3]Tasa de Falla'!JA79=0,\"\",'[3]Tasa de Falla'!JA79)","v":""},{"$f":"IF('[3]Tasa de Falla'!JB79=0,\"\",'[3]Tasa de Falla'!JB79)","v":""}]
[null,null,{"$f":"'[3]Tasa de Falla'!C80","v":62},{"$f":"'[3]Tasa de Falla'!D80","v":"CABRA CORRAL - TRANCAS"},{"$f":"'[3]Tasa de Falla'!E80","v":132},{"$f":"'[3]Tasa de Falla'!F80","v":115},{"$f":"IF('[3]Tasa de Falla'!IQ80=0,\"\",'[3]Tasa de Falla'!IQ80)","v":"XXXX"},{"$f":"IF('[3]Tasa de Falla'!IR80=0,\"\",'[3]Tasa de Falla'!IR80)","v":"XXXX"},{"$f":"IF('[3]Tasa de Falla'!IS80=0,\"\",'[3]Tasa de Falla'!IS80)","v":"XXXX"},{"$f":"IF('[3]Tasa de Falla'!IT80=0,\"\",'[3]Tasa de Falla'!IT80)","v":"XXXX"},{"$f":"IF('[3]Tasa de Falla'!IU80=0,\"\",'[3]Tasa de Falla'!IU80)","v":"XXXX"},{"$f":"IF('[3]Tasa de Falla'!IV80=0,\"\",'[3]Tasa de Falla'!IV80)","v":"XXXX"},{"$f":"IF('[3]Tasa de Falla'!IW80=0,\"\",'[3]Tasa de Falla'!IW80)","v":"XXXX"},{"$f":"IF('[3]Tasa de Falla'!IX80=0,\"\",'[3]Tasa de Falla'!IX80)","v":"XXXX"},{"$f":"IF('[3]Tasa de Falla'!IY80=0,\"\",'[3]Tasa de Falla'!IY80)","v":"XXXX"},{"$f":"IF('[3]Tasa de Falla'!IZ80=0,\"\",'[3]Tasa de Falla'!IZ80)","v":"XXXX"},{"$f":"IF('[3]Tasa de Falla'!JA80=0,\"\",'[3]Tasa de Falla'!JA80)","v":"XXXX"},{"$f":"IF('[3]Tasa de Falla'!JB80=0,\"\",'[3]Tasa de Falla'!JB80)","v":"XXXX"}]
[null,null,{"$f":"'[3]Tasa de Falla'!C81","v":63},{"$f":"'[3]Tasa de Falla'!D81","v":"LAS MADERAS - JUJUY SUR"},{"$f":"'[3]Tasa de Falla'!E81","v":132},{"$f":"'[3]Tasa de Falla'!F81","v":27.6},{"$f":"IF('[3]Tasa de Falla'!IQ81=0,\"\",'[3]Tasa de Falla'!IQ81)","v":""},{"$f":"IF('[3]Tasa de Falla'!IR81=0,\"\",'[3]Tasa de Falla'!IR81)","v":""},{"$f":"IF('[3]Tasa de Falla'!IS81=0,\"\",'[3]Tasa de Falla'!IS81)","v":""},{"$f":"IF('[3]Tasa de Falla'!IT81=0,\"\",'[3]Tasa de Falla'!IT81)","v":1},{"$f":"IF('[3]Tasa de Falla'!IU81=0,\"\",'[3]Tasa de Falla'!IU81)","v":""},{"$f":"IF('[3]Tasa de Falla'!IV81=0,\"\",'[3]Tasa de Falla'!IV81)","v":""},{"$f":"IF('[3]Tasa de Falla'!IW81=0,\"\",'[3]Tasa de Falla'!IW81)","v":""},{"$f":"IF('[3]Tasa de Falla'!IX81=0,\"\",'[3]Tasa de Falla'!IX81)","v":""},{"$f":"IF('[3]Tasa de Falla'!IY81=0,\"\",'[3]Tasa de Falla'!IY81)","v":""},{"$f":"IF('[3]Tasa de Falla'!IZ81=0,\"\",'[3]Tasa de Falla'!IZ81)","v":""},{"$f":"IF('[3]Tasa de Falla'!JA81=0,\"\",'[3]Tasa de Falla'!JA81)","v":""},{"$f":"IF('[3]Tasa de Falla'!JB81=0,\"\",'[3]Tasa de Falla'!JB81)","v":""}]
[null,null,{"$f":"'[3]Tasa de Falla'!C82","v":64},{"$f":"'[3]Tasa de Falla'!D82","v":"BELEN - TINOGASTA"},{"$f":"'[3]Tasa de Falla'!E82","v":132},{"$f":"'[3]Tasa de Falla'!F82","v":72},{"$f":"IF('[3]Tasa de Falla'!IQ82=0,\"\",'[3]Tasa de Falla'!IQ82)","v":""},{"$f":"IF('[3]Tasa de Falla'!IR82=0,\"\",'[3]Tasa de Falla'!IR82)","v":""},{"$f":"IF('[3]Tasa de Falla'!IS82=0,\"\",'[3]Tasa de Falla'!IS82)","v":1},{"$f":"IF('[3]Tasa de Falla'!IT82=0,\"\",'[3]Tasa de Falla'!IT82)","v":""},{"$f":"IF('[3]Tasa de Falla'!IU82=0,\"\",'[3]Tasa de Falla'!IU82)","v":""},{"$f":"IF('[3]Tasa de Falla'!IV82=0,\"\",'[3]Tasa de Falla'!IV82)","v":""},{"$f":"IF('[3]Tasa de Falla'!IW82=0,\"\",'[3]Tasa de Falla'!IW82)","v":""},{"$f":"IF('[3]Tasa de Falla'!IX82=0,\"\",'[3]Tasa de Falla'!IX82)","v":""},{"$f":"IF('[3]Tasa de Falla'!IY82=0,\"\",'[3]Tasa de Falla'!IY82)","v":""},{"$f":"IF('[3]Tasa de Falla'!IZ82=0,\"\",'[3]Tasa de Falla'!IZ82)","v":""},{"$f":"IF('[3]Tasa de Falla'!JA82=0,\"\",'[3]Tasa de Falla'!JA82)","v":""},{"$f":"IF('[3]Tasa de Falla'!JB82=0,\"\",'[3]Tasa de Falla'!JB82)","v":""}]
[null,null,{"$f":"'[3]Tasa de Falla'!C83","v":65},{"$f":"'[3]Tasa de Falla'!D83","v":"BURRUYACU - CEVIL POZO"},{"$f":"'[3]Tasa de Falla'!E83","v":132},{"$f":"'[3]Tasa de Falla'!F83","v":56},{"$f":"IF('[3]Tasa de Falla'!IQ83=0,\"\",'[3]Tasa de Falla'!IQ83)","v":""},{"$f":"IF('[3]Tasa de Falla'!IR83=0,\"\",'[3]Tasa de Falla'!IR83)","v":1},{"$f":"IF('[3]Tasa de Falla'!IS83=0,\"\",'[3]Tasa de Falla'!IS83)","v":""},{"$f":"IF('[3]Tasa de Falla'!IT83=0,\"\",'[3]Tasa de Falla'!IT83)","v":""},{"$f":"IF('[3]Tasa de Falla'!IU83=0,\"\",'[3]Tasa de Falla'!IU83)","v":1},{"$f":"IF('[3]Tasa de Falla'!IV83=0,\"\",'[3]Tasa de Falla'!IV83)","v":1},{"$f":"IF('[3]Tasa de Falla'!IW83=0,\"\",'[3]Tasa de Falla'!IW83)","v":""},{"$f":"IF('[3]Tasa de Falla'!IX83=0,\"\",'[3]Tasa de Falla'!IX83)","v":""},{"$f":"IF('[3]Tasa de Falla'!IY83=0,\"\",'[3]Tasa de Falla'!IY83)","v":""},{"$f":"IF('[3]Tasa de Falla'!IZ83=0,\"\",'[3]Tasa de Falla'!IZ83)","v":""},{"$f":"IF('[3]Tasa de Falla'!JA83=0,\"\",'[3]Tasa de Falla'!JA83)","v":""},{"$f":"IF('[3]Tasa de Falla'!JB83=0,\"\",'[3]Tasa de Falla'!JB83)","v":""}]
[null,null,{"$f":"'[3]Tasa de Falla'!C84","v":66},{"$f":"'[3]Tasa de Falla'!D84","v":"GÜEMES - BURRUYACU"},{"$f":"'[3]Tasa de Falla'!E84","v":132},{"$f":"'[3]Tasa de Falla'!F84","v":235.1},{"$f":"IF('[3]Tasa de Falla'!IQ84=0,\"\",'[3]Tasa de Falla'!IQ84)","v":"XXXX"},{"$f":"IF('[3]Tasa de Falla'!IR84=0,\"\",'[3]Tasa de Falla'!IR84)","v":"XXXX"},{"$f":"IF('[3]Tasa de Falla'!IS84=0,\"\",'[3]Tasa de Falla'!IS84)","v":"XXXX"},{"$f":"IF('[3]Tasa de Falla'!IT84=0,\"\",'[3]Tasa de Falla'!IT84)","v":"XXXX"},{"$f":"IF('[3]Tasa de Falla'!IU84=0,\"\",'[3]Tasa de Falla'!IU84)","v":"XXXX"},{"$f":"IF('[3]Tasa de Falla'!IV84=0,\"\",'[3]Tasa de Falla'!IV84)","v":"XXXX"},{"$f":"IF('[3]Tasa de Falla'!IW84=0,\"\",'[3]Tasa de Falla'!IW84)","v":"XXXX"},{"$f":"IF('[3]Tasa de Falla'!IX84=0,\"\",'[3]Tasa de Falla'!IX84)","v":"XXXX"},{"$f":"IF('[3]Tasa de Falla'!IY84=0,\"\",'[3]Tasa de Falla'!IY84)","v":"XXXX"},{"$f":"IF('[3]Tasa de Falla'!IZ84=0,\"\",'[3]Tasa de Falla'!IZ84)","v":"XXXX"},{"$f":"IF('[3]Tasa de Falla'!JA84=0,\"\",'[3]Tasa de Falla'!JA84)","v":"XXXX"},{"$f":"IF('[3]Tasa de Falla'!JB84=0,\"\",'[3]Tasa de Falla'!JB84)","v":"XXXX"}]
[null,null,{"$f":"'[3]Tasa de Falla'!C85","v":67},{"$f":"'[3]Tasa de Falla'!D85","v":"FRIAS - RECREO"},{"$f":"'[3]Tasa de Falla'!E85","v":132},{"$f":"'[3]Tasa de Falla'!F85","v":74.540000000000006},{"$f":"IF('[3]Tasa de Falla'!IQ85=0,\"\",'[3]Tasa de Falla'!IQ85)","v":""},{"$f":"IF('[3]Tasa de Falla'!IR85=0,\"\",'[3]Tasa de Falla'!IR85)","v":""},{"$f":"IF('[3]Tasa de Falla'!IS85=0,\"\",'[3]Tasa de Falla'!IS85)","v":""},{"$f":"IF('[3]Tasa de Falla'!IT85=0,\"\",'[3]Tasa de Falla'!IT85)","v":""},{"$f":"IF('[3]Tasa de Falla'!IU85=0,\"\",'[3]Tasa de Falla'!IU85)","v":""},{"$f":"IF('[3]Tasa de Falla'!IV85=0,\"\",'[3]Tasa de Falla'!IV85)","v":""},{"$f":"IF('[3]Tasa de Falla'!IW85=0,\"\",'[3]Tasa de Falla'!IW85)","v":""},{"$f":"IF('[3]Tasa de Falla'!IX85=0,\"\",'[3]Tasa de Falla'!IX85)","v":""},{"$f":"IF('[3]Tasa de Falla'!IY85=0,\"\",'[3]Tasa de Falla'!IY85)","v":""},{"$f":"IF('[3]Tasa de Falla'!IZ85=0,\"\",'[3]Tasa de Falla'!IZ85)","v":""},{"$f":"IF('[3]Tasa de Falla'!JA85=0,\"\",'[3]Tasa de Falla'!JA85)","v":""},{"$f":"IF('[3]Tasa de Falla'!JB85=0,\"\",'[3]Tasa de Falla'!JB85)","v":""}]
[null,null,{"$f":"'[3]Tasa de Falla'!C86","v":68},{"$f":"'[3]Tasa de Falla'!D86","v":"RECREO - LA RIOJA 1"},{"$f":"'[3]Tasa de Falla'!E86","v":132},{"$f":"'[3]Tasa de Falla'!F86","v":221},{"$f":"IF('[3]Tasa de Falla'!IQ86=0,\"\",'[3]Tasa de Falla'!IQ86)","v":""},{"$f":"IF('[3]Tasa de Falla'!IR86=0,\"\",'[3]Tasa de Falla'!IR86)","v":""},{"$f":"IF('[3]Tasa de Falla'!IS86=0,\"\",'[3]Tasa de Falla'!IS86)","v":""},{"$f":"IF('[3]Tasa de Falla'!IT86=0,\"\",'[3]Tasa de Falla'!IT86)","v":1},{"$f":"IF('[3]Tasa de Falla'!IU86=0,\"\",'[3]Tasa de Falla'!IU86)","v":1},{"$f":"IF('[3]Tasa de Falla'!IV86=0,\"\",'[3]Tasa de Falla'!IV86)","v":""},{"$f":"IF('[3]Tasa de Falla'!IW86=0,\"\",'[3]Tasa de Falla'!IW86)","v":""},{"$f":"IF('[3]Tasa de Falla'!IX86=0,\"\",'[3]Tasa de Falla'!IX86)","v":""},{"$f":"IF('[3]Tasa de Falla'!IY86=0,\"\",'[3]Tasa de Falla'!IY86)","v":1},{"$f":"IF('[3]Tasa de Falla'!IZ86=0,\"\",'[3]Tasa de Falla'!IZ86)","v":1},{"$f":"IF('[3]Tasa de Falla'!JA86=0,\"\",'[3]Tasa de Falla'!JA86)","v":""},{"$f":"IF('[3]Tasa de Falla'!JB86=0,\"\",'[3]Tasa de Falla'!JB86)","v":""}]
[null,null,{"$f":"'[3]Tasa de Falla'!C87","v":69},{"$f":"'[3]Tasa de Falla'!D87","v":"RECREO - LA RIOJA 2"},{"$f":"'[3]Tasa de Falla'!E87","v":132},{"$f":"'[3]Tasa de Falla'!F87","v":220},{"$f":"IF('[3]Tasa de Falla'!IQ87=0,\"\",'[3]Tasa de Falla'!IQ87)","v":""},{"$f":"IF('[3]Tasa de Falla'!IR87=0,\"\",'[3]Tasa de Falla'!IR87)","v":""},{"$f":"IF('[3]Tasa de Falla'!IS87=0,\"\",'[3]Tasa de Falla'!IS87)","v":1},{"$f":"IF('[3]Tasa de Falla'!IT87=0,\"\",'[3]Tasa de Falla'!IT87)","v":""},{"$f":"IF('[3]Tasa de Falla'!IU87=0,\"\",'[3]Tasa de Falla'!IU87)","v":1},{"$f":"IF('[3]Tasa de Falla'!IV87=0,\"\",'[3]Tasa de Falla'!IV87)","v":""},{"$f":"IF('[3]Tasa de Falla'!IW87=0,\"\",'[3]Tasa de Falla'!IW87)","v":""},{"$f":"IF('[3]Tasa de Falla'!IX87=0,\"\",'[3]Tasa de Falla'!IX87)","v":1},{"$f":"IF('[3]Tasa de Falla'!IY87=0,\"\",'[3]Tasa de Falla'!IY87)","v":1},{"$f":"IF('[3]Tasa de Falla'!IZ87=0,\"\",'[3]Tasa de Falla'!IZ87)","v":""},{"$f":"IF('[3]Tasa de Falla'!JA87=0,\"\",'[3]Tasa de Falla'!JA87)","v":""},{"$f":"IF('[3]Tasa de Falla'!JB87=0,\"\",'[3]Tasa de Falla'!JB87)","v":""}]
[null,null,{"$f":"'[3]Tasa de Falla'!C88","v":70},{"$f":"'[3]Tasa de Falla'!D88","v":"RECREO - CATAMARCA"},{"$f":"'[3]Tasa de Falla'!E88","v":132},{"$f":"'[3]Tasa de Falla'!F88","v":203},{"$f":"IF('[3]Tasa de Falla'!IQ88=0,\"\",'[3]Tasa de Falla'!IQ88)","v":""},{"$f":"IF('[3]Tasa de Falla'!IR88=0,\"\",'[3]Tasa de Falla'!IR88)","v":""},{"$f":"IF('[3]Tasa de Falla'!IS88=0,\"\",'[3]Tasa de Falla'!IS88)","v":""},{"$f":"IF('[3]Tasa de Falla'!IT88=0,\"\",'[3]Tasa de Falla'!IT88)","v":2},{"$f":"IF('[3]Tasa de Falla'!IU88=0,\"\",'[3]Tasa de Falla'!IU88)","v":""},{"$f":"IF('[3]Tasa de Falla'!IV88=0,\"\",'[3]Tasa de Falla'!IV88)","v":""},{"$f":"IF('[3]Tasa de Falla'!IW88=0,\"\",'[3]Tasa de Falla'!IW88)","v":1},{"$f":"IF('[3]Tasa de Falla'!IX88=0,\"\",'[3]Tasa de Falla'!IX88)","v":""},{"$f":"IF('[3]Tasa de Falla'!IY88=0,\"\",'[3]Tasa de Falla'!IY88)","v":""},{"$f":"IF('[3]Tasa de Falla'!IZ88=0,\"\",'[3]Tasa de Falla'!IZ88)","v":""},{"$f":"IF('[3]Tasa de Falla'!JA88=0,\"\",'[3]Tasa de Falla'!JA88)","v":""},{"$f":"IF('[3]Tasa de Falla'!JB88=0,\"\",'[3]Tasa de Falla'!JB88)","v":""}]
[null,null,{"$f":"'[3]Tasa de Falla'!C89","v":71},{"$f":"'[3]Tasa de Falla'!D89","v":"CABRA CORRAL - EL CARRIL"},{"$f":"'[3]Tasa de Falla'!E89","v":132},{"$f":"'[3]Tasa de Falla'!F89","v":33.75},{"$f":"IF('[3]Tasa de Falla'!IQ89=0,\"\",'[3]Tasa de Falla'!IQ89)","v":""},{"$f":"IF('[3]Tasa de Falla'!IR89=0,\"\",'[3]Tasa de Falla'!IR89)","v":1},{"$f":"IF('[3]Tasa de Falla'!IS89=0,\"\",'[3]Tasa de Falla'!IS89)","v":""},{"$f":"IF('[3]Tasa de Falla'!IT89=0,\"\",'[3]Tasa de Falla'!IT89)","v":""},{"$f":"IF('[3]Tasa de Falla'!IU89=0,\"\",'[3]Tasa de Falla'!IU89)","v":""},{"$f":"IF('[3]Tasa de Falla'!IV89=0,\"\",'[3]Tasa de Falla'!IV89)","v":""},{"$f":"IF('[3]Tasa de Falla'!IW89=0,\"\",'[3]Tasa de Falla'!IW89)","v":""},{"$f":"IF('[3]Tasa de Falla'!IX89=0,\"\",'[3]Tasa de Falla'!IX89)","v":""},{"$f":"IF('[3]Tasa de Falla'!IY89=0,\"\",'[3]Tasa de Falla'!IY89)","v":""},{"$f":"IF('[3]Tasa de Falla'!IZ89=0,\"\",'[3]Tasa de Falla'!IZ89)","v":1},{"$f":"IF('[3]Tasa de Falla'!JA89=0,\"\",'[3]Tasa de Falla'!JA89)","v":""},{"$f":"IF('[3]Tasa de Falla'!JB89=0,\"\",'[3]Tasa de Falla'!JB89)","v":""}]
[null,null,{"$f":"'[3]Tasa de Falla'!C90","v":72},{"$f":"'[3]Tasa de Falla'!D90","v":"PAMPA GRANDE - CABRA CORRAL"},{"$f":"'[3]Tasa de Falla'!E90","v":132},{"$f":"'[3]Tasa de Falla'!F90","v":60},{"$f":"IF('[3]Tasa de Falla'!IQ90=0,\"\",'[3]Tasa de Falla'!IQ90)","v":""},{"$f":"IF('[3]Tasa de Falla'!IR90=0,\"\",'[3]Tasa de Falla'!IR90)","v":""},{"$f":"IF('[3]Tasa de Falla'!IS90=0,\"\",'[3]Tasa de Falla'!IS90)","v":""},{"$f":"IF('[3]Tasa de Falla'!IT90=0,\"\",'[3]Tasa de Falla'!IT90)","v":""},{"$f":"IF('[3]Tasa de Falla'!IU90=0,\"\",'[3]Tasa de Falla'!IU90)","v":1},{"$f":"IF('[3]Tasa de Falla'!IV90=0,\"\",'[3]Tasa de Falla'!IV90)","v":1},{"$f":"IF('[3]Tasa de Falla'!IW90=0,\"\",'[3]Tasa de Falla'!IW90)","v":1},{"$f":"IF('[3]Tasa de Falla'!IX90=0,\"\",'[3]Tasa de Falla'!IX90)","v":""},{"$f":"IF('[3]Tasa de Falla'!IY90=0,\"\",'[3]Tasa de Falla'!IY90)","v":""},{"$f":"IF('[3]Tasa de Falla'!IZ90=0,\"\",'[3]Tasa de Falla'!IZ90)","v":1},{"$f":"IF('[3]Tasa de Falla'!JA90=0,\"\",'[3]Tasa de Falla'!JA90)","v":""},{"$f":"IF('[3]Tasa de Falla'!JB90=0,\"\",'[3]Tasa de Falla'!JB90)","v":""}]
[null,null,{"$f":"'[3]Tasa de Falla'!C91","v":73},{"$f":"'[3]Tasa de Falla'!D91","v":"PAMPA GRANDE - CAFAYATE"},{"$f":"'[3]Tasa de Falla'!E91","v":132},{"$f":"'[3]Tasa de Falla'!F91","v":63},{"$f":"IF('[3]Tasa de Falla'!IQ91=0,\"\",'[3]Tasa de Falla'!IQ91)","v":""},{"$f":"IF('[3]Tasa de Falla'!IR91=0,\"\",'[3]Tasa de Falla'!IR91)","v":""},{"$f":"IF('[3]Tasa de Falla'!IS91=0,\"\",'[3]Tasa de Falla'!IS91)","v":""},{"$f":"IF('[3]Tasa de Falla'!IT91=0,\"\",'[3]Tasa de Falla'!IT91)","v":""},{"$f":"IF('[3]Tasa de Falla'!IU91=0,\"\",'[3]Tasa de Falla'!IU91)","v":""},{"$f":"IF('[3]Tasa de Falla'!IV91=0,\"\",'[3]Tasa de Falla'!IV91)","v":""},{"$f":"IF('[3]Tasa de Falla'!IW91=0,\"\",'[3]Tasa de Falla'!IW91)","v":""},{"$f":"IF('[3]Tasa de Falla'!IX91=0,\"\",'[3]Tasa de Falla'!IX91)","v":""},{"$f":"IF('[3]Tasa de Falla'!IY91=0,\"\",'[3]Tasa de Falla'!IY91)","v":""},{"$f":"IF('[3]Tasa de Falla'!IZ91=0,\"\",'[3]Tasa de Falla'!IZ91)","v":""},{"$f":"IF('[3]Tasa de Falla'!JA91=0,\"\",'[3]Tasa de Falla'!JA91)","v":""},{"$f":"IF('[3]Tasa de Falla'!JB91=0,\"\",'[3]Tasa de Falla'!JB91)","v":""}]
[null,null,{"$f":"'[3]Tasa de Falla'!C92","v":74},{"$f":"'[3]Tasa de Falla'!D92","v":"PAMPA GRANDE - TRANCAS"},{"$f":"'[3]Tasa de Falla'!E92","v":132},{"$f":"'[3]Tasa de Falla'!F92","v":55},{"$f":"IF('[3]Tasa de Falla'!IQ92=0,\"\",'[3]Tasa de Falla'!IQ92)","v":""},{"$f":"IF('[3]Tasa de Falla'!IR92=0,\"\",'[3]Tasa de Falla'!IR92)","v":""},{"$f":"IF('[3]Tasa de Falla'!IS92=0,\"\",'[3]Tasa de Falla'!IS92)","v":""},{"$f":"IF('[3]Tasa de Falla'!IT92=0,\"\",'[3]Tasa de Falla'!IT92)","v":""},{"$f":"IF('[3]Tasa de Falla'!IU92=0,\"\",'[3]Tasa de Falla'!IU92)","v":""},{"$f":"IF('[3]Tasa de Falla'!IV92=0,\"\",'[3]Tasa de Falla'!IV92)","v":""},{"$f":"IF('[3]Tasa de Falla'!IW92=0,\"\",'[3]Tasa de Falla'!IW92)","v":""},{"$f":"IF('[3]Tasa de Falla'!IX92=0,\"\",'[3]Tasa de Falla'!IX92)","v":""},{"$f":"IF('[3]Tasa de Falla'!IY92=0,\"\",'[3]Tasa de Falla'!IY92)","v":""},{"$f":"IF('[3]Tasa de Falla'!IZ92=0,\"\",'[3]Tasa de Falla'!IZ92)","v":""},{"$f":"IF('[3]Tasa de Falla'!JA92=0,\"\",'[3]Tasa de Falla'!JA92)","v":2},{"$f":"IF('[3]Tasa de Falla'!JB92=0,\"\",'[3]Tasa de Falla'!JB92)","v":""}]
[null,null,{"$f":"'[3]Tasa de Falla'!C93","v":75},{"$f":"'[3]Tasa de Falla'!D93","v":"SANTIAGO CENTRO - FERNANDEZ - SUNCHO CORRAL "},{"$f":"'[3]Tasa de Falla'!E93","v":132},{"$f":"'[3]Tasa de Falla'!F93","v":103},{"$f":"IF('[3]Tasa de Falla'!IQ93=0,\"\",'[3]Tasa de Falla'!IQ93)","v":""},{"$f":"IF('[3]Tasa de Falla'!IR93=0,\"\",'[3]Tasa de Falla'!IR93)","v":""},{"$f":"IF('[3]Tasa de Falla'!IS93=0,\"\",'[3]Tasa de Falla'!IS93)","v":""},{"$f":"IF('[3]Tasa de Falla'!IT93=0,\"\",'[3]Tasa de Falla'!IT93)","v":""},{"$f":"IF('[3]Tasa de Falla'!IU93=0,\"\",'[3]Tasa de Falla'!IU93)","v":""},{"$f":"IF('[3]Tasa de Falla'!IV93=0,\"\",'[3]Tasa de Falla'!IV93)","v":""},{"$f":"IF('[3]Tasa de Falla'!IW93=0,\"\",'[3]Tasa de Falla'!IW93)","v":""},{"$f":"IF('[3]Tasa de Falla'!IX93=0,\"\",'[3]Tasa de Falla'!IX93)","v":""},{"$f":"IF('[3]Tasa de Falla'!IY93=0,\"\",'[3]Tasa de Falla'!IY93)","v":""},{"$f":"IF('[3]Tasa de Falla'!IZ93=0,\"\",'[3]Tasa de Falla'!IZ93)","v":""},{"$f":"IF('[3]Tasa de Falla'!JA93=0,\"\",'[3]Tasa de Falla'!JA93)","v":""},{"$f":"IF('[3]Tasa de Falla'!JB93=0,\"\",'[3]Tasa de Falla'!JB93)","v":1}]
[null,null,{"$f":"'[3]Tasa de Falla'!C94","v":76},{"$f":"'[3]Tasa de Falla'!D94","v":"SUNCHO CORRAL - ANATUYA"},{"$f":"'[3]Tasa de Falla'!E94","v":132},{"$f":"'[3]Tasa de Falla'!F94","v":81},{"$f":"IF('[3]Tasa de Falla'!IQ94=0,\"\",'[3]Tasa de Falla'!IQ94)","v":""},{"$f":"IF('[3]Tasa de Falla'!IR94=0,\"\",'[3]Tasa de Falla'!IR94)","v":2},{"$f":"IF('[3]Tasa de Falla'!IS94=0,\"\",'[3]Tasa de Falla'!IS94)","v":1},{"$f":"IF('[3]Tasa de Falla'!IT94=0,\"\",'[3]Tasa de Falla'!IT94)","v":""},{"$f":"IF('[3]Tasa de Falla'!IU94=0,\"\",'[3]Tasa de Falla'!IU94)","v":""},{"$f":"IF('[3]Tasa de Falla'!IV94=0,\"\",'[3]Tasa de Falla'!IV94)","v":""},{"$f":"IF('[3]Tasa de Falla'!IW94=0,\"\",'[3]Tasa de Falla'!IW94)","v":""},{"$f":"IF('[3]Tasa de Falla'!IX94=0,\"\",'[3]Tasa de Falla'!IX94)","v":""},{"$f":"IF('[3]Tasa de Falla'!IY94=0,\"\",'[3]Tasa de Falla'!IY94)","v":""},{"$f":"IF('[3]Tasa de Falla'!IZ94=0,\"\",'[3]Tasa de Falla'!IZ94)","v":""},{"$f":"IF('[3]Tasa de Falla'!JA94=0,\"\",'[3]Tasa de Falla'!JA94)","v":""},{"$f":"IF('[3]Tasa de Falla'!JB94=0,\"\",'[3]Tasa de Falla'!JB94)","v":""}]
[null,null,{"$f":"'[3]Tasa de Falla'!C95","v":77},{"$f":"'[3]Tasa de Falla'!D95","v":"LAS MADERAS - GÜEMES SALTA"},{"$f":"'[3]Tasa de Falla'!E95","v":132},{"$f":"'[3]Tasa de Falla'!F95","v":42},{"$f":"IF('[3]Tasa de Falla'!IQ95=0,\"\",'[3]Tasa de Falla'!IQ95)","v":""},{"$f":"IF('[3]Tasa de Falla'!IR95=0,\"\",'[3]Tasa de Falla'!IR95)","v":1},{"$f":"IF('[3]Tasa de Falla'!IS95=0,\"\",'[3]Tasa de Falla'!IS95)","v":""},{"$f":"IF('[3]Tasa de Falla'!IT95=0,\"\",'[3]Tasa de Falla'!IT95)","v":""},{"$f":"IF('[3]Tasa de Falla'!IU95=0,\"\",'[3]Tasa de Falla'!IU95)","v":""},{"$f":"IF('[3]Tasa de Falla'!IV95=0,\"\",'[3]Tasa de Falla'!IV95)","v":""},{"$f":"IF('[3]Tasa de Falla'!IW95=0,\"\",'[3]Tasa de Falla'!IW95)","v":""},{"$f":"IF('[3]Tasa de Falla'!IX95=0,\"\",'[3]Tasa de Falla'!IX95)","v":""},{"$f":"IF('[3]Tasa de Falla'!IY95=0,\"\",'[3]Tasa de Falla'!IY95)","v":""},{"$f":"IF('[3]Tasa de Falla'!IZ95=0,\"\",'[3]Tasa de Falla'!IZ95)","v":""},{"$f":"IF('[3]Tasa de Falla'!JA95=0,\"\",'[3]Tasa de Falla'!JA95)","v":""},{"$f":"IF('[3]Tasa de Falla'!JB95=0,\"\",'[3]Tasa de Falla'!JB95)","v":""}]
[null,null,{"$f":"'[3]Tasa de Falla'!C96","v":78},{"$f":"'[3]Tasa de Falla'!D96","v":"INDEPENDENCIA - EL BRACHO 2"},{"$f":"'[3]Tasa de Falla'!E96","v":132},{"$f":"'[3]Tasa de Falla'!F96","v":17.100000000000001},{"$f":"IF('[3]Tasa de Falla'!IQ96=0,\"\",'[3]Tasa de Falla'!IQ96)","v":""},{"$f":"IF('[3]Tasa de Falla'!IR96=0,\"\",'[3]Tasa de Falla'!IR96)","v":""},{"$f":"IF('[3]Tasa de Falla'!IS96=0,\"\",'[3]Tasa de Falla'!IS96)","v":""},{"$f":"IF('[3]Tasa de Falla'!IT96=0,\"\",'[3]Tasa de Falla'!IT96)","v":""},{"$f":"IF('[3]Tasa de Falla'!IU96=0,\"\",'[3]Tasa de Falla'!IU96)","v":""},{"$f":"IF('[3]Tasa de Falla'!IV96=0,\"\",'[3]Tasa de Falla'!IV96)","v":1},{"$f":"IF('[3]Tasa de Falla'!IW96=0,\"\",'[3]Tasa de Falla'!IW96)","v":""},{"$f":"IF('[3]Tasa de Falla'!IX96=0,\"\",'[3]Tasa de Falla'!IX96)","v":""},{"$f":"IF('[3]Tasa de Falla'!IY96=0,\"\",'[3]Tasa de Falla'!IY96)","v":""},{"$f":"IF('[3]Tasa de Falla'!IZ96=0,\"\",'[3]Tasa de Falla'!IZ96)","v":1},{"$f":"IF('[3]Tasa de Falla'!JA96=0,\"\",'[3]Tasa de Falla'!JA96)","v":2},{"$f":"IF('[3]Tasa de Falla'!JB96=0,\"\",'[3]Tasa de Falla'!JB96)","v":""}]
[null,null,{"$f":"'[3]Tasa de Falla'!C97","v":79},{"$f":"'[3]Tasa de Falla'!D97","v":"GÜEMES - SALTA NORTE"},{"$f":"'[3]Tasa de Falla'!E97","v":132},{"$f":"'[3]Tasa de Falla'!F97","v":39},{"$f":"IF('[3]Tasa de Falla'!IQ97=0,\"\",'[3]Tasa de Falla'!IQ97)","v":"XXXX"},{"$f":"IF('[3]Tasa de Falla'!IR97=0,\"\",'[3]Tasa de Falla'!IR97)","v":"XXXX"},{"$f":"IF('[3]Tasa de Falla'!IS97=0,\"\",'[3]Tasa de Falla'!IS97)","v":"XXXX"},{"$f":"IF('[3]Tasa de Falla'!IT97=0,\"\",'[3]Tasa de Falla'!IT97)","v":"XXXX"},{"$f":"IF('[3]Tasa de Falla'!IU97=0,\"\",'[3]Tasa de Falla'!IU97)","v":"XXXX"},{"$f":"IF('[3]Tasa de Falla'!IV97=0,\"\",'[3]Tasa de Falla'!IV97)","v":"XXXX"},{"$f":"IF('[3]Tasa de Falla'!IW97=0,\"\",'[3]Tasa de Falla'!IW97)","v":"XXXX"},{"$f":"IF('[3]Tasa de Falla'!IX97=0,\"\",'[3]Tasa de Falla'!IX97)","v":"XXXX"},{"$f":"IF('[3]Tasa de Falla'!IY97=0,\"\",'[3]Tasa de Falla'!IY97)","v":"XXXX"},{"$f":"IF('[3]Tasa de Falla'!IZ97=0,\"\",'[3]Tasa de Falla'!IZ97)","v":"XXXX"},{"$f":"IF('[3]Tasa de Falla'!JA97=0,\"\",'[3]Tasa de Falla'!JA97)","v":"XXXX"},{"$f":"IF('[3]Tasa de Falla'!JB97=0,\"\",'[3]Tasa de Falla'!JB97)","v":"XXXX"}]
[null,null,{"$f":"'[3]Tasa de Falla'!C98","v":80},{"$f":"'[3]Tasa de Falla'!D98","v":"BURRUYACU - COBOS"},{"$f":"'[3]Tasa de Falla'!E98","v":132},{"$f":"'[3]Tasa de Falla'!F98","v":229.5},{"$f":"IF('[3]Tasa de Falla'!IQ98=0,\"\",'[3]Tasa de Falla'!IQ98)","v":"XXXX"},{"$f":"IF('[3]Tasa de Falla'!IR98=0,\"\",'[3]Tasa de Falla'!IR98)","v":"XXXX"},{"$f":"IF('[3]Tasa de Falla'!IS98=0,\"\",'[3]Tasa de Falla'!IS98)","v":"XXXX"},{"$f":"IF('[3]Tasa de Falla'!IT98=0,\"\",'[3]Tasa de Falla'!IT98)","v":"XXXX"},{"$f":"IF('[3]Tasa de Falla'!IU98=0,\"\",'[3]Tasa de Falla'!IU98)","v":"XXXX"},{"$f":"IF('[3]Tasa de Falla'!IV98=0,\"\",'[3]Tasa de Falla'!IV98)","v":"XXXX"},{"$f":"IF('[3]Tasa de Falla'!IW98=0,\"\",'[3]Tasa de Falla'!IW98)","v":"XXXX"},{"$f":"IF('[3]Tasa de Falla'!IX98=0,\"\",'[3]Tasa de Falla'!IX98)","v":"XXXX"},{"$f":"IF('[3]Tasa de Falla'!IY98=0,\"\",'[3]Tasa de Falla'!IY98)","v":"XXXX"},{"$f":"IF('[3]Tasa de Falla'!IZ98=0,\"\",'[3]Tasa de Falla'!IZ98)","v":"XXXX"},{"$f":"IF('[3]Tasa de Falla'!JA98=0,\"\",'[3]Tasa de Falla'!JA98)","v":"XXXX"},{"$f":"IF('[3]Tasa de Falla'!JB98=0,\"\",'[3]Tasa de Falla'!JB98)","v":"XXXX"}]
[null,null,{"$f":"'[3]Tasa de Falla'!C99","v":81},{"$f":"'[3]Tasa de Falla'!D99","v":"METAN - COBOS"},{"$f":"'[3]Tasa de Falla'!E99","v":132},{"$f":"'[3]Tasa de Falla'!F99","v":89.2},{"$f":"IF('[3]Tasa de Falla'!IQ99=0,\"\",'[3]Tasa de Falla'!IQ99)","v":""},{"$f":"IF('[3]Tasa de Falla'!IR99=0,\"\",'[3]Tasa de Falla'!IR99)","v":""},{"$f":"IF('[3]Tasa de Falla'!IS99=0,\"\",'[3]Tasa de Falla'!IS99)","v":""},{"$f":"IF('[3]Tasa de Falla'!IT99=0,\"\",'[3]Tasa de Falla'!IT99)","v":""},{"$f":"IF('[3]Tasa de Falla'!IU99=0,\"\",'[3]Tasa de Falla'!IU99)","v":""},{"$f":"IF('[3]Tasa de Falla'!IV99=0,\"\",'[3]Tasa de Falla'!IV99)","v":""},{"$f":"IF('[3]Tasa de Falla'!IW99=0,\"\",'[3]Tasa de Falla'!IW99)","v":""},{"$f":"IF('[3]Tasa de Falla'!IX99=0,\"\",'[3]Tasa de Falla'!IX99)","v":""},{"$f":"IF('[3]Tasa de Falla'!IY99=0,\"\",'[3]Tasa de Falla'!IY99)","v":""},{"$f":"IF('[3]Tasa de Falla'!IZ99=0,\"\",'[3]Tasa de Falla'!IZ99)","v":""},{"$f":"IF('[3]Tasa de Falla'!JA99=0,\"\",'[3]Tasa de Falla'!JA99)","v":""},{"$f":"IF('[3]Tasa de Falla'!JB99=0,\"\",'[3]Tasa de Falla'!JB99)","v":""}]
[null,null,{"$f":"'[3]Tasa de Falla'!C100","v":82},{"$f":"'[3]Tasa de Falla'!D100","v":"AÑATUYA - BANDERA"},{"$f":"'[3]Tasa de Falla'!E100","v":132},{"$f":"'[3]Tasa de Falla'!F100","v":76},{"$f":"IF('[3]Tasa de Falla'!IQ100=0,\"\",'[3]Tasa de Falla'!IQ100)","v":""},{"$f":"IF('[3]Tasa de Falla'!IR100=0,\"\",'[3]Tasa de Falla'!IR100)","v":""},{"$f":"IF('[3]Tasa de Falla'!IS100=0,\"\",'[3]Tasa de Falla'!IS100)","v":2},{"$f":"IF('[3]Tasa de Falla'!IT100=0,\"\",'[3]Tasa de Falla'!IT100)","v":""},{"$f":"IF('[3]Tasa de Falla'!IU100=0,\"\",'[3]Tasa de Falla'!IU100)","v":""},{"$f":"IF('[3]Tasa de Falla'!IV100=0,\"\",'[3]Tasa de Falla'!IV100)","v":1},{"$f":"IF('[3]Tasa de Falla'!IW100=0,\"\",'[3]Tasa de Falla'!IW100)","v":""},{"$f":"IF('[3]Tasa de Falla'!IX100=0,\"\",'[3]Tasa de Falla'!IX100)","v":""},{"$f":"IF('[3]Tasa de Falla'!IY100=0,\"\",'[3]Tasa de Falla'!IY100)","v":""},{"$f":"IF('[3]Tasa de Falla'!IZ100=0,\"\",'[3]Tasa de Falla'!IZ100)","v":""},{"$f":"IF('[3]Tasa de Falla'!JA100=0,\"\",'[3]Tasa de Falla'!JA100)","v":""},{"$f":"IF('[3]Tasa de Falla'!JB100=0,\"\",'[3]Tasa de Falla'!JB100)","v":""}]
[null,null,{"$f":"'[3]Tasa de Falla'!C101","v":84},{"$f":"'[3]Tasa de Falla'!D101","v":"GÜEMES SALTA - COBOS 1"},{"$f":"'[3]Tasa de Falla'!E101","v":132},{"$f":"'[3]Tasa de Falla'!F101","v":12.1},{"$f":"IF('[3]Tasa de Falla'!IQ101=0,\"\",'[3]Tasa de Falla'!IQ101)","v":""},{"$f":"IF('[3]Tasa de Falla'!IR101=0,\"\",'[3]Tasa de Falla'!IR101)","v":""},{"$f":"IF('[3]Tasa de Falla'!IS101=0,\"\",'[3]Tasa de Falla'!IS101)","v":""},{"$f":"IF('[3]Tasa de Falla'!IT101=0,\"\",'[3]Tasa de Falla'!IT101)","v":""},{"$f":"IF('[3]Tasa de Falla'!IU101=0,\"\",'[3]Tasa de Falla'!IU101)","v":""},{"$f":"IF('[3]Tasa de Falla'!IV101=0,\"\",'[3]Tasa de Falla'!IV101)","v":""},{"$f":"IF('[3]Tasa de Falla'!IW101=0,\"\",'[3]Tasa de Falla'!IW101)","v":""},{"$f":"IF('[3]Tasa de Falla'!IX101=0,\"\",'[3]Tasa de Falla'!IX101)","v":""},{"$f":"IF('[3]Tasa de Falla'!IY101=0,\"\",'[3]Tasa de Falla'!IY101)","v":""},{"$f":"IF('[3]Tasa de Falla'!IZ101=0,\"\",'[3]Tasa de Falla'!IZ101)","v":""},{"$f":"IF('[3]Tasa de Falla'!JA101=0,\"\",'[3]Tasa de Falla'!JA101)","v":""},{"$f":"IF('[3]Tasa de Falla'!JB101=0,\"\",'[3]Tasa de Falla'!JB101)","v":""}]
[null,null,{"$f":"'[3]Tasa de Falla'!C102","v":85},{"$f":"'[3]Tasa de Falla'!D102","v":"GÜEMES SALTA - COBOS 2"},{"$f":"'[3]Tasa de Falla'!E102","v":132},{"$f":"'[3]Tasa de Falla'!F102","v":12.1},{"$f":"IF('[3]Tasa de Falla'!IQ102=0,\"\",'[3]Tasa de Falla'!IQ102)","v":""},{"$f":"IF('[3]Tasa de Falla'!IR102=0,\"\",'[3]Tasa de Falla'!IR102)","v":""},{"$f":"IF('[3]Tasa de Falla'!IS102=0,\"\",'[3]Tasa de Falla'!IS102)","v":""},{"$f":"IF('[3]Tasa de Falla'!IT102=0,\"\",'[3]Tasa de Falla'!IT102)","v":""},{"$f":"IF('[3]Tasa de Falla'!IU102=0,\"\",'[3]Tasa de Falla'!IU102)","v":""},{"$f":"IF('[3]Tasa de Falla'!IV102=0,\"\",'[3]Tasa de Falla'!IV102)","v":""},{"$f":"IF('[3]Tasa de Falla'!IW102=0,\"\",'[3]Tasa de Falla'!IW102)","v":""},{"$f":"IF('[3]Tasa de Falla'!IX102=0,\"\",'[3]Tasa de Falla'!IX102)","v":""},{"$f":"IF('[3]Tasa de Falla'!IY102=0,\"\",'[3]Tasa de Falla'!IY102)","v":""},{"$f":"IF('[3]Tasa de Falla'!IZ102=0,\"\",'[3]Tasa de Falla'!IZ102)","v":1},{"$f":"IF('[3]Tasa de Falla'!JA102=0,\"\",'[3]Tasa de Falla'!JA102)","v":""},{"$f":"IF('[3]Tasa de Falla'!JB102=0,\"\",'[3]Tasa de Falla'!JB102)","v":""}]
[null,null,{"$f":"'[3]Tasa de Falla'!C103","v":86},{"$f":"'[3]Tasa de Falla'!D103","v":"EL BRACHO - LA BANDA"},{"$f":"'[3]Tasa de Falla'!E103","v":132},{"$f":"'[3]Tasa de Falla'!F103","v":133.5},{"$f":"IF('[3]Tasa de Falla'!IQ103=0,\"\",'[3]Tasa de Falla'!IQ103)","v":"XXXX"},{"$f":"IF('[3]Tasa de Falla'!IR103=0,\"\",'[3]Tasa de Falla'!IR103)","v":"XXXX"},{"$f":"IF('[3]Tasa de Falla'!IS103=0,\"\",'[3]Tasa de Falla'!IS103)","v":"XXXX"},{"$f":"IF('[3]Tasa de Falla'!IT103=0,\"\",'[3]Tasa de Falla'!IT103)","v":"XXXX"},{"$f":"IF('[3]Tasa de Falla'!IU103=0,\"\",'[3]Tasa de Falla'!IU103)","v":"XXXX"},{"$f":"IF('[3]Tasa de Falla'!IV103=0,\"\",'[3]Tasa de Falla'!IV103)","v":"XXXX"},{"$f":"IF('[3]Tasa de Falla'!IW103=0,\"\",'[3]Tasa de Falla'!IW103)","v":"XXXX"},{"$f":"IF('[3]Tasa de Falla'!IX103=0,\"\",'[3]Tasa de Falla'!IX103)","v":"XXXX"},{"$f":"IF('[3]Tasa de Falla'!IY103=0,\"\",'[3]Tasa de Falla'!IY103)","v":"XXXX"},{"$f":"IF('[3]Tasa de Falla'!IZ103=0,\"\",'[3]Tasa de Falla'!IZ103)","v":"XXXX"},{"$f":"IF('[3]Tasa de Falla'!JA103=0,\"\",'[3]Tasa de Falla'!JA103)","v":"XXXX"},{"$f":"IF('[3]Tasa de Falla'!JB103=0,\"\",'[3]Tasa de Falla'!JB103)","v":"XXXX"}]
[null,null,{"$f":"'[3]Tasa de Falla'!C104","v":87},{"$f":"'[3]Tasa de Falla'!D104","v":"SANTIAGO OESTE - SANTIAGO SUR "},{"$f":"'[3]Tasa de Falla'!E104","v":132},{"$f":"'[3]Tasa de Falla'!F104","v":10.6},{"$f":"IF('[3]Tasa de Falla'!IQ104=0,\"\",'[3]Tasa de Falla'!IQ104)","v":""},{"$f":"IF('[3]Tasa de Falla'!IR104=0,\"\",'[3]Tasa de Falla'!IR104)","v":""},{"$f":"IF('[3]Tasa de Falla'!IS104=0,\"\",'[3]Tasa de Falla'!IS104)","v":1},{"$f":"IF('[3]Tasa de Falla'!IT104=0,\"\",'[3]Tasa de Falla'!IT104)","v":""},{"$f":"IF('[3]Tasa de Falla'!IU104=0,\"\",'[3]Tasa de Falla'!IU104)","v":""},{"$f":"IF('[3]Tasa de Falla'!IV104=0,\"\",'[3]Tasa de Falla'!IV104)","v":""},{"$f":"IF('[3]Tasa de Falla'!IW104=0,\"\",'[3]Tasa de Falla'!IW104)","v":""},{"$f":"IF('[3]Tasa de Falla'!IX104=0,\"\",'[3]Tasa de Falla'!IX104)","v":""},{"$f":"IF('[3]Tasa de Falla'!IY104=0,\"\",'[3]Tasa de Falla'!IY104)","v":""},{"$f":"IF('[3]Tasa de Falla'!IZ104=0,\"\",'[3]Tasa de Falla'!IZ104)","v":""},{"$f":"IF('[3]Tasa de Falla'!JA104=0,\"\",'[3]Tasa de Falla'!JA104)","v":""},{"$f":"IF('[3]Tasa de Falla'!JB104=0,\"\",'[3]Tasa de Falla'!JB104)","v":""}]
[null,null,{"$f":"'[3]Tasa de Falla'!C105","v":88},{"$f":"'[3]Tasa de Falla'!D105","v":"SANTIAGO SUR - SANTIAGO CENTRO"},{"$f":"'[3]Tasa de Falla'!E105","v":132},{"$f":"'[3]Tasa de Falla'!F105","v":4},{"$f":"IF('[3]Tasa de Falla'!IQ105=0,\"\",'[3]Tasa de Falla'!IQ105)","v":""},{"$f":"IF('[3]Tasa de Falla'!IR105=0,\"\",'[3]Tasa de Falla'!IR105)","v":""},{"$f":"IF('[3]Tasa de Falla'!IS105=0,\"\",'[3]Tasa de Falla'!IS105)","v":""},{"$f":"IF('[3]Tasa de Falla'!IT105=0,\"\",'[3]Tasa de Falla'!IT105)","v":""},{"$f":"IF('[3]Tasa de Falla'!IU105=0,\"\",'[3]Tasa de Falla'!IU105)","v":""},{"$f":"IF('[3]Tasa de Falla'!IV105=0,\"\",'[3]Tasa de Falla'!IV105)","v":""},{"$f":"IF('[3]Tasa de Falla'!IW105=0,\"\",'[3]Tasa de Falla'!IW105)","v":""},{"$f":"IF('[3]Tasa de Falla'!IX105=0,\"\",'[3]Tasa de Falla'!IX105)","v":""},{"$f":"IF('[3]Tasa de Falla'!IY105=0,\"\",'[3]Tasa de Falla'!IY105)","v":""},{"$f":"IF('[3]Tasa de Falla'!IZ105=0,\"\",'[3]Tasa de Falla'!IZ105)","v":""},{"$f":"IF('[3]Tasa de Falla'!JA105=0,\"\",'[3]Tasa de Falla'!JA105)","v":""},{"$f":"IF('[3]Tasa de Falla'!JB105=0,\"\",'[3]Tasa de Falla'!JB105)","v":""}]
[null,null,{"$f":"'[3]Tasa de Falla'!C106","v":89},{"$f":"'[3]Tasa de Falla'!D106","v":"C.H. RIO HONDO - SANTIAGO OESTE"},{"$f":"'[3]Tasa de Falla'!E106","v":132},{"$f":"'[3]Tasa de Falla'!F106","v":69.8},{"$f":"IF('[3]Tasa de Falla'!IQ106=0,\"\",'[3]Tasa de Falla'!IQ106)","v":""},{"$f":"IF('[3]Tasa de Falla'!IR106=0,\"\",'[3]Tasa de Falla'!IR106)","v":""},{"$f":"IF('[3]Tasa de Falla'!IS106=0,\"\",'[3]Tasa de Falla'!IS106)","v":1},{"$f":"IF('[3]Tasa de Falla'!IT106=0,\"\",'[3]Tasa de Falla'!IT106)","v":""},{"$f":"IF('[3]Tasa de Falla'!IU106=0,\"\",'[3]Tasa de Falla'!IU106)","v":""},{"$f":"IF('[3]Tasa de Falla'!IV106=0,\"\",'[3]Tasa de Falla'!IV106)","v":""},{"$f":"IF('[3]Tasa de Falla'!IW106=0,\"\",'[3]Tasa de Falla'!IW106)","v":""},{"$f":"IF('[3]Tasa de Falla'!IX106=0,\"\",'[3]Tasa de Falla'!IX106)","v":""},{"$f":"IF('[3]Tasa de Falla'!IY106=0,\"\",'[3]Tasa de Falla'!IY106)","v":""},{"$f":"IF('[3]Tasa de Falla'!IZ106=0,\"\",'[3]Tasa de Falla'!IZ106)","v":""},{"$f":"IF('[3]Tasa de Falla'!JA106=0,\"\",'[3]Tasa de Falla'!JA106)","v":""},{"$f":"IF('[3]Tasa de Falla'!JB106=0,\"\",'[3]Tasa de Falla'!JB106)","v":""}]
[null,null,{"$f":"'[3]Tasa de Falla'!C107","v":90},{"$f":"'[3]Tasa de Falla'!D107","v":"GÜEMES - MINETTI"},{"$f":"'[3]Tasa de Falla'!E107","v":132},{"$f":"'[3]Tasa de Falla'!F107","v":36.1},{"$f":"IF('[3]Tasa de Falla'!IQ107=0,\"\",'[3]Tasa de Falla'!IQ107)","v":"XXXX"},{"$f":"IF('[3]Tasa de Falla'!IR107=0,\"\",'[3]Tasa de Falla'!IR107)","v":"XXXX"},{"$f":"IF('[3]Tasa de Falla'!IS107=0,\"\",'[3]Tasa de Falla'!IS107)","v":"XXXX"},{"$f":"IF('[3]Tasa de Falla'!IT107=0,\"\",'[3]Tasa de Falla'!IT107)","v":"XXXX"},{"$f":"IF('[3]Tasa de Falla'!IU107=0,\"\",'[3]Tasa de Falla'!IU107)","v":"XXXX"},{"$f":"IF('[3]Tasa de Falla'!IV107=0,\"\",'[3]Tasa de Falla'!IV107)","v":"XXXX"},{"$f":"IF('[3]Tasa de Falla'!IW107=0,\"\",'[3]Tasa de Falla'!IW107)","v":"XXXX"},{"$f":"IF('[3]Tasa de Falla'!IX107=0,\"\",'[3]Tasa de Falla'!IX107)","v":"XXXX"},{"$f":"IF('[3]Tasa de Falla'!IY107=0,\"\",'[3]Tasa de Falla'!IY107)","v":"XXXX"},{"$f":"IF('[3]Tasa de Falla'!IZ107=0,\"\",'[3]Tasa de Falla'!IZ107)","v":"XXXX"},{"$f":"IF('[3]Tasa de Falla'!JA107=0,\"\",'[3]Tasa de Falla'!JA107)","v":"XXXX"},{"$f":"IF('[3]Tasa de Falla'!JB107=0,\"\",'[3]Tasa de Falla'!JB107)","v":"XXXX"}]
[null,null,{"$f":"'[3]Tasa de Falla'!C108","v":91},{"$f":"'[3]Tasa de Falla'!D108","v":"GÜEMES - SALTA NORTE"},{"$f":"'[3]Tasa de Falla'!E108","v":132},{"$f":"'[3]Tasa de Falla'!F108","v":38.97},{"$f":"IF('[3]Tasa de Falla'!IQ108=0,\"\",'[3]Tasa de Falla'!IQ108)","v":1},{"$f":"IF('[3]Tasa de Falla'!IR108=0,\"\",'[3]Tasa de Falla'!IR108)","v":""},{"$f":"IF('[3]Tasa de Falla'!IS108=0,\"\",'[3]Tasa de Falla'!IS108)","v":""},{"$f":"IF('[3]Tasa de Falla'!IT108=0,\"\",'[3]Tasa de Falla'!IT108)","v":""},{"$f":"IF('[3]Tasa de Falla'!IU108=0,\"\",'[3]Tasa de Falla'!IU108)","v":""},{"$f":"IF('[3]Tasa de Falla'!IV108=0,\"\",'[3]Tasa de Falla'!IV108)","v":""},{"$f":"IF('[3]Tasa de Falla'!IW108=0,\"\",'[3]Tasa de Falla'!IW108)","v":""},{"$f":"IF('[3]Tasa de Falla'!IX108=0,\"\",'[3]Tasa de Falla'!IX108)","v":""},{"$f":"IF('[3]Tasa de Falla'!IY108=0,\"\",'[3]Tasa de Falla'!IY108)","v":""},{"$f":"IF('[3]Tasa de Falla'!IZ108=0,\"\",'[3]Tasa de Falla'!IZ108)","v":""},{"$f":"IF('[3]Tasa de Falla'!JA108=0,\"\",'[3]Tasa de Falla'!JA108)","v":""},{"$f":"IF('[3]Tasa de Falla'!JB108=0,\"\",'[3]Tasa de Falla'!JB108)","v":""}]
[null,null,{"$f":"'[3]Tasa de Falla'!C109","v":92},{"$f":"'[3]Tasa de Falla'!D109","v":"BURRUYACU - R. DE LA FRONTERA"},{"$f":"'[3]Tasa de Falla'!E109","v":132},{"$f":"'[3]Tasa de Falla'!F109","v":99.1},{"$f":"IF('[3]Tasa de Falla'!IQ109=0,\"\",'[3]Tasa de Falla'!IQ109)","v":""},{"$f":"IF('[3]Tasa de Falla'!IR109=0,\"\",'[3]Tasa de Falla'!IR109)","v":""},{"$f":"IF('[3]Tasa de Falla'!IS109=0,\"\",'[3]Tasa de Falla'!IS109)","v":""},{"$f":"IF('[3]Tasa de Falla'!IT109=0,\"\",'[3]Tasa de Falla'!IT109)","v":""},{"$f":"IF('[3]Tasa de Falla'!IU109=0,\"\",'[3]Tasa de Falla'!IU109)","v":""},{"$f":"IF('[3]Tasa de Falla'!IV109=0,\"\",'[3]Tasa de Falla'!IV109)","v":""},{"$f":"IF('[3]Tasa de Falla'!IW109=0,\"\",'[3]Tasa de Falla'!IW109)","v":""},{"$f":"IF('[3]Tasa de Falla'!IX109=0,\"\",'[3]Tasa de Falla'!IX109)","v":""},{"$f":"IF('[3]Tasa de Falla'!IY109=0,\"\",'[3]Tasa de Falla'!IY109)","v":""},{"$f":"IF('[3]Tasa de Falla'!IZ109=0,\"\",'[3]Tasa de Falla'!IZ109)","v":""},{"$f":"IF('[3]Tasa de Falla'!JA109=0,\"\",'[3]Tasa de Falla'!JA109)","v":1},{"$f":"IF('[3]Tasa de Falla'!JB109=0,\"\",'[3]Tasa de Falla'!JB109)","v":""}]
[null,null,{"$f":"'[3]Tasa de Falla'!C110","v":93},{"$f":"'[3]Tasa de Falla'!D110","v":"R. DE LA FRONTERA - COBOS"},{"$f":"'[3]Tasa de Falla'!E110","v":132},{"$f":"'[3]Tasa de Falla'!F110","v":130.4},{"$f":"IF('[3]Tasa de Falla'!IQ110=0,\"\",'[3]Tasa de Falla'!IQ110)","v":""},{"$f":"IF('[3]Tasa de Falla'!IR110=0,\"\",'[3]Tasa de Falla'!IR110)","v":""},{"$f":"IF('[3]Tasa de Falla'!IS110=0,\"\",'[3]Tasa de Falla'!IS110)","v":""},{"$f":"IF('[3]Tasa de Falla'!IT110=0,\"\",'[3]Tasa de Falla'!IT110)","v":1},{"$f":"IF('[3]Tasa de Falla'!IU110=0,\"\",'[3]Tasa de Falla'!IU110)","v":""},{"$f":"IF('[3]Tasa de Falla'!IV110=0,\"\",'[3]Tasa de Falla'!IV110)","v":""},{"$f":"IF('[3]Tasa de Falla'!IW110=0,\"\",'[3]Tasa de Falla'!IW110)","v":""},{"$f":"IF('[3]Tasa de Falla'!IX110=0,\"\",'[3]Tasa de Falla'!IX110)","v":""},{"$f":"IF('[3]Tasa de Falla'!IY110=0,\"\",'[3]Tasa de Falla'!IY110)","v":""},{"$f":"IF('[3]Tasa de Falla'!IZ110=0,\"\",'[3]Tasa de Falla'!IZ110)","v":""},{"$f":"IF('[3]Tasa de Falla'!JA110=0,\"\",'[3]Tasa de Falla'!JA110)","v":1},{"$f":"IF('[3]Tasa de Falla'!JB110=0,\"\",'[3]Tasa de Falla'!JB110)","v":""}]
[null,null,{"$f":"'[3]Tasa de Falla'!C111","v":94},{"$f":"'[3]Tasa de Falla'!D111","v":"J.V. GONZALEZ - APOLINARIO SARAVIA"},{"$f":"'[3]Tasa de Falla'!E111","v":132},{"$f":"'[3]Tasa de Falla'!F111","v":94},{"$f":"IF('[3]Tasa de Falla'!IQ111=0,\"\",'[3]Tasa de Falla'!IQ111)","v":""},{"$f":"IF('[3]Tasa de Falla'!IR111=0,\"\",'[3]Tasa de Falla'!IR111)","v":""},{"$f":"IF('[3]Tasa de Falla'!IS111=0,\"\",'[3]Tasa de Falla'!IS111)","v":""},{"$f":"IF('[3]Tasa de Falla'!IT111=0,\"\",'[3]Tasa de Falla'!IT111)","v":""},{"$f":"IF('[3]Tasa de Falla'!IU111=0,\"\",'[3]Tasa de Falla'!IU111)","v":""},{"$f":"IF('[3]Tasa de Falla'!IV111=0,\"\",'[3]Tasa de Falla'!IV111)","v":""},{"$f":"IF('[3]Tasa de Falla'!IW111=0,\"\",'[3]Tasa de Falla'!IW111)","v":""},{"$f":"IF('[3]Tasa de Falla'!IX111=0,\"\",'[3]Tasa de Falla'!IX111)","v":""},{"$f":"IF('[3]Tasa de Falla'!IY111=0,\"\",'[3]Tasa de Falla'!IY111)","v":""},{"$f":"IF('[3]Tasa de Falla'!IZ111=0,\"\",'[3]Tasa de Falla'!IZ111)","v":""},{"$f":"IF('[3]Tasa de Falla'!JA111=0,\"\",'[3]Tasa de Falla'!JA111)","v":""},{"$f":"IF('[3]Tasa de Falla'!JB111=0,\"\",'[3]Tasa de Falla'!JB111)","v":""}]
[null,null,{"$f":"'[3]Tasa de Falla'!C112","v":95},{"$f":"'[3]Tasa de Falla'!D112","v":"ANDALGALA - SAULIL"},{"$f":"'[3]Tasa de Falla'!E112","v":132},{"$f":"'[3]Tasa de Falla'!F112","v":76},{"$f":"IF('[3]Tasa de Falla'!IQ112=0,\"\",'[3]Tasa de Falla'!IQ112)","v":1},{"$f":"IF('[3]Tasa de Falla'!IR112=0,\"\",'[3]Tasa de Falla'!IR112)","v":""},{"$f":"IF('[3]Tasa de Falla'!IS112=0,\"\",'[3]Tasa de Falla'!IS112)","v":""},{"$f":"IF('[3]Tasa de Falla'!IT112=0,\"\",'[3]Tasa de Falla'!IT112)","v":""},{"$f":"IF('[3]Tasa de Falla'!IU112=0,\"\",'[3]Tasa de Falla'!IU112)","v":""},{"$f":"IF('[3]Tasa de Falla'!IV112=0,\"\",'[3]Tasa de Falla'!IV112)","v":""},{"$f":"IF('[3]Tasa de Falla'!IW112=0,\"\",'[3]Tasa de Falla'!IW112)","v":""},{"$f":"IF('[3]Tasa de Falla'!IX112=0,\"\",'[3]Tasa de Falla'!IX112)","v":""},{"$f":"IF('[3]Tasa de Falla'!IY112=0,\"\",'[3]Tasa de Falla'!IY112)","v":""},{"$f":"IF('[3]Tasa de Falla'!IZ112=0,\"\",'[3]Tasa de Falla'!IZ112)","v":""},{"$f":"IF('[3]Tasa de Falla'!JA112=0,\"\",'[3]Tasa de Falla'!JA112)","v":""},{"$f":"IF('[3]Tasa de Falla'!JB112=0,\"\",'[3]Tasa de Falla'!JB112)","v":""}]
[null,null,{"$f":"'[3]Tasa de Falla'!C113","v":96},{"$f":"'[3]Tasa de Falla'!D113","v":"SANTIAGO OESTE - SANT. SUR  - SANT. CENTRO"},{"$f":"'[3]Tasa de Falla'!E113","v":132},{"$f":"'[3]Tasa de Falla'!F113","v":14.6},{"$f":"IF('[3]Tasa de Falla'!IQ113=0,\"\",'[3]Tasa de Falla'!IQ113)","v":"XXXX"},{"$f":"IF('[3]Tasa de Falla'!IR113=0,\"\",'[3]Tasa de Falla'!IR113)","v":"XXXX"},{"$f":"IF('[3]Tasa de Falla'!IS113=0,\"\",'[3]Tasa de Falla'!IS113)","v":"XXXX"},{"$f":"IF('[3]Tasa de Falla'!IT113=0,\"\",'[3]Tasa de Falla'!IT113)","v":"XXXX"},{"$f":"IF('[3]Tasa de Falla'!IU113=0,\"\",'[3]Tasa de Falla'!IU113)","v":"XXXX"},{"$f":"IF('[3]Tasa de Falla'!IV113=0,\"\",'[3]Tasa de Falla'!IV113)","v":"XXXX"},{"$f":"IF('[3]Tasa de Falla'!IW113=0,\"\",'[3]Tasa de Falla'!IW113)","v":"XXXX"},{"$f":"IF('[3]Tasa de Falla'!IX113=0,\"\",'[3]Tasa de Falla'!IX113)","v":"XXXX"},{"$f":"IF('[3]Tasa de Falla'!IY113=0,\"\",'[3]Tasa de Falla'!IY113)","v":"XXXX"},{"$f":"IF('[3]Tasa de Falla'!IZ113=0,\"\",'[3]Tasa de Falla'!IZ113)","v":"XXXX"},{"$f":"IF('[3]Tasa de Falla'!JA113=0,\"\",'[3]Tasa de Falla'!JA113)","v":"XXXX"},{"$f":"IF('[3]Tasa de Falla'!JB113=0,\"\",'[3]Tasa de Falla'!JB113)","v":"XXXX"}]
[null,null,{"$f":"'[3]Tasa de Falla'!C114","v":97},{"$f":"'[3]Tasa de Falla'!D114","v":"SUNCHO CORRAL - QUIMILI"},{"$f":"'[3]Tasa de Falla'!E114","v":132},{"$f":"'[3]Tasa de Falla'!F114","v":108},{"$f":"IF('[3]Tasa de Falla'!IQ114=0,\"\",'[3]Tasa de Falla'!IQ114)","v":""},{"$f":"IF('[3]Tasa de Falla'!IR114=0,\"\",'[3]Tasa de Falla'!IR114)","v":""},{"$f":"IF('[3]Tasa de Falla'!IS114=0,\"\",'[3]Tasa de Falla'!IS114)","v":""},{"$f":"IF('[3]Tasa de Falla'!IT114=0,\"\",'[3]Tasa de Falla'!IT114)","v":""},{"$f":"IF('[3]Tasa de Falla'!IU114=0,\"\",'[3]Tasa de Falla'!IU114)","v":""},{"$f":"IF('[3]Tasa de Falla'!IV114=0,\"\",'[3]Tasa de Falla'!IV114)","v":""},{"$f":"IF('[3]Tasa de Falla'!IW114=0,\"\",'[3]Tasa de Falla'!IW114)","v":""},{"$f":"IF('[3]Tasa de Falla'!IX114=0,\"\",'[3]Tasa de Falla'!IX114)","v":""},{"$f":"IF('[3]Tasa de Falla'!IY114=0,\"\",'[3]Tasa de Falla'!IY114)","v":""},{"$f":"IF('[3]Tasa de Falla'!IZ114=0,\"\",'[3]Tasa de Falla'!IZ114)","v":""},{"$f":"IF('[3]Tasa de Falla'!JA114=0,\"\",'[3]Tasa de Falla'!JA114)","v":""},{"$f":"IF('[3]Tasa de Falla'!JB114=0,\"\",'[3]Tasa de Falla'!JB114)","v":""}]
[null,null,{"$f":"'[3]Tasa de Falla'!C115","v":98},{"$f":"'[3]Tasa de Falla'!D115","v":"EL BRACHO - LA BANDA ESTE"},{"$f":"'[3]Tasa de Falla'!E115","v":132},{"$f":"'[3]Tasa de Falla'!F115","v":140.9},{"$f":"IF('[3]Tasa de Falla'!IQ115=0,\"\",'[3]Tasa de Falla'!IQ115)","v":""},{"$f":"IF('[3]Tasa de Falla'!IR115=0,\"\",'[3]Tasa de Falla'!IR115)","v":""},{"$f":"IF('[3]Tasa de Falla'!IS115=0,\"\",'[3]Tasa de Falla'!IS115)","v":""},{"$f":"IF('[3]Tasa de Falla'!IT115=0,\"\",'[3]Tasa de Falla'!IT115)","v":1},{"$f":"IF('[3]Tasa de Falla'!IU115=0,\"\",'[3]Tasa de Falla'!IU115)","v":""},{"$f":"IF('[3]Tasa de Falla'!IV115=0,\"\",'[3]Tasa de Falla'!IV115)","v":1},{"$f":"IF('[3]Tasa de Falla'!IW115=0,\"\",'[3]Tasa de Falla'!IW115)","v":""},{"$f":"IF('[3]Tasa de Falla'!IX115=0,\"\",'[3]Tasa de Falla'!IX115)","v":""},{"$f":"IF('[3]Tasa de Falla'!IY115=0,\"\",'[3]Tasa de Falla'!IY115)","v":""},{"$f":"IF('[3]Tasa de Falla'!IZ115=0,\"\",'[3]Tasa de Falla'!IZ115)","v":""},{"$f":"IF('[3]Tasa de Falla'!JA115=0,\"\",'[3]Tasa de Falla'!JA115)","v":""},{"$f":"IF('[3]Tasa de Falla'!JB115=0,\"\",'[3]Tasa de Falla'!JB115)","v":""}]
[null,null,{"$f":"'[3]Tasa de Falla'!C116","v":99},{"$f":"'[3]Tasa de Falla'!D116","v":"LA BANDA ESTE - LA BANDA"},{"$f":"'[3]Tasa de Falla'!E116","v":132},{"$f":"'[3]Tasa de Falla'!F116","v":16.2},{"$f":"IF('[3]Tasa de Falla'!IQ116=0,\"\",'[3]Tasa de Falla'!IQ116)","v":""},{"$f":"IF('[3]Tasa de Falla'!IR116=0,\"\",'[3]Tasa de Falla'!IR116)","v":""},{"$f":"IF('[3]Tasa de Falla'!IS116=0,\"\",'[3]Tasa de Falla'!IS116)","v":""},{"$f":"IF('[3]Tasa de Falla'!IT116=0,\"\",'[3]Tasa de Falla'!IT116)","v":""},{"$f":"IF('[3]Tasa de Falla'!IU116=0,\"\",'[3]Tasa de Falla'!IU116)","v":""},{"$f":"IF('[3]Tasa de Falla'!IV116=0,\"\",'[3]Tasa de Falla'!IV116)","v":""},{"$f":"IF('[3]Tasa de Falla'!IW116=0,\"\",'[3]Tasa de Falla'!IW116)","v":""},{"$f":"IF('[3]Tasa de Falla'!IX116=0,\"\",'[3]Tasa de Falla'!IX116)","v":""},{"$f":"IF('[3]Tasa de Falla'!IY116=0,\"\",'[3]Tasa de Falla'!IY116)","v":""},{"$f":"IF('[3]Tasa de Falla'!IZ116=0,\"\",'[3]Tasa de Falla'!IZ116)","v":""},{"$f":"IF('[3]Tasa de Falla'!JA116=0,\"\",'[3]Tasa de Falla'!JA116)","v":""},{"$f":"IF('[3]Tasa de Falla'!JB116=0,\"\",'[3]Tasa de Falla'!JB116)","v":""}]
[null,null,{"$f":"'[3]Tasa de Falla'!C117","v":100},{"$f":"'[3]Tasa de Falla'!D117","v":"TABACAL - PICHANAL"},{"$f":"'[3]Tasa de Falla'!E117","v":132},{"$f":"'[3]Tasa de Falla'!F117","v":9.0399999999999991},{"$f":"IF('[3]Tasa de Falla'!IQ117=0,\"\",'[3]Tasa de Falla'!IQ117)","v":""},{"$f":"IF('[3]Tasa de Falla'!IR117=0,\"\",'[3]Tasa de Falla'!IR117)","v":""},{"$f":"IF('[3]Tasa de Falla'!IS117=0,\"\",'[3]Tasa de Falla'!IS117)","v":""},{"$f":"IF('[3]Tasa de Falla'!IT117=0,\"\",'[3]Tasa de Falla'!IT117)","v":""},{"$f":"IF('[3]Tasa de Falla'!IU117=0,\"\",'[3]Tasa de Falla'!IU117)","v":""},{"$f":"IF('[3]Tasa de Falla'!IV117=0,\"\",'[3]Tasa de Falla'!IV117)","v":""},{"$f":"IF('[3]Tasa de Falla'!IW117=0,\"\",'[3]Tasa de Falla'!IW117)","v":""},{"$f":"IF('[3]Tasa de Falla'!IX117=0,\"\",'[3]Tasa de Falla'!IX117)","v":""},{"$f":"IF('[3]Tasa de Falla'!IY117=0,\"\",'[3]Tasa de Falla'!IY117)","v":""},{"$f":"IF('[3]Tasa de Falla'!IZ117=0,\"\",'[3]Tasa de Falla'!IZ117)","v":""},{"$f":"IF('[3]Tasa de Falla'!JA117=0,\"\",'[3]Tasa de Falla'!JA117)","v":""},{"$f":"IF('[3]Tasa de Falla'!JB117=0,\"\",'[3]Tasa de Falla'!JB117)","v":""}]
[null,null,{"$f":"'[3]Tasa de Falla'!C118","v":101},{"$f":"'[3]Tasa de Falla'!D118","v":"ORAN - TABACAL"},{"$f":"'[3]Tasa de Falla'!E118","v":132},{"$f":"'[3]Tasa de Falla'!F118","v":10},{"$f":"IF('[3]Tasa de Falla'!IQ118=0,\"\",'[3]Tasa de Falla'!IQ118)","v":""},{"$f":"IF('[3]Tasa de Falla'!IR118=0,\"\",'[3]Tasa de Falla'!IR118)","v":""},{"$f":"IF('[3]Tasa de Falla'!IS118=0,\"\",'[3]Tasa de Falla'!IS118)","v":""},{"$f":"IF('[3]Tasa de Falla'!IT118=0,\"\",'[3]Tasa de Falla'!IT118)","v":""},{"$f":"IF('[3]Tasa de Falla'!IU118=0,\"\",'[3]Tasa de Falla'!IU118)","v":""},{"$f":"IF('[3]Tasa de Falla'!IV118=0,\"\",'[3]Tasa de Falla'!IV118)","v":""},{"$f":"IF('[3]Tasa de Falla'!IW118=0,\"\",'[3]Tasa de Falla'!IW118)","v":""},{"$f":"IF('[3]Tasa de Falla'!IX118=0,\"\",'[3]Tasa de Falla'!IX118)","v":""},{"$f":"IF('[3]Tasa de Falla'!IY118=0,\"\",'[3]Tasa de Falla'!IY118)","v":1},{"$f":"IF('[3]Tasa de Falla'!IZ118=0,\"\",'[3]Tasa de Falla'!IZ118)","v":""},{"$f":"IF('[3]Tasa de Falla'!JA118=0,\"\",'[3]Tasa de Falla'!JA118)","v":""},{"$f":"IF('[3]Tasa de Falla'!JB118=0,\"\",'[3]Tasa de Falla'!JB118)","v":""}]
[null,null,{"$f":"'[3]Tasa de Falla'!C119","v":102},{"$f":"'[3]Tasa de Falla'!D119","v":"MONTE QUEMADO -COPO - QUIMILI"},{"$f":"'[3]Tasa de Falla'!E119","v":132},{"$f":"'[3]Tasa de Falla'!F119","v":218},{"$f":"IF('[3]Tasa de Falla'!IQ119=0,\"\",'[3]Tasa de Falla'!IQ119)","v":""},{"$f":"IF('[3]Tasa de Falla'!IR119=0,\"\",'[3]Tasa de Falla'!IR119)","v":""},{"$f":"IF('[3]Tasa de Falla'!IS119=0,\"\",'[3]Tasa de Falla'!IS119)","v":""},{"$f":"IF('[3]Tasa de Falla'!IT119=0,\"\",'[3]Tasa de Falla'!IT119)","v":1},{"$f":"IF('[3]Tasa de Falla'!IU119=0,\"\",'[3]Tasa de Falla'!IU119)","v":""},{"$f":"IF('[3]Tasa de Falla'!IV119=0,\"\",'[3]Tasa de Falla'!IV119)","v":""},{"$f":"IF('[3]Tasa de Falla'!IW119=0,\"\",'[3]Tasa de Falla'!IW119)","v":""},{"$f":"IF('[3]Tasa de Falla'!IX119=0,\"\",'[3]Tasa de Falla'!IX119)","v":""},{"$f":"IF('[3]Tasa de Falla'!IY119=0,\"\",'[3]Tasa de Falla'!IY119)","v":""},{"$f":"IF('[3]Tasa de Falla'!IZ119=0,\"\",'[3]Tasa de Falla'!IZ119)","v":""},{"$f":"IF('[3]Tasa de Falla'!JA119=0,\"\",'[3]Tasa de Falla'!JA119)","v":""},{"$f":"IF('[3]Tasa de Falla'!JB119=0,\"\",'[3]Tasa de Falla'!JB119)","v":""}]
[null,null,{"$f":"'[3]Tasa de Falla'!C120","v":103},{"$f":"'[3]Tasa de Falla'!D120","v":"PI. CIRCUNVALACIÓN - LARIOJA N. 1"},{"$f":"'[3]Tasa de Falla'!E120","v":132},{"$f":"'[3]Tasa de Falla'!F120","v":16.649999999999999},{"$f":"IF('[3]Tasa de Falla'!IQ120=0,\"\",'[3]Tasa de Falla'!IQ120)","v":""},{"$f":"IF('[3]Tasa de Falla'!IR120=0,\"\",'[3]Tasa de Falla'!IR120)","v":""},{"$f":"IF('[3]Tasa de Falla'!IS120=0,\"\",'[3]Tasa de Falla'!IS120)","v":1},{"$f":"IF('[3]Tasa de Falla'!IT120=0,\"\",'[3]Tasa de Falla'!IT120)","v":""},{"$f":"IF('[3]Tasa de Falla'!IU120=0,\"\",'[3]Tasa de Falla'!IU120)","v":""},{"$f":"IF('[3]Tasa de Falla'!IV120=0,\"\",'[3]Tasa de Falla'!IV120)","v":""},{"$f":"IF('[3]Tasa de Falla'!IW120=0,\"\",'[3]Tasa de Falla'!IW120)","v":""},{"$f":"IF('[3]Tasa de Falla'!IX120=0,\"\",'[3]Tasa de Falla'!IX120)","v":""},{"$f":"IF('[3]Tasa de Falla'!IY120=0,\"\",'[3]Tasa de Falla'!IY120)","v":""},{"$f":"IF('[3]Tasa de Falla'!IZ120=0,\"\",'[3]Tasa de Falla'!IZ120)","v":""},{"$f":"IF('[3]Tasa de Falla'!JA120=0,\"\",'[3]Tasa de Falla'!JA120)","v":""},{"$f":"IF('[3]Tasa de Falla'!JB120=0,\"\",'[3]Tasa de Falla'!JB120)","v":""}]
[null,null,{"$f":"'[3]Tasa de Falla'!C121","v":104},{"$f":"'[3]Tasa de Falla'!D121","v":"PATQUIA NONOGASTA 132 1"},{"$f":"'[3]Tasa de Falla'!E121","v":132},{"$f":"'[3]Tasa de Falla'!F121","v":108.3},{"$f":"IF('[3]Tasa de Falla'!IQ121=0,\"\",'[3]Tasa de Falla'!IQ121)","v":""},{"$f":"IF('[3]Tasa de Falla'!IR121=0,\"\",'[3]Tasa de Falla'!IR121)","v":""},{"$f":"IF('[3]Tasa de Falla'!IS121=0,\"\",'[3]Tasa de Falla'!IS121)","v":""},{"$f":"IF('[3]Tasa de Falla'!IT121=0,\"\",'[3]Tasa de Falla'!IT121)","v":""},{"$f":"IF('[3]Tasa de Falla'!IU121=0,\"\",'[3]Tasa de Falla'!IU121)","v":""},{"$f":"IF('[3]Tasa de Falla'!IV121=0,\"\",'[3]Tasa de Falla'!IV121)","v":""},{"$f":"IF('[3]Tasa de Falla'!IW121=0,\"\",'[3]Tasa de Falla'!IW121)","v":""},{"$f":"IF('[3]Tasa de Falla'!IX121=0,\"\",'[3]Tasa de Falla'!IX121)","v":""},{"$f":"IF('[3]Tasa de Falla'!IY121=0,\"\",'[3]Tasa de Falla'!IY121)","v":""},{"$f":"IF('[3]Tasa de Falla'!IZ121=0,\"\",'[3]Tasa de Falla'!IZ121)","v":""},{"$f":"IF('[3]Tasa de Falla'!JA121=0,\"\",'[3]Tasa de Falla'!JA121)","v":""},{"$f":"IF('[3]Tasa de Falla'!JB121=0,\"\",'[3]Tasa de Falla'!JB121)","v":""}]
[null,null,{"$f":"'[3]Tasa de Falla'!C122","v":105},{"$f":"'[3]Tasa de Falla'!D122","v":"NONOGASTA - VILLA UNION 132 1"},{"$f":"'[3]Tasa de Falla'!E122","v":132},{"$f":"'[3]Tasa de Falla'!F122","v":82.1},{"$f":"IF('[3]Tasa de Falla'!IQ122=0,\"\",'[3]Tasa de Falla'!IQ122)","v":""},{"$f":"IF('[3]Tasa de Falla'!IR122=0,\"\",'[3]Tasa de Falla'!IR122)","v":""},{"$f":"IF('[3]Tasa de Falla'!IS122=0,\"\",'[3]Tasa de Falla'!IS122)","v":""},{"$f":"IF('[3]Tasa de Falla'!IT122=0,\"\",'[3]Tasa de Falla'!IT122)","v":""},{"$f":"IF('[3]Tasa de Falla'!IU122=0,\"\",'[3]Tasa de Falla'!IU122)","v":""},{"$f":"IF('[3]Tasa de Falla'!IV122=0,\"\",'[3]Tasa de Falla'!IV122)","v":""},{"$f":"IF('[3]Tasa de Falla'!IW122=0,\"\",'[3]Tasa de Falla'!IW122)","v":""},{"$f":"IF('[3]Tasa de Falla'!IX122=0,\"\",'[3]Tasa de Falla'!IX122)","v":""},{"$f":"IF('[3]Tasa de Falla'!IY122=0,\"\",'[3]Tasa de Falla'!IY122)","v":""},{"$f":"IF('[3]Tasa de Falla'!IZ122=0,\"\",'[3]Tasa de Falla'!IZ122)","v":""},{"$f":"IF('[3]Tasa de Falla'!JA122=0,\"\",'[3]Tasa de Falla'!JA122)","v":""},{"$f":"IF('[3]Tasa de Falla'!JB122=0,\"\",'[3]Tasa de Falla'!JB122)","v":""}]
[null,null,{"$f":"'[3]Tasa de Falla'!C123","v":106},{"$f":"'[3]Tasa de Falla'!D123","v":"ARAUCO - AIMOGASTA 132 1"},{"$f":"'[3]Tasa de Falla'!E123","v":132},{"$f":"'[3]Tasa de Falla'!F123","v":20},{"$f":"IF('[3]Tasa de Falla'!IQ123=0,\"\",'[3]Tasa de Falla'!IQ123)","v":""},{"$f":"IF('[3]Tasa de Falla'!IR123=0,\"\",'[3]Tasa de Falla'!IR123)","v":""},{"$f":"IF('[3]Tasa de Falla'!IS123=0,\"\",'[3]Tasa de Falla'!IS123)","v":""},{"$f":"IF('[3]Tasa de Falla'!IT123=0,\"\",'[3]Tasa de Falla'!IT123)","v":""},{"$f":"IF('[3]Tasa de Falla'!IU123=0,\"\",'[3]Tasa de Falla'!IU123)","v":""},{"$f":"IF('[3]Tasa de Falla'!IV123=0,\"\",'[3]Tasa de Falla'!IV123)","v":""},{"$f":"IF('[3]Tasa de Falla'!IW123=0,\"\",'[3]Tasa de Falla'!IW123)","v":""},{"$f":"IF('[3]Tasa de Falla'!IX123=0,\"\",'[3]Tasa de Falla'!IX123)","v":""},{"$f":"IF('[3]Tasa de Falla'!IY123=0,\"\",'[3]Tasa de Falla'!IY123)","v":""},{"$f":"IF('[3]Tasa de Falla'!IZ123=0,\"\",'[3]Tasa de Falla'!IZ123)","v":""},{"$f":"IF('[3]Tasa de Falla'!JA123=0,\"\",'[3]Tasa de Falla'!JA123)","v":""},{"$f":"IF('[3]Tasa de Falla'!JB123=0,\"\",'[3]Tasa de Falla'!JB123)","v":""}]
[null,null,{"$f":"'[3]Tasa de Falla'!C124","v":107},{"$f":"'[3]Tasa de Falla'!D124","v":"PATQUIA - CHAMICAL 132 1"},{"$f":"'[3]Tasa de Falla'!E124","v":132},{"$f":"'[3]Tasa de Falla'!F124","v":67.400000000000006},{"$f":"IF('[3]Tasa de Falla'!IQ124=0,\"\",'[3]Tasa de Falla'!IQ124)","v":""},{"$f":"IF('[3]Tasa de Falla'!IR124=0,\"\",'[3]Tasa de Falla'!IR124)","v":""},{"$f":"IF('[3]Tasa de Falla'!IS124=0,\"\",'[3]Tasa de Falla'!IS124)","v":""},{"$f":"IF('[3]Tasa de Falla'!IT124=0,\"\",'[3]Tasa de Falla'!IT124)","v":""},{"$f":"IF('[3]Tasa de Falla'!IU124=0,\"\",'[3]Tasa de Falla'!IU124)","v":""},{"$f":"IF('[3]Tasa de Falla'!IV124=0,\"\",'[3]Tasa de Falla'!IV124)","v":""},{"$f":"IF('[3]Tasa de Falla'!IW124=0,\"\",'[3]Tasa de Falla'!IW124)","v":""},{"$f":"IF('[3]Tasa de Falla'!IX124=0,\"\",'[3]Tasa de Falla'!IX124)","v":""},{"$f":"IF('[3]Tasa de Falla'!IY124=0,\"\",'[3]Tasa de Falla'!IY124)","v":""},{"$f":"IF('[3]Tasa de Falla'!IZ124=0,\"\",'[3]Tasa de Falla'!IZ124)","v":""},{"$f":"IF('[3]Tasa de Falla'!JA124=0,\"\",'[3]Tasa de Falla'!JA124)","v":""},{"$f":"IF('[3]Tasa de Falla'!JB124=0,\"\",'[3]Tasa de Falla'!JB124)","v":""}]
[null,null,{"$f":"'[3]Tasa de Falla'!C125","v":108},{"$f":"'[3]Tasa de Falla'!D125","v":"LA RIOJA - ARAUCO 132 1"},{"$f":"'[3]Tasa de Falla'!E125","v":132},{"$f":"'[3]Tasa de Falla'!F125","v":84.3},{"$f":"IF('[3]Tasa de Falla'!IQ125=0,\"\",'[3]Tasa de Falla'!IQ125)","v":""},{"$f":"IF('[3]Tasa de Falla'!IR125=0,\"\",'[3]Tasa de Falla'!IR125)","v":""},{"$f":"IF('[3]Tasa de Falla'!IS125=0,\"\",'[3]Tasa de Falla'!IS125)","v":""},{"$f":"IF('[3]Tasa de Falla'!IT125=0,\"\",'[3]Tasa de Falla'!IT125)","v":""},{"$f":"IF('[3]Tasa de Falla'!IU125=0,\"\",'[3]Tasa de Falla'!IU125)","v":""},{"$f":"IF('[3]Tasa de Falla'!IV125=0,\"\",'[3]Tasa de Falla'!IV125)","v":""},{"$f":"IF('[3]Tasa de Falla'!IW125=0,\"\",'[3]Tasa de Falla'!IW125)","v":1},{"$f":"IF('[3]Tasa de Falla'!IX125=0,\"\",'[3]Tasa de Falla'!IX125)","v":""},{"$f":"IF('[3]Tasa de Falla'!IY125=0,\"\",'[3]Tasa de Falla'!IY125)","v":""},{"$f":"IF('[3]Tasa de Falla'!IZ125=0,\"\",'[3]Tasa de Falla'!IZ125)","v":""},{"$f":"IF('[3]Tasa de Falla'!JA125=0,\"\",'[3]Tasa de Falla'!JA125)","v":""},{"$f":"IF('[3]Tasa de Falla'!JB125=0,\"\",'[3]Tasa de Falla'!JB125)","v":""}]
[null,null,{"$f":"'[3]Tasa de Falla'!C126","v":109},{"$f":"'[3]Tasa de Falla'!D126","v":"PI PATQUIA - PATQUIA 132 1"},{"$f":"'[3]Tasa de Falla'!E126","v":132},{"$f":"'[3]Tasa de Falla'!F126","v":58.65},{"$f":"IF('[3]Tasa de Falla'!IQ126=0,\"\",'[3]Tasa de Falla'!IQ126)","v":""},{"$f":"IF('[3]Tasa de Falla'!IR126=0,\"\",'[3]Tasa de Falla'!IR126)","v":""},{"$f":"IF('[3]Tasa de Falla'!IS126=0,\"\",'[3]Tasa de Falla'!IS126)","v":""},{"$f":"IF('[3]Tasa de Falla'!IT126=0,\"\",'[3]Tasa de Falla'!IT126)","v":""},{"$f":"IF('[3]Tasa de Falla'!IU126=0,\"\",'[3]Tasa de Falla'!IU126)","v":""},{"$f":"IF('[3]Tasa de Falla'!IV126=0,\"\",'[3]Tasa de Falla'!IV126)","v":""},{"$f":"IF('[3]Tasa de Falla'!IW126=0,\"\",'[3]Tasa de Falla'!IW126)","v":""},{"$f":"IF('[3]Tasa de Falla'!IX126=0,\"\",'[3]Tasa de Falla'!IX126)","v":""},{"$f":"IF('[3]Tasa de Falla'!IY126=0,\"\",'[3]Tasa de Falla'!IY126)","v":""},{"$f":"IF('[3]Tasa de Falla'!IZ126=0,\"\",'[3]Tasa de Falla'!IZ126)","v":""},{"$f":"IF('[3]Tasa de Falla'!JA126=0,\"\",'[3]Tasa de Falla'!JA126)","v":""},{"$f":"IF('[3]Tasa de Falla'!JB126=0,\"\",'[3]Tasa de Falla'!JB126)","v":""}]
[null,null,{"$f":"'[3]Tasa de Falla'!C127","v":110},{"$f":"'[3]Tasa de Falla'!D127","v":"RIO HONDO - TERMAS NORTE"},{"$f":"'[3]Tasa de Falla'!E127","v":132},{"$f":"'[3]Tasa de Falla'!F127","v":5.8},{"$f":"IF('[3]Tasa de Falla'!IQ127=0,\"\",'[3]Tasa de Falla'!IQ127)","v":"XXXX"},{"$f":"IF('[3]Tasa de Falla'!IR127=0,\"\",'[3]Tasa de Falla'!IR127)","v":"XXXX"},{"$f":"IF('[3]Tasa de Falla'!IS127=0,\"\",'[3]Tasa de Falla'!IS127)","v":""},{"$f":"IF('[3]Tasa de Falla'!IT127=0,\"\",'[3]Tasa de Falla'!IT127)","v":""},{"$f":"IF('[3]Tasa de Falla'!IU127=0,\"\",'[3]Tasa de Falla'!IU127)","v":""},{"$f":"IF('[3]Tasa de Falla'!IV127=0,\"\",'[3]Tasa de Falla'!IV127)","v":""},{"$f":"IF('[3]Tasa de Falla'!IW127=0,\"\",'[3]Tasa de Falla'!IW127)","v":""},{"$f":"IF('[3]Tasa de Falla'!IX127=0,\"\",'[3]Tasa de Falla'!IX127)","v":""},{"$f":"IF('[3]Tasa de Falla'!IY127=0,\"\",'[3]Tasa de Falla'!IY127)","v":""},{"$f":"IF('[3]Tasa de Falla'!IZ127=0,\"\",'[3]Tasa de Falla'!IZ127)","v":""},{"$f":"IF('[3]Tasa de Falla'!JA127=0,\"\",'[3]Tasa de Falla'!JA127)","v":""},{"$f":"IF('[3]Tasa de Falla'!JB127=0,\"\",'[3]Tasa de Falla'!JB127)","v":""}]
[null,null,{"$f":"'[3]Tasa de Falla'!C128","v":111},{"$f":"'[3]Tasa de Falla'!D128","v":"EL BRACHO - TETRMAS NORTE"},{"$f":"'[3]Tasa de Falla'!E128","v":132},{"$f":"'[3]Tasa de Falla'!F128","v":78.400000000000006},{"$f":"IF('[3]Tasa de Falla'!IQ128=0,\"\",'[3]Tasa de Falla'!IQ128)","v":"XXXX"},{"$f":"IF('[3]Tasa de Falla'!IR128=0,\"\",'[3]Tasa de Falla'!IR128)","v":"XXXX"},{"$f":"IF('[3]Tasa de Falla'!IS128=0,\"\",'[3]Tasa de Falla'!IS128)","v":""},{"$f":"IF('[3]Tasa de Falla'!IT128=0,\"\",'[3]Tasa de Falla'!IT128)","v":""},{"$f":"IF('[3]Tasa de Falla'!IU128=0,\"\",'[3]Tasa de Falla'!IU128)","v":""},{"$f":"IF('[3]Tasa de Falla'!IV128=0,\"\",'[3]Tasa de Falla'!IV128)","v":""},{"$f":"IF('[3]Tasa de Falla'!IW128=0,\"\",'[3]Tasa de Falla'!IW128)","v":""},{"$f":"IF('[3]Tasa de Falla'!IX128=0,\"\",'[3]Tasa de Falla'!IX128)","v":""},{"$f":"IF('[3]Tasa de Falla'!IY128=0,\"\",'[3]Tasa de Falla'!IY128)","v":""},{"$f":"IF('[3]Tasa de Falla'!IZ128=0,\"\",'[3]Tasa de Falla'!IZ128)","v":1},{"$f":"IF('[3]Tasa de Falla'!JA128=0,\"\",'[3]Tasa de Falla'!JA128)","v":1},{"$f":"IF('[3]Tasa de Falla'!JB128=0,\"\",'[3]Tasa de Falla'!JB128)","v":""}]
[null,null,{"$f":"'[3]Tasa de Falla'!C129","v":112},{"$f":"'[3]Tasa de Falla'!D129","v":"PI 150 NORTE - LA RIOJA ESTE"},{"$f":"'[3]Tasa de Falla'!E129","v":132},{"$f":"'[3]Tasa de Falla'!F129","v":4},{"$f":"IF('[3]Tasa de Falla'!IQ129=0,\"\",'[3]Tasa de Falla'!IQ129)","v":"XXXX"},{"$f":"IF('[3]Tasa de Falla'!IR129=0,\"\",'[3]Tasa de Falla'!IR129)","v":"XXXX"},{"$f":"IF('[3]Tasa de Falla'!IS129=0,\"\",'[3]Tasa de Falla'!IS129)","v":""},{"$f":"IF('[3]Tasa de Falla'!IT129=0,\"\",'[3]Tasa de Falla'!IT129)","v":""},{"$f":"IF('[3]Tasa de Falla'!IU129=0,\"\",'[3]Tasa de Falla'!IU129)","v":""},{"$f":"IF('[3]Tasa de Falla'!IV129=0,\"\",'[3]Tasa de Falla'!IV129)","v":""},{"$f":"IF('[3]Tasa de Falla'!IW129=0,\"\",'[3]Tasa de Falla'!IW129)","v":""},{"$f":"IF('[3]Tasa de Falla'!IX129=0,\"\",'[3]Tasa de Falla'!IX129)","v":""},{"$f":"IF('[3]Tasa de Falla'!IY129=0,\"\",'[3]Tasa de Falla'!IY129)","v":""},{"$f":"IF('[3]Tasa de Falla'!IZ129=0,\"\",'[3]Tasa de Falla'!IZ129)","v":""},{"$f":"IF('[3]Tasa de Falla'!JA129=0,\"\",'[3]Tasa de Falla'!JA129)","v":""},{"$f":"IF('[3]Tasa de Falla'!JB129=0,\"\",'[3]Tasa de Falla'!JB129)","v":""}]
[null,null,{"$f":"'[3]Tasa de Falla'!C130","v":113},{"$f":"'[3]Tasa de Falla'!D130","v":"PI 150 SUR - LA RIOJA ESTE"},{"$f":"'[3]Tasa de Falla'!E130","v":132},{"$f":"'[3]Tasa de Falla'!F130","v":4},{"$f":"IF('[3]Tasa de Falla'!IQ130=0,\"\",'[3]Tasa de Falla'!IQ130)","v":"XXXX"},{"$f":"IF('[3]Tasa de Falla'!IR130=0,\"\",'[3]Tasa de Falla'!IR130)","v":"XXXX"},{"$f":"IF('[3]Tasa de Falla'!IS130=0,\"\",'[3]Tasa de Falla'!IS130)","v":""},{"$f":"IF('[3]Tasa de Falla'!IT130=0,\"\",'[3]Tasa de Falla'!IT130)","v":""},{"$f":"IF('[3]Tasa de Falla'!IU130=0,\"\",'[3]Tasa de Falla'!IU130)","v":""},{"$f":"IF('[3]Tasa de Falla'!IV130=0,\"\",'[3]Tasa de Falla'!IV130)","v":""},{"$f":"IF('[3]Tasa de Falla'!IW130=0,\"\",'[3]Tasa de Falla'!IW130)","v":""},{"$f":"IF('[3]Tasa de Falla'!IX130=0,\"\",'[3]Tasa de Falla'!IX130)","v":""},{"$f":"IF('[3]Tasa de Falla'!IY130=0,\"\",'[3]Tasa de Falla'!IY130)","v":""},{"$f":"IF('[3]Tasa de Falla'!IZ130=0,\"\",'[3]Tasa de Falla'!IZ130)","v":""},{"$f":"IF('[3]Tasa de Falla'!JA130=0,\"\",'[3]Tasa de Falla'!JA130)","v":""},{"$f":"IF('[3]Tasa de Falla'!JB130=0,\"\",'[3]Tasa de Falla'!JB130)","v":""}]
[null,null,{"$f":"'[3]Tasa de Falla'!C131","v":114},{"$f":"'[3]Tasa de Falla'!D131","v":"QUIMILI - CAMPO GALLO 132 1"},{"$f":"'[3]Tasa de Falla'!E131","v":132},{"$f":"'[3]Tasa de Falla'!F131","v":140},{"$f":"IF('[3]Tasa de Falla'!IQ131=0,\"\",'[3]Tasa de Falla'!IQ131)","v":"XXXX"},{"$f":"IF('[3]Tasa de Falla'!IR131=0,\"\",'[3]Tasa de Falla'!IR131)","v":"XXXX"},{"$f":"IF('[3]Tasa de Falla'!IS131=0,\"\",'[3]Tasa de Falla'!IS131)","v":"XXXX"},{"$f":"IF('[3]Tasa de Falla'!IT131=0,\"\",'[3]Tasa de Falla'!IT131)","v":""},{"$f":"IF('[3]Tasa de Falla'!IU131=0,\"\",'[3]Tasa de Falla'!IU131)","v":""},{"$f":"IF('[3]Tasa de Falla'!IV131=0,\"\",'[3]Tasa de Falla'!IV131)","v":""},{"$f":"IF('[3]Tasa de Falla'!IW131=0,\"\",'[3]Tasa de Falla'!IW131)","v":""},{"$f":"IF('[3]Tasa de Falla'!IX131=0,\"\",'[3]Tasa de Falla'!IX131)","v":""},{"$f":"IF('[3]Tasa de Falla'!IY131=0,\"\",'[3]Tasa de Falla'!IY131)","v":""},{"$f":"IF('[3]Tasa de Falla'!IZ131=0,\"\",'[3]Tasa de Falla'!IZ131)","v":""},{"$f":"IF('[3]Tasa de Falla'!JA131=0,\"\",'[3]Tasa de Falla'!JA131)","v":""},{"$f":"IF('[3]Tasa de Falla'!JB131=0,\"\",'[3]Tasa de Falla'!JB131)","v":""}]
[null,null,{"$f":"'[3]Tasa de Falla'!C132","v":115},{"$f":"'[3]Tasa de Falla'!D132","v":"CAMPO GALLO - COPO 132 1"},{"$f":"'[3]Tasa de Falla'!E132","v":132},{"$f":"'[3]Tasa de Falla'!F132","v":90},{"$f":"IF('[3]Tasa de Falla'!IQ132=0,\"\",'[3]Tasa de Falla'!IQ132)","v":"XXXX"},{"$f":"IF('[3]Tasa de Falla'!IR132=0,\"\",'[3]Tasa de Falla'!IR132)","v":"XXXX"},{"$f":"IF('[3]Tasa de Falla'!IS132=0,\"\",'[3]Tasa de Falla'!IS132)","v":"XXXX"},{"$f":"IF('[3]Tasa de Falla'!IT132=0,\"\",'[3]Tasa de Falla'!IT132)","v":""},{"$f":"IF('[3]Tasa de Falla'!IU132=0,\"\",'[3]Tasa de Falla'!IU132)","v":""},{"$f":"IF('[3]Tasa de Falla'!IV132=0,\"\",'[3]Tasa de Falla'!IV132)","v":""},{"$f":"IF('[3]Tasa de Falla'!IW132=0,\"\",'[3]Tasa de Falla'!IW132)","v":""},{"$f":"IF('[3]Tasa de Falla'!IX132=0,\"\",'[3]Tasa de Falla'!IX132)","v":""},{"$f":"IF('[3]Tasa de Falla'!IY132=0,\"\",'[3]Tasa de Falla'!IY132)","v":""},{"$f":"IF('[3]Tasa de Falla'!IZ132=0,\"\",'[3]Tasa de Falla'!IZ132)","v":""},{"$f":"IF('[3]Tasa de Falla'!JA132=0,\"\",'[3]Tasa de Falla'!JA132)","v":""},{"$f":"IF('[3]Tasa de Falla'!JB132=0,\"\",'[3]Tasa de Falla'!JB132)","v":""}]
[null,null,{"$f":"'[3]Tasa de Falla'!C133","v":116},{"$f":"'[3]Tasa de Falla'!D133","v":"PICHANAL - SENDA HACHADA 132 1"},{"$f":"'[3]Tasa de Falla'!E133","v":132},{"$f":"'[3]Tasa de Falla'!F133","v":46.5},{"$f":"IF('[3]Tasa de Falla'!IQ133=0,\"\",'[3]Tasa de Falla'!IQ133)","v":"XXXX"},{"$f":"IF('[3]Tasa de Falla'!IR133=0,\"\",'[3]Tasa de Falla'!IR133)","v":"XXXX"},{"$f":"IF('[3]Tasa de Falla'!IS133=0,\"\",'[3]Tasa de Falla'!IS133)","v":"XXXX"},{"$f":"IF('[3]Tasa de Falla'!IT133=0,\"\",'[3]Tasa de Falla'!IT133)","v":"XXXX"},{"$f":"IF('[3]Tasa de Falla'!IU133=0,\"\",'[3]Tasa de Falla'!IU133)","v":"XXXX"},{"$f":"IF('[3]Tasa de Falla'!IV133=0,\"\",'[3]Tasa de Falla'!IV133)","v":""},{"$f":"IF('[3]Tasa de Falla'!IW133=0,\"\",'[3]Tasa de Falla'!IW133)","v":""},{"$f":"IF('[3]Tasa de Falla'!IX133=0,\"\",'[3]Tasa de Falla'!IX133)","v":""},{"$f":"IF('[3]Tasa de Falla'!IY133=0,\"\",'[3]Tasa de Falla'!IY133)","v":""},{"$f":"IF('[3]Tasa de Falla'!IZ133=0,\"\",'[3]Tasa de Falla'!IZ133)","v":""},{"$f":"IF('[3]Tasa de Falla'!JA133=0,\"\",'[3]Tasa de Falla'!JA133)","v":""},{"$f":"IF('[3]Tasa de Falla'!JB133=0,\"\",'[3]Tasa de Falla'!JB133)","v":""}]
[null,null,{"$f":"'[3]Tasa de Falla'!C134","v":117},{"$f":"'[3]Tasa de Falla'!D134","v":"SENDA HACHADA - TARTAGAL 132 1"},{"$f":"'[3]Tasa de Falla'!E134","v":132},{"$f":"'[3]Tasa de Falla'!F134","v":58.5},{"$f":"IF('[3]Tasa de Falla'!IQ134=0,\"\",'[3]Tasa de Falla'!IQ134)","v":"XXXX"},{"$f":"IF('[3]Tasa de Falla'!IR134=0,\"\",'[3]Tasa de Falla'!IR134)","v":"XXXX"},{"$f":"IF('[3]Tasa de Falla'!IS134=0,\"\",'[3]Tasa de Falla'!IS134)","v":"XXXX"},{"$f":"IF('[3]Tasa de Falla'!IT134=0,\"\",'[3]Tasa de Falla'!IT134)","v":"XXXX"},{"$f":"IF('[3]Tasa de Falla'!IU134=0,\"\",'[3]Tasa de Falla'!IU134)","v":"XXXX"},{"$f":"IF('[3]Tasa de Falla'!IV134=0,\"\",'[3]Tasa de Falla'!IV134)","v":""},{"$f":"IF('[3]Tasa de Falla'!IW134=0,\"\",'[3]Tasa de Falla'!IW134)","v":""},{"$f":"IF('[3]Tasa de Falla'!IX134=0,\"\",'[3]Tasa de Falla'!IX134)","v":""},{"$f":"IF('[3]Tasa de Falla'!IY134=0,\"\",'[3]Tasa de Falla'!IY134)","v":""},{"$f":"IF('[3]Tasa de Falla'!IZ134=0,\"\",'[3]Tasa de Falla'!IZ134)","v":""},{"$f":"IF('[3]Tasa de Falla'!JA134=0,\"\",'[3]Tasa de Falla'!JA134)","v":""},{"$f":"IF('[3]Tasa de Falla'!JB134=0,\"\",'[3]Tasa de Falla'!JB134)","v":""}]
[null,null,{"$f":"'[3]Tasa de Falla'!C135","v":118},{"$f":"'[3]Tasa de Falla'!D135","v":"ESTATICA - INDEPENDENCIA.TUC. 132 2"},{"$f":"'[3]Tasa de Falla'!E135","v":132},{"$f":"'[3]Tasa de Falla'!F135","v":3.1},{"$f":"IF('[3]Tasa de Falla'!IQ135=0,\"\",'[3]Tasa de Falla'!IQ135)","v":"XXXX"},{"$f":"IF('[3]Tasa de Falla'!IR135=0,\"\",'[3]Tasa de Falla'!IR135)","v":"XXXX"},{"$f":"IF('[3]Tasa de Falla'!IS135=0,\"\",'[3]Tasa de Falla'!IS135)","v":"XXXX"},{"$f":"IF('[3]Tasa de Falla'!IT135=0,\"\",'[3]Tasa de Falla'!IT135)","v":"XXXX"},{"$f":"IF('[3]Tasa de Falla'!IU135=0,\"\",'[3]Tasa de Falla'!IU135)","v":"XXXX"},{"$f":"IF('[3]Tasa de Falla'!IV135=0,\"\",'[3]Tasa de Falla'!IV135)","v":"XXXX"},{"$f":"IF('[3]Tasa de Falla'!IW135=0,\"\",'[3]Tasa de Falla'!IW135)","v":"XXXX"},{"$f":"IF('[3]Tasa de Falla'!IX135=0,\"\",'[3]Tasa de Falla'!IX135)","v":""},{"$f":"IF('[3]Tasa de Falla'!IY135=0,\"\",'[3]Tasa de Falla'!IY135)","v":""},{"$f":"IF('[3]Tasa de Falla'!IZ135=0,\"\",'[3]Tasa de Falla'!IZ135)","v":1},{"$f":"IF('[3]Tasa de Falla'!JA135=0,\"\",'[3]Tasa de Falla'!JA135)","v":""},{"$f":"IF('[3]Tasa de Falla'!JB135=0,\"\",'[3]Tasa de Falla'!JB135)","v":""}]
[null,null,{"$f":"'[3]Tasa de Falla'!C136","v":119},{"$f":"'[3]Tasa de Falla'!D136","v":"SENDA HACHADA - DRAGONES 132 1"},{"$f":"'[3]Tasa de Falla'!E136","v":132},{"$f":"'[3]Tasa de Falla'!F136","v":65},{"$f":"IF('[3]Tasa de Falla'!IQ136=0,\"\",'[3]Tasa de Falla'!IQ136)","v":"XXXX"},{"$f":"IF('[3]Tasa de Falla'!IR136=0,\"\",'[3]Tasa de Falla'!IR136)","v":"XXXX"},{"$f":"IF('[3]Tasa de Falla'!IS136=0,\"\",'[3]Tasa de Falla'!IS136)","v":"XXXX"},{"$f":"IF('[3]Tasa de Falla'!IT136=0,\"\",'[3]Tasa de Falla'!IT136)","v":"XXXX"},{"$f":"IF('[3]Tasa de Falla'!IU136=0,\"\",'[3]Tasa de Falla'!IU136)","v":"XXXX"},{"$f":"IF('[3]Tasa de Falla'!IV136=0,\"\",'[3]Tasa de Falla'!IV136)","v":"XXXX"},{"$f":"IF('[3]Tasa de Falla'!IW136=0,\"\",'[3]Tasa de Falla'!IW136)","v":"XXXX"},{"$f":"IF('[3]Tasa de Falla'!IX136=0,\"\",'[3]Tasa de Falla'!IX136)","v":"XXXX"},{"$f":"IF('[3]Tasa de Falla'!IY136=0,\"\",'[3]Tasa de Falla'!IY136)","v":"XXXX"},{"$f":"IF('[3]Tasa de Falla'!IZ136=0,\"\",'[3]Tasa de Falla'!IZ136)","v":"XXXX"},{"$f":"IF('[3]Tasa de Falla'!JA136=0,\"\",'[3]Tasa de Falla'!JA136)","v":"XXXX"},{"$f":"IF('[3]Tasa de Falla'!JB136=0,\"\",'[3]Tasa de Falla'!JB136)","v":"XXXX"}]
[null,null,{"$f":"'[3]Tasa de Falla'!C137","v":120},{"$f":"'[3]Tasa de Falla'!D137","v":"COBOS - SALTA ESTE 132 1"},{"$f":"'[3]Tasa de Falla'!E137","v":132},{"$f":"'[3]Tasa de Falla'!F137","v":45.6},{"$f":"IF('[3]Tasa de Falla'!IQ137=0,\"\",'[3]Tasa de Falla'!IQ137)","v":"XXXX"},{"$f":"IF('[3]Tasa de Falla'!IR137=0,\"\",'[3]Tasa de Falla'!IR137)","v":"XXXX"},{"$f":"IF('[3]Tasa de Falla'!IS137=0,\"\",'[3]Tasa de Falla'!IS137)","v":"XXXX"},{"$f":"IF('[3]Tasa de Falla'!IT137=0,\"\",'[3]Tasa de Falla'!IT137)","v":"XXXX"},{"$f":"IF('[3]Tasa de Falla'!IU137=0,\"\",'[3]Tasa de Falla'!IU137)","v":"XXXX"},{"$f":"IF('[3]Tasa de Falla'!IV137=0,\"\",'[3]Tasa de Falla'!IV137)","v":"XXXX"},{"$f":"IF('[3]Tasa de Falla'!IW137=0,\"\",'[3]Tasa de Falla'!IW137)","v":"XXXX"},{"$f":"IF('[3]Tasa de Falla'!IX137=0,\"\",'[3]Tasa de Falla'!IX137)","v":""},{"$f":"IF('[3]Tasa de Falla'!IY137=0,\"\",'[3]Tasa de Falla'!IY137)","v":1},{"$f":"IF('[3]Tasa de Falla'!IZ137=0,\"\",'[3]Tasa de Falla'!IZ137)","v":""},{"$f":"IF('[3]Tasa de Falla'!JA137=0,\"\",'[3]Tasa de Falla'!JA137)","v":""},{"$f":"IF('[3]Tasa de Falla'!JB137=0,\"\",'[3]Tasa de Falla'!JB137)","v":""}]
[null,null,{"$f":"'[3]Tasa de Falla'!C138","v":121},{"$f":"'[3]Tasa de Falla'!D138","v":"SANTIAGO - SANTIAGO SUR "},{"$f":"'[3]Tasa de Falla'!E138","v":132},{"$f":"'[3]Tasa de Falla'!F138","v":8.4},{"$f":"IF('[3]Tasa de Falla'!IQ138=0,\"\",'[3]Tasa de Falla'!IQ138)","v":"XXXX"},{"$f":"IF('[3]Tasa de Falla'!IR138=0,\"\",'[3]Tasa de Falla'!IR138)","v":"XXXX"},{"$f":"IF('[3]Tasa de Falla'!IS138=0,\"\",'[3]Tasa de Falla'!IS138)","v":"XXXX"},{"$f":"IF('[3]Tasa de Falla'!IT138=0,\"\",'[3]Tasa de Falla'!IT138)","v":"XXXX"},{"$f":"IF('[3]Tasa de Falla'!IU138=0,\"\",'[3]Tasa de Falla'!IU138)","v":"XXXX"},{"$f":"IF('[3]Tasa de Falla'!IV138=0,\"\",'[3]Tasa de Falla'!IV138)","v":"XXXX"},{"$f":"IF('[3]Tasa de Falla'!IW138=0,\"\",'[3]Tasa de Falla'!IW138)","v":"XXXX"},{"$f":"IF('[3]Tasa de Falla'!IX138=0,\"\",'[3]Tasa de Falla'!IX138)","v":"XXXX"},{"$f":"IF('[3]Tasa de Falla'!IY138=0,\"\",'[3]Tasa de Falla'!IY138)","v":""},{"$f":"IF('[3]Tasa de Falla'!IZ138=0,\"\",'[3]Tasa de Falla'!IZ138)","v":""},{"$f":"IF('[3]Tasa de Falla'!JA138=0,\"\",'[3]Tasa de Falla'!JA138)","v":""},{"$f":"IF('[3]Tasa de Falla'!JB138=0,\"\",'[3]Tasa de Falla'!JB138)","v":""}]
[null,null,{"$f":"'[3]Tasa de Falla'!C139","v":122},{"$f":"'[3]Tasa de Falla'!D139","v":"SANTIAGO OESTE - SANTIAGO"},{"$f":"'[3]Tasa de Falla'!E139","v":132},{"$f":"'[3]Tasa de Falla'!F139","v":8.4},{"$f":"IF('[3]Tasa de Falla'!IQ139=0,\"\",'[3]Tasa de Falla'!IQ139)","v":"XXXX"},{"$f":"IF('[3]Tasa de Falla'!IR139=0,\"\",'[3]Tasa de Falla'!IR139)","v":"XXXX"},{"$f":"IF('[3]Tasa de Falla'!IS139=0,\"\",'[3]Tasa de Falla'!IS139)","v":"XXXX"},{"$f":"IF('[3]Tasa de Falla'!IT139=0,\"\",'[3]Tasa de Falla'!IT139)","v":"XXXX"},{"$f":"IF('[3]Tasa de Falla'!IU139=0,\"\",'[3]Tasa de Falla'!IU139)","v":"XXXX"},{"$f":"IF('[3]Tasa de Falla'!IV139=0,\"\",'[3]Tasa de Falla'!IV139)","v":"XXXX"},{"$f":"IF('[3]Tasa de Falla'!IW139=0,\"\",'[3]Tasa de Falla'!IW139)","v":"XXXX"},{"$f":"IF('[3]Tasa de Falla'!IX139=0,\"\",'[3]Tasa de Falla'!IX139)","v":"XXXX"},{"$f":"IF('[3]Tasa de Falla'!IY139=0,\"\",'[3]Tasa de Falla'!IY139)","v":"XXXX"},{"$f":"IF('[3]Tasa de Falla'!IZ139=0,\"\",'[3]Tasa de Falla'!IZ139)","v":"XXXX"},{"$f":"IF('[3]Tasa de Falla'!JA139=0,\"\",'[3]Tasa de Falla'!JA139)","v":"XXXX"},{"$f":"IF('[3]Tasa de Falla'!JB139=0,\"\",'[3]Tasa de Falla'!JB139)","v":"XXXX"}]
[null,null,{"$f":"'[3]Tasa de Falla'!C140","v":123},{"$f":"'[3]Tasa de Falla'!D140","v":"LA BANDA - MISQUI MAYU II - SANTIAGO ESTE"},{"$f":"'[3]Tasa de Falla'!E140","v":132},{"$f":"'[3]Tasa de Falla'!F140","v":4.92},{"$f":"IF('[3]Tasa de Falla'!IQ140=0,\"\",'[3]Tasa de Falla'!IQ140)","v":"XXXX"},{"$f":"IF('[3]Tasa de Falla'!IR140=0,\"\",'[3]Tasa de Falla'!IR140)","v":"XXXX"},{"$f":"IF('[3]Tasa de Falla'!IS140=0,\"\",'[3]Tasa de Falla'!IS140)","v":"XXXX"},{"$f":"IF('[3]Tasa de Falla'!IT140=0,\"\",'[3]Tasa de Falla'!IT140)","v":"XXXX"},{"$f":"IF('[3]Tasa de Falla'!IU140=0,\"\",'[3]Tasa de Falla'!IU140)","v":"XXXX"},{"$f":"IF('[3]Tasa de Falla'!IV140=0,\"\",'[3]Tasa de Falla'!IV140)","v":"XXXX"},{"$f":"IF('[3]Tasa de Falla'!IW140=0,\"\",'[3]Tasa de Falla'!IW140)","v":"XXXX"},{"$f":"IF('[3]Tasa de Falla'!IX140=0,\"\",'[3]Tasa de Falla'!IX140)","v":"XXXX"},{"$f":"IF('[3]Tasa de Falla'!IY140=0,\"\",'[3]Tasa de Falla'!IY140)","v":""},{"$f":"IF('[3]Tasa de Falla'!IZ140=0,\"\",'[3]Tasa de Falla'!IZ140)","v":""},{"$f":"IF('[3]Tasa de Falla'!JA140=0,\"\",'[3]Tasa de Falla'!JA140)","v":""},{"$f":"IF('[3]Tasa de Falla'!JB140=0,\"\",'[3]Tasa de Falla'!JB140)","v":1}]
[null,null,{"$f":"'[3]Tasa de Falla'!C141","v":124},{"$f":"'[3]Tasa de Falla'!D141","v":"CABRA CORRAL - GUACHIPAS - PAMPA GRANDE"},{"$f":"'[3]Tasa de Falla'!E141","v":132},{"$f":"'[3]Tasa de Falla'!F141","v":72.099999999999994},{"$f":"IF('[3]Tasa de Falla'!IQ141=0,\"\",'[3]Tasa de Falla'!IQ141)","v":"XXXX"},{"$f":"IF('[3]Tasa de Falla'!IR141=0,\"\",'[3]Tasa de Falla'!IR141)","v":"XXXX"},{"$f":"IF('[3]Tasa de Falla'!IS141=0,\"\",'[3]Tasa de Falla'!IS141)","v":"XXXX"},{"$f":"IF('[3]Tasa de Falla'!IT141=0,\"\",'[3]Tasa de Falla'!IT141)","v":"XXXX"},{"$f":"IF('[3]Tasa de Falla'!IU141=0,\"\",'[3]Tasa de Falla'!IU141)","v":"XXXX"},{"$f":"IF('[3]Tasa de Falla'!IV141=0,\"\",'[3]Tasa de Falla'!IV141)","v":"XXXX"},{"$f":"IF('[3]Tasa de Falla'!IW141=0,\"\",'[3]Tasa de Falla'!IW141)","v":"XXXX"},{"$f":"IF('[3]Tasa de Falla'!IX141=0,\"\",'[3]Tasa de Falla'!IX141)","v":"XXXX"},{"$f":"IF('[3]Tasa de Falla'!IY141=0,\"\",'[3]Tasa de Falla'!IY141)","v":"XXXX"},{"$f":"IF('[3]Tasa de Falla'!IZ141=0,\"\",'[3]Tasa de Falla'!IZ141)","v":"XXXX"},{"$f":"IF('[3]Tasa de Falla'!JA141=0,\"\",'[3]Tasa de Falla'!JA141)","v":"XXXX"},{"$f":"IF('[3]Tasa de Falla'!JB141=0,\"\",'[3]Tasa de Falla'!JB141)","v":"XXXX"}]
[null,null,{"$f":"'[3]Tasa de Falla'!C142","v":125},{"$f":"'[3]Tasa de Falla'!D142","v":"EL TABACAL - PI. TABACAL II - ORAN"},{"$f":"'[3]Tasa de Falla'!E142","v":132},{"$f":"'[3]Tasa de Falla'!F142","v":12.04},{"$f":"IF('[3]Tasa de Falla'!IQ142=0,\"\",'[3]Tasa de Falla'!IQ142)","v":"XXXX"},{"$f":"IF('[3]Tasa de Falla'!IR142=0,\"\",'[3]Tasa de Falla'!IR142)","v":"XXXX"},{"$f":"IF('[3]Tasa de Falla'!IS142=0,\"\",'[3]Tasa de Falla'!IS142)","v":"XXXX"},{"$f":"IF('[3]Tasa de Falla'!IT142=0,\"\",'[3]Tasa de Falla'!IT142)","v":"XXXX"},{"$f":"IF('[3]Tasa de Falla'!IU142=0,\"\",'[3]Tasa de Falla'!IU142)","v":"XXXX"},{"$f":"IF('[3]Tasa de Falla'!IV142=0,\"\",'[3]Tasa de Falla'!IV142)","v":"XXXX"},{"$f":"IF('[3]Tasa de Falla'!IW142=0,\"\",'[3]Tasa de Falla'!IW142)","v":"XXXX"},{"$f":"IF('[3]Tasa de Falla'!IX142=0,\"\",'[3]Tasa de Falla'!IX142)","v":"XXXX"},{"$f":"IF('[3]Tasa de Falla'!IY142=0,\"\",'[3]Tasa de Falla'!IY142)","v":"XXXX"},{"$f":"IF('[3]Tasa de Falla'!IZ142=0,\"\",'[3]Tasa de Falla'!IZ142)","v":"XXXX"},{"$f":"IF('[3]Tasa de Falla'!JA142=0,\"\",'[3]Tasa de Falla'!JA142)","v":"XXXX"},{"$f":"IF('[3]Tasa de Falla'!JB142=0,\"\",'[3]Tasa de Falla'!JB142)","v":"XXXX"}]
[null,null,{"$f":"'[3]Tasa de Falla'!C143","v":126},{"$f":"'[3]Tasa de Falla'!D143","v":"GUEMES - CAMPO SANTO - MINETTI"},{"$f":"'[3]Tasa de Falla'!E143","v":132},{"$f":"'[3]Tasa de Falla'!F143","v":41.8},{"$f":"IF('[3]Tasa de Falla'!IQ143=0,\"\",'[3]Tasa de Falla'!IQ143)","v":""},{"$f":"IF('[3]Tasa de Falla'!IR143=0,\"\",'[3]Tasa de Falla'!IR143)","v":""},{"$f":"IF('[3]Tasa de Falla'!IS143=0,\"\",'[3]Tasa de Falla'!IS143)","v":""},{"$f":"IF('[3]Tasa de Falla'!IT143=0,\"\",'[3]Tasa de Falla'!IT143)","v":""},{"$f":"IF('[3]Tasa de Falla'!IU143=0,\"\",'[3]Tasa de Falla'!IU143)","v":""},{"$f":"IF('[3]Tasa de Falla'!IV143=0,\"\",'[3]Tasa de Falla'!IV143)","v":""},{"$f":"IF('[3]Tasa de Falla'!IW143=0,\"\",'[3]Tasa de Falla'!IW143)","v":2},{"$f":"IF('[3]Tasa de Falla'!IX143=0,\"\",'[3]Tasa de Falla'!IX143)","v":3},{"$f":"IF('[3]Tasa de Falla'!IY143=0,\"\",'[3]Tasa de Falla'!IY143)","v":""},{"$f":"IF('[3]Tasa de Falla'!IZ143=0,\"\",'[3]Tasa de Falla'!IZ143)","v":""},{"$f":"IF('[3]Tasa de Falla'!JA143=0,\"\",'[3]Tasa de Falla'!JA143)","v":1},{"$f":"IF('[3]Tasa de Falla'!JB143=0,\"\",'[3]Tasa de Falla'!JB143)","v":1}]
[null,null,{"$f":"'[3]Tasa de Falla'!C144","v":127},{"$f":"'[3]Tasa de Falla'!D144","v":"GUEMES - CAMPO SANTO - PARQUE IND."},{"$f":"'[3]Tasa de Falla'!E144","v":132},{"$f":"'[3]Tasa de Falla'!F144","v":38.86},{"$f":"IF('[3]Tasa de Falla'!IQ144=0,\"\",'[3]Tasa de Falla'!IQ144)","v":""},{"$f":"IF('[3]Tasa de Falla'!IR144=0,\"\",'[3]Tasa de Falla'!IR144)","v":""},{"$f":"IF('[3]Tasa de Falla'!IS144=0,\"\",'[3]Tasa de Falla'!IS144)","v":""},{"$f":"IF('[3]Tasa de Falla'!IT144=0,\"\",'[3]Tasa de Falla'!IT144)","v":""},{"$f":"IF('[3]Tasa de Falla'!IU144=0,\"\",'[3]Tasa de Falla'!IU144)","v":""},{"$f":"IF('[3]Tasa de Falla'!IV144=0,\"\",'[3]Tasa de Falla'!IV144)","v":""},{"$f":"IF('[3]Tasa de Falla'!IW144=0,\"\",'[3]Tasa de Falla'!IW144)","v":""},{"$f":"IF('[3]Tasa de Falla'!IX144=0,\"\",'[3]Tasa de Falla'!IX144)","v":""},{"$f":"IF('[3]Tasa de Falla'!IY144=0,\"\",'[3]Tasa de Falla'!IY144)","v":""},{"$f":"IF('[3]Tasa de Falla'!IZ144=0,\"\",'[3]Tasa de Falla'!IZ144)","v":""},{"$f":"IF('[3]Tasa de Falla'!JA144=0,\"\",'[3]Tasa de Falla'!JA144)","v":""},{"$f":"IF('[3]Tasa de Falla'!JB144=0,\"\",'[3]Tasa de Falla'!JB144)","v":""}]
[null,null,{"$f":"'[3]Tasa de Falla'!C145","v":128},{"$f":"'[3]Tasa de Falla'!D145","v":"SANTIAGO CENTRO - MISQUI MAYU I - SANTIAGO ESTE"},{"$f":"'[3]Tasa de Falla'!E145","v":132},{"$f":"'[3]Tasa de Falla'!F145","v":10.66},{"$f":"IF('[3]Tasa de Falla'!IQ145=0,\"\",'[3]Tasa de Falla'!IQ145)","v":"XXXX"},{"$f":"IF('[3]Tasa de Falla'!IR145=0,\"\",'[3]Tasa de Falla'!IR145)","v":"XXXX"},{"$f":"IF('[3]Tasa de Falla'!IS145=0,\"\",'[3]Tasa de Falla'!IS145)","v":"XXXX"},{"$f":"IF('[3]Tasa de Falla'!IT145=0,\"\",'[3]Tasa de Falla'!IT145)","v":"XXXX"},{"$f":"IF('[3]Tasa de Falla'!IU145=0,\"\",'[3]Tasa de Falla'!IU145)","v":"XXXX"},{"$f":"IF('[3]Tasa de Falla'!IV145=0,\"\",'[3]Tasa de Falla'!IV145)","v":"XXXX"},{"$f":"IF('[3]Tasa de Falla'!IW145=0,\"\",'[3]Tasa de Falla'!IW145)","v":"XXXX"},{"$f":"IF('[3]Tasa de Falla'!IX145=0,\"\",'[3]Tasa de Falla'!IX145)","v":"XXXX"},{"$f":"IF('[3]Tasa de Falla'!IY145=0,\"\",'[3]Tasa de Falla'!IY145)","v":""},{"$f":"IF('[3]Tasa de Falla'!IZ145=0,\"\",'[3]Tasa de Falla'!IZ145)","v":""},{"$f":"IF('[3]Tasa de Falla'!JA145=0,\"\",'[3]Tasa de Falla'!JA145)","v":""},{"$f":"IF('[3]Tasa de Falla'!JB145=0,\"\",'[3]Tasa de Falla'!JB145)","v":""}]
[null,null,{"$f":"'[3]Tasa de Falla'!C146","v":129},{"$f":"'[3]Tasa de Falla'!D146","v":"LA RIOJA SUR - PI. PATQUIA   2"},{"$f":"'[3]Tasa de Falla'!E146","v":132},{"$f":"'[3]Tasa de Falla'!F146","v":40},{"$f":"IF('[3]Tasa de Falla'!IQ146=0,\"\",'[3]Tasa de Falla'!IQ146)","v":""},{"$f":"IF('[3]Tasa de Falla'!IR146=0,\"\",'[3]Tasa de Falla'!IR146)","v":""},{"$f":"IF('[3]Tasa de Falla'!IS146=0,\"\",'[3]Tasa de Falla'!IS146)","v":""},{"$f":"IF('[3]Tasa de Falla'!IT146=0,\"\",'[3]Tasa de Falla'!IT146)","v":""},{"$f":"IF('[3]Tasa de Falla'!IU146=0,\"\",'[3]Tasa de Falla'!IU146)","v":""},{"$f":"IF('[3]Tasa de Falla'!IV146=0,\"\",'[3]Tasa de Falla'!IV146)","v":""},{"$f":"IF('[3]Tasa de Falla'!IW146=0,\"\",'[3]Tasa de Falla'!IW146)","v":""},{"$f":"IF('[3]Tasa de Falla'!IX146=0,\"\",'[3]Tasa de Falla'!IX146)","v":""},{"$f":"IF('[3]Tasa de Falla'!IY146=0,\"\",'[3]Tasa de Falla'!IY146)","v":""},{"$f":"IF('[3]Tasa de Falla'!IZ146=0,\"\",'[3]Tasa de Falla'!IZ146)","v":""},{"$f":"IF('[3]Tasa de Falla'!JA146=0,\"\",'[3]Tasa de Falla'!JA146)","v":""},{"$f":"IF('[3]Tasa de Falla'!JB146=0,\"\",'[3]Tasa de Falla'!JB146)","v":""}]
[null,null,{"$f":"'[3]Tasa de Falla'!C147","v":130},{"$f":"'[3]Tasa de Falla'!D147","v":"LA RIOJA SUR - PI. CIRCUNVALACION   1"},{"$f":"'[3]Tasa de Falla'!E147","v":132},{"$f":"'[3]Tasa de Falla'!F147","v":41.35},{"$f":"IF('[3]Tasa de Falla'!IQ147=0,\"\",'[3]Tasa de Falla'!IQ147)","v":"XXXX"},{"$f":"IF('[3]Tasa de Falla'!IR147=0,\"\",'[3]Tasa de Falla'!IR147)","v":"XXXX"},{"$f":"IF('[3]Tasa de Falla'!IS147=0,\"\",'[3]Tasa de Falla'!IS147)","v":"XXXX"},{"$f":"IF('[3]Tasa de Falla'!IT147=0,\"\",'[3]Tasa de Falla'!IT147)","v":""},{"$f":"IF('[3]Tasa de Falla'!IU147=0,\"\",'[3]Tasa de Falla'!IU147)","v":""},{"$f":"IF('[3]Tasa de Falla'!IV147=0,\"\",'[3]Tasa de Falla'!IV147)","v":""},{"$f":"IF('[3]Tasa de Falla'!IW147=0,\"\",'[3]Tasa de Falla'!IW147)","v":""},{"$f":"IF('[3]Tasa de Falla'!IX147=0,\"\",'[3]Tasa de Falla'!IX147)","v":""},{"$f":"IF('[3]Tasa de Falla'!IY147=0,\"\",'[3]Tasa de Falla'!IY147)","v":""},{"$f":"IF('[3]Tasa de Falla'!IZ147=0,\"\",'[3]Tasa de Falla'!IZ147)","v":""},{"$f":"IF('[3]Tasa de Falla'!JA147=0,\"\",'[3]Tasa de Falla'!JA147)","v":""},{"$f":"IF('[3]Tasa de Falla'!JB147=0,\"\",'[3]Tasa de Falla'!JB147)","v":""}]
[null,null,null,null,null,null,{"$f":"IF('[3]Tasa de Falla'!IQ148=0,\"\",'[3]Tasa de Falla'!IQ148)","v":""},{"$f":"IF('[3]Tasa de Falla'!IR148=0,\"\",'[3]Tasa de Falla'!IR148)","v":""},{"$f":"IF('[3]Tasa de Falla'!IS148=0,\"\",'[3]Tasa de Falla'!IS148)","v":""},{"$f":"IF('[3]Tasa de Falla'!IT148=0,\"\",'[3]Tasa de Falla'!IT148)","v":""},{"$f":"IF('[3]Tasa de Falla'!IU148=0,\"\",'[3]Tasa de Falla'!IU148)","v":""},{"$f":"IF('[3]Tasa de Falla'!IV148=0,\"\",'[3]Tasa de Falla'!IV148)","v":""},{"$f":"IF('[3]Tasa de Falla'!IW148=0,\"\",'[3]Tasa de Falla'!IW148)","v":""},{"$f":"IF('[3]Tasa de Falla'!IX148=0,\"\",'[3]Tasa de Falla'!IX148)","v":""},{"$f":"IF('[3]Tasa de Falla'!IY148=0,\"\",'[3]Tasa de Falla'!IY148)","v":""},{"$f":"IF('[3]Tasa de Falla'!IZ148=0,\"\",'[3]Tasa de Falla'!IZ148)","v":""},{"$f":"IF('[3]Tasa de Falla'!JA148=0,\"\",'[3]Tasa de Falla'!JA148)","v":""},{"$f":"IF('[3]Tasa de Falla'!JB148=0,\"\",'[3]Tasa de Falla'!JB148)","v":""}]
[null,null,null,null,"Longitud Total    ",{"$f":"SUM(F16:F148)-F19-F21-F22-F26-F27-F37-F39-F40-F43-F44-F47-F48-F49-F53-F60-F65-F78-F82-F96-F101-F111","v":6071.3800000000028}]
[null,null,null,null,null,"Indisponibilidades Forzadas  ",{"$f":"SUM(G17:G148)","v":5},{"$f":"SUM(H17:H148)","v":17},{"$f":"SUM(I17:I148)","v":10},19,12,14,15,10,4,11,15,6]
[null,null,null,null,null,"TASA DE FALLA  ",{"$f":"+'[3]Tasa de Falla'!IQ154","v":3.38},{"$f":"+'[3]Tasa de Falla'!IR154","v":3.2},{"$f":"+'[3]Tasa de Falla'!IS154","v":3.29},{"$f":"+'[3]Tasa de Falla'!IT154","v":2.89},{"$f":"+'[3]Tasa de Falla'!IU154","v":2.57},{"$f":"+'[3]Tasa de Falla'!IV154","v":2.31},{"$f":"+'[3]Tasa de Falla'!IW154","v":2.39},{"$f":"+'[3]Tasa de Falla'!IX154","v":2.4},{"$f":"+'[3]Tasa de Falla'!IY154","v":2.5099999999999998},{"$f":"+'[3]Tasa de Falla'!IZ154","v":2.2599999999999998},{"$f":"+'[3]Tasa de Falla'!JA154","v":2.44},{"$f":"+'[3]Tasa de Falla'!JB154","v":2.61},{"$f":"+'[3]Tasa de Falla'!JC154","v":2.67}]
[]
[null,null,"XXX","  Línea no computada en el mes",null,null,null,null,"TASA DE FALLA",null,null,{"$f":"S151","v":2.67},null,"SALIDAS x AÑO / 100 km"]

{"sheet":"DATO","index":8,"n_rows":25,"n_cols":29,"rows_kept":25,"cut":false,"hidden":false,"merged":[]}
["Mes","Mes","Dia","Año"]
["enero","01",31,2006]
["febrero","02",{"$f":"IF(MOD(E14,4)=0,29,28)","v":28},{"$f":"+D2+1","v":2007}]
["marzo","03",31,2008]
["abril","04",30,2009]
["mayo","05",31,2010]
["junio","06",30,2011]
["julio","07",31,2012]
["agosto","08",31,2013]
["septiembre","09",30,2014]
["octubre","10",31,2015]
["noviembre","11",30]
["diciembre","12",31,null,null,null,null,null,"Total"]
[10,10,{"$f":"CELL(\"CONTENIDO\",OFFSET(A1,B14,0))","v":"octubre"},{"$f":"CELL(\"CONTENIDO\",OFFSET(C1,B14,0))","v":31},{"$f":"CELL(\"CONTENIDO\",OFFSET(D1,A14,0))","v":2015},{"$f":"\"Desde el 01 al \" & D14 & \" de \" & C14 & \" de \" & E14","v":"Desde el 01 al 31 de octubre de 2015"},{"$f":"CELL(\"CONTENIDO\",OFFSET(B1,B14,0))","v":"10"},{"$f":"RIGHT(E14,2)","v":"15"},"B14"]
[null,{"$f":"\"\\\\rugor\\files\\Transporte\\Transporte\\AA PROCESO AUT ARCHIVOS J\\TRANSNOA\\\" &E14","v":"\\\\rugor\\files\\Transporte\\Transporte\\AA PROCESO AUT ARCHIVOS J\\TRANSNOA\\2015"},null,null,null,null,{"$f":"\"J\"&G14&H14&\"NOA\"","v":"J1015NOA"}]
[null,{"$f":"\"\\\\rugor\\files\\Transporte\\transporte\\AA PROCESO AUT\\INTERCAMBIO\\\" &H14&G14","v":"\\\\rugor\\files\\Transporte\\transporte\\AA PROCESO AUT\\INTERCAMBIO\\1510"}]
["Hoja","FilaInicio","FilasPlantilla","Columnas","NombreHoja","OrigenDeDatos","Col00","Col01","Col02","Col03","Col04","Col05","Col06","Col07","Col08","Col09","Col10","Col11","Col12","Col13","Col14","Col15","FILHTOTAL","COLHTOTAL","FILHCALC","COLHCALC","FILTRANSP","COLTRANSP","COL TSAL"]
["MODELO L",21,20,11,{"$f":"\"LI-\" & $G$14","v":"LI-10"},"TRANSNOA_INDISPONIBILIDADES_LINEAS_TRANSNOA.XLS",3,5,4,6,7,8,0,10,11,14,0,26,0,0,0,0,19,10,42,27,19,27,14]
["MODELO T",24,20,13,{"$f":"\"T-\" & $G$14","v":"T-10"},"TRANSNOA_INDISPONIBILIDADES_TRAFOS_TRANSNOA.XLS",3,5,4,6,7,8,9,11,12,15,16,18,28,17,0,0,25,10,45,29,22,29,15]
["MODELO S",23,20,10,{"$f":"\"SA-\" & $G$14","v":"SA-10"},"TRANSNOA_INDISPONIBILIDADES_SALIDAS_TRANSNOA.XLS",3,5,4,6,7,8,10,11,14,15,21,0,0,0,0,0,29,10,44,22,21,22,14]
["MODELO L RIOJA",21,20,11,{"$f":"\"LI-RIOJA-\" & $G$14","v":"LI-RIOJA-10"},"TRANSNOA_INDISPONIBILIDADES_LINEAS_RIOJA.XLS",3,5,4,6,7,8,0,10,11,14,2,26,0,0,0,0,21,10,42,27,19,27,14]
["MODELO L EDESA",21,20,11,{"$f":"\"LI-EDESA-\" & $G$14","v":"LI-EDESA-10"},"TRANSNOA_INDISPONIBILIDADES_LINEAS_EDESA.XLS",3,5,4,6,7,8,0,10,11,14,2,26,0,0,0,0,20,10,42,27,19,27,14]
["MODELO T EDESA",24,20,13,{"$f":"\"T-EDESA-\" & $G$14","v":"T-EDESA-10"},"TRANSNOA_INDISPONIBILIDADES_TRAFOS_EDESA.XLS",3,5,4,6,7,8,9,11,12,15,16,18,28,17,0,0,26,10,45,29,22,29,15]
["MODELO S EDESA",23,20,10,{"$f":"\"SA-EDESA-\" & $G$14","v":"SA-EDESA-10"},"TRANSNOA_INDISPONIBILIDADES_SALIDAS_EDESA.XLS",3,5,4,6,7,8,10,11,14,15,21,0,0,0,0,0,30,10,44,22,21,22,14]
["MODELO VST",19,24,4,{"$f":"\"CAUSAS-VST-\" & $G$14","v":"CAUSAS-VST-10"},"TRANSNOA_CAUSAS_VST.XLS",3,4,5,6,7,0,0,0,0,0,0,0,0,0,0,0,999,999,0,0,0,0,0]