{"text_format":"1","workbook":"xlsx","n_sheets":5,"sheets":["TOT-0216","LI-02 (1)","SA-02 (1)","Tasa de Falla","DATO"],"not_rendered":{"charts":0,"images":2,"macros":1,"external_links":1,"defined_names":1,"comments":0,"pivot_tables":0},"unopened":[],"bounds":{"document_bytes":16777216,"sheet_cells":100000,"rows_first":2000,"rows_last":500,"rows_between":2000,"halvings":0,"cell_chars":16384,"cell_head_chars":4096},"cells_cut":0,"cells_raw":0,"read":"whole","date_system":"1900"}

{"sheet":"TOT-0216","index":0,"n_rows":29,"n_cols":9,"rows_kept":29,"cut":false,"hidden":false,"merged":[]}
[]
[null,"ANEXO V   al Memorandum  D.T.E.E.    N° 687 / 2016"]
[]
["ENTE NACIONAL REGULADOR "]
["DE LA ELECTRICIDAD"]
[]
[null,"SISTEMA DE TRANSPORTE DE ENERGÍA ELÉCTRICA POR DISTRIBUCIÓN TRONCAL"]
[]
[null,"EPEN"]
[]
[null,{"$f":"CONCATENATE(\"TOTAL DE PENALIZACIONES A \",IF(DATO!$F$1=\"E.N.R.E.\",\"APLICAR\",\"FORMULAR\"))","v":"TOTAL DE PENALIZACIONES A APLICAR"}]
[]
[null,{"$f":"IF(C13=TRUE,2,1)","v":1}]
[null,{"$f":"DATO!F14","v":"Desde el 01 al 29 de febrero de 2016"}]
[]
[]
[]
[null,null,"1.-","LÍNEAS",null,null,null,null,{"$f":"'LI-02 (1)'!AB40","v":235.54}]
[]
[null,null,"2.-","CONEXIÓN"]
[]
[]
[null,null,null,"2.2.-","Salidas",null,null,null,{"$f":"'SA-02 (1)'!V42","v":1229.3399999999999}]
[]
[]
[]
[null,null,null,null,null,"TOTAL ",{"$f":"SUM(I18:I23)","v":1464.8799999999999}]
[]
[null,null,"Valores de remuneración según  el Acuerdo Instrumental. Nota ENRE Nº 117663"]

{"sheet":"LI-02 (1)","index":1,"n_rows":40,"n_cols":28,"rows_kept":40,"cut":false,"hidden":false,"merged":[]}
[]
[null,{"$f":"+'TOT-0216'!B2","v":"ANEXO V   al Memorandum  D.T.E.E.    N° 687 / 2016"}]
[]
[null,null,null,"ENTE NACIONAL REGULADOR "]
[null,null,null,"DE LA ELECTRICIDAD"]
[]
[]
[null,null,null,null,null,"SISTEMA DE TRANSPORTE DE ENERGÍA ELÉCTRICA POR DISTRIBUCIÓN TRONCAL - EPEN"]
[]
[null,null,null,null,null,"1.- LÍNEAS"]
[]
[null,{"$f":"+'TOT-0216'!B14","v":"Desde el 01 al 29 de febrero de 2016"}]
[]
[null,null,null,null,null,"$/100 km-h : LÍNEAS 132 kV",498.71,null,null,null,"FACTOR DE PENALIZACIÓN  K =",{"$f":"30*'TOT-0216'!B13","v":30},{"$f":"IF(L14=30,\" \",IF(L14=60,\"Coeficiente duplicado por tasa de falla >4 Sal. x año/100 km.\",\"REVISAR COEFICIENTE\"))","v":" "}]
[null,null,3,4,5,6,7,8,9,10,11,12,13,14,15,16,17,18,19,20,21,22,23,24,25,26,27,28]
[null,null,"N°","INDISP","ID EQUIPO","LÍNEAS","U\n[kV]","Long.\n[km]","$/h","Salida","Entrada","Hs.\nIndisp.","Minutos\nIndisp.","Tipo \nSal.(²)","C.R.\n%","AUT.","PENALIZ.\nPROGRAM.","REDUCCIÓN\nPROGRAM.","PENALIZACIÓN FORZADA\nPor Salida     1ras. 3 hs.     hs. Restantes",null,null,"REDUCCIÓN FORZADA\nPor Salida     1ras. 3 hs.     hs. Restantes",null,null,"RESTANTE\nFORZADA (RF)","REDUCCIÓN\nRESTANTE (RR)","Informó\nen Térm.","TOTAL\nPENALIZAC."]
[]
[]
[null,null,1,298680,153,"ARROYITO - EL CHOCON   1",132,25,{"$f":"H19*$G$14/100","v":124.67749999999999},"2016-02-01T09:56:00","2016-02-01T13:31:00",{"$f":"IF(J19=\"\",\"\",(K19-J19)*24)","v":3.5833333333139308},{"$f":"IF(K19=\"\",\"\",ROUND((K19-J19)*24*60,0))","v":215},"P","0,000",{"$f":"IF(F19=\"\",\"\",IF(OR(N19=\"P\",N19=\"RP\"),\"--\",\"NO\"))","v":"--"},{"$f":"IF(N19=\"P\",ROUND(M19/60,2)*I19*$L$14*0.01,\"--\")","v":133.90363500000001},{"$f":"IF(N19=\"RP\",ROUND(M19/60,2)*I19*$L$14*0.01*O19/100,\"--\")","v":"--"},{"$f":"IF(P19=\"SI\",\"--\",IF(N19=\"F\",ROUND(I19*$L$14,2),\"--\"))","v":"--"},{"$f":"IF(N19=\"F\",IF(M19<10,\"--\",IF(M19>180,ROUND(I19*$L$14*3,2),I19*$L$14*ROUND(M19/60,2))),\"--\")","v":"--"},{"$f":"IF(AND(N19=\"F\",M19>180),I19*$L$14*0.1*(ROUND(M19/60,2)-3),\"--\")","v":"--"},{"$f":"IF(P19=\"SI\",\"--\",IF(N19=\"R\",ROUND(I19*$L$14*O19/100,2),\"--\"))","v":"--"},{"$f":"IF(N19=\"R\",IF(M19<10,\"--\",IF(M19>180,ROUND(I19*$L$14*3*O19/100,2),I19*$L$14*O19/100*ROUND(M19/60,2))),\"--\")","v":"--"},{"$f":"IF(AND(N19=\"R\",M19>180),I19*$L$14*O19/100*0.1*(ROUND(M19/60,2)-3),\"--\")","v":"--"},{"$f":"IF(N19=\"RF\",I19*$L$14*0.1*ROUND(M19/60,2),\"--\")","v":"--"},{"$f":"IF(N19=\"RR\",I19*$L$14*0.1*O19/100*ROUND(M19/60,2),\"--\")","v":"--"},"SI",{"$f":"IF(F19=\"\",\"\",IF(AA19=\"SI\",SUM(Q19:Z19),2*SUM(Q19:Z19)))","v":133.90363500000001}]
[null,null,2,298681,154,"ARROYITO - EL CHOCON   2",132,25,{"$f":"H20*$G$14/100","v":124.67749999999999},"2016-02-02T10:08:00","2016-02-02T12:50:00",2.6999999998952262,162,"P","0,000","--",100.988775,"--","--","--","--","--","--","--","--","--","SI",100.988775]
[null,null,3,299489,157,"ARROYITO - C.H. ARROYITO   3",132,1,4.9870999999999999,"2016-02-24T14:24:00","2016-02-24T14:50:00",0.43333333334885538,26,"P","0,000","--",0.64333590000000007,"--","--","--","--","--","--","--","--","--","SI",0.64333590000000007]
[null,null,null,null,null,null,null,null,0,null,null,"","",null,{"$f":"IF(F22=\"\",\"\",\"--\")","v":""},{"$f":"IF(F22=\"\",\"\",IF(OR(N22=\"P\",N22=\"RP\"),\"--\",\"NO\"))","v":""},"--","--","--","--","--","--","--","--","--","--",{"$f":"IF(F22=\"\",\"\",\"SI\")","v":""},""]
[null,null,null,null,null,null,null,null,0,null,null,"","",null,"","","--","--","--","--","--","--","--","--","--","--","",""]
[null,null,null,null,null,null,null,null,0,null,null,"","",null,"","","--","--","--","--","--","--","--","--","--","--","",""]
[null,null,null,null,null,null,null,null,0,null,null,"","",null,"","","--","--","--","--","--","--","--","--","--","--","",""]
[null,null,null,null,null,null,null,null,0,null,null,"","",null,"","","--","--","--","--","--","--","--","--","--","--",{"$f":"IF(F26=\"\",\"\",\"SI\")","v":""},""]
[null,null,null,null,null,null,null,null,0,null,null,"","",null,"","","--","--","--","--","--","--","--","--","--","--","",""]
[null,null,null,null,null,null,null,null,0,null,null,"","",null,"","","--","--","--","--","--","--","--","--","--","--","",""]
[null,null,null,null,null,null,null,null,0,null,null,"","",null,"","","--","--","--","--","--","--","--","--","--","--","",""]
[null,null,null,null,null,null,null,null,0,null,null,"","",null,"","","--","--","--","--","--","--","--","--","--","--","",""]
[null,null,null,null,null,null,null,null,0,null,null,"","",null,{"$f":"IF(F31=\"\",\"\",\"--\")","v":""},"","--","--","--","--","--","--","--","--","--","--","",""]
[null,null,null,null,null,null,null,null,0,null,null,"","",null,"","","--","--","--","--","--","--","--","--","--","--","",""]
[null,null,null,null,null,null,null,null,0,null,null,"","",null,"","","--","--","--","--","--","--","--","--","--","--","",""]
[null,null,null,null,null,null,null,null,0,null,null,"","",null,"","","--","--","--","--","--","--","--","--","--","--","",""]
[null,null,null,null,null,null,null,null,0,null,null,"","",null,"","","--","--","--","--","--","--","--","--","--","--","",""]
[null,null,null,null,null,null,null,null,0,null,null,"","",null,"","","--","--","--","--","--","--","--","--","--","--","",""]
[null,null,null,null,null,null,null,null,0,null,null,"","",null,"","","--","--","--","--","--","--","--","--","--","--","",""]
[null,null,null,null,null,null,null,null,0,null,null,"","",null,"","","--","--","--","--","--","--","--","--","--","--","",""]
[]
[null,null,"(²)","P - PROGRAMADA ",null,null,null,null,null,null,null,null,null,null,null,null,null,null,null,null,null,null,null,null,null,null,null,{"$f":"ROUND(SUM(AB17:AB39),2)","v":235.54}]

{"sheet":"SA-02 (1)","index":2,"n_rows":42,"n_cols":22,"rows_kept":42,"cut":false,"hidden":false,"merged":[]}
[]
[null,{"$f":"+'TOT-0216'!B2","v":"ANEXO V   al Memorandum  D.T.E.E.    N° 687 / 2016"}]
[]
[null,null,null,"ENTE NACIONAL REGULADOR "]
[null,null,null,"DE LA ELECTRICIDAD"]
[]
[]
[null,null,null,null,null,"SISTEMA DE TRANSPORTE DE ENERGÍA ELÉCTRICA POR DISTRIBUCIÓN TRONCAL - EPEN"]
[]
[null,null,null,null,null,"2.2.- Salidas"]
[]
[null,{"$f":"+'TOT-0216'!B14","v":"Desde el 01 al 29 de febrero de 2016"}]
[]
[null,null,null,null,null,"Salida en 132 kV = ",23.195,{"$f":"50*'TOT-0216'!B13","v":50},null,{"$f":"IF(H14=50,\" \",IF(H14=100,\"  Coeficiente duplicado por tasa de falla >4 Sal. x año/100 km.\",\"REVISAR COEFICIENTE\"))","v":" "}]
[null,null,null,null,null,"Salida en 33 kV =",17.396000000000001,{"$f":"25*'TOT-0216'!B13","v":25},null,{"$f":"IF(H15=25,\" \",IF(H15=50,\"  Coeficiente duplicado por tasa de falla >4 Sal. x año/100 km.\",\"REVISAR COEFICIENTE\"))","v":" "}]
[null,null,null,null,null,"Salida en 13,2 kV =",17.396000000000001,{"$f":"20*'TOT-0216'!B13","v":20},null,{"$f":"IF(H16=20,\" \",IF(H16=40,\"  Coeficiente duplicado por tasa de falla >4 Sal. x año/100 km.\",\"REVISAR COEFICIENTE\"))","v":" "}]
[null,null,3,4,5,6,7,8,9,10,11,12,13,14,15,16,17,18,19,20,21,22]
[null,null,"N°","INDISP","ID EQUIPO","ESTACIÓN \nTRANSFORMADORA","EQUIPO","U\n[kV]","$/h","Salida","Entrada","Hs\nIndisp.","Minutos.\nIndisp.","Tipo \nSal.(²)","AUT.","K (U)","PENALIZ.\nPROGRAM.","PENALIZAC. FORZADA\nPor Salida    Hs. Restantes",null,"RESTANTE\nFORZADA","Informó\nen Térm.","TOTAL\nPENALIZAC."]
[]
[]
[null,null,4,298683,229,"ARROYITO","SALIDA PLAZA HUINCUL",132,{"$f":"IF(OR(H21=132,H21=66),$G$14,IF(H21=33,$G$15,$G$16))","v":23.195},"2016-02-11T09:19:00","2016-02-11T14:50:00",{"$f":"IF(J21=\"\",\"\",(K21-J21)*24)","v":5.5166666666627862},{"$f":"IF(K21=\"\",\"\",ROUND((K21-J21)*24*60,0))","v":331},"P",{"$f":"IF(N21=\"\",\"\",IF(OR(N21=\"P\",N21=\"RP\"),\"--\",\"NO\"))","v":"--"},{"$f":"IF(OR(H21=132,H21=66),$H$14,IF(H21=33,$H$15,$H$16))","v":50},{"$f":"IF(N21=\"P\",I21*P21*0.1*ROUND(M21/60,2),\"--\")","v":640.18200000000002},{"$f":"IF(O21=\"NO\",IF(N21=\"F\",I21*P21,\"--\"),\"--\")","v":"--"},{"$f":"IF(N21=\"F\",I21*P21*ROUND(M21/60,2),\"--\")","v":"--"},{"$f":"IF(N21=\"RF\",I21*P21*ROUND(M21/60,2),\"--\")","v":"--"},{"$f":"IF(F21=\"\",\"\",\"SI\")","v":"SI"},{"$f":"IF(F21=\"\",\"\",IF(H21=\"500/220\",0,IF(U21=\"SI\",SUM(Q21:T21),2*SUM(Q21:T21))))","v":640.18200000000002}]
[null,null,5,298684,230,"ARROYITO","SALIDA GRAN NEUQUEN",132,{"$f":"IF(OR(H22=132,H22=66),$G$14,IF(H22=33,$G$15,$G$16))","v":23.195},"2016-02-12T09:19:00","2016-02-12T14:24:00",5.0833333333139308,305,"P",{"$f":"IF(N22=\"\",\"\",IF(OR(N22=\"P\",N22=\"RP\"),\"--\",\"NO\"))","v":"--"},50,589.15300000000002,"--","--","--","SI",589.15300000000002]
[null,null,null,null,null,null,null,null,17.396000000000001,null,null,"","",null,{"$f":"IF(N23=\"\",\"\",IF(OR(N23=\"P\",N23=\"RP\"),\"--\",\"NO\"))","v":""},20,"--","--","--","--","",""]
[null,null,null,null,null,null,null,null,17.396000000000001,null,null,"","",null,"",20,"--","--","--","--","",""]
[null,null,null,null,null,null,null,null,17.396000000000001,null,null,"","",null,"",20,"--","--","--","--","",""]
[null,null,null,null,null,null,null,null,17.396000000000001,null,null,"","",null,"",20,"--","--","--","--","",""]
[null,null,null,null,null,null,null,null,17.396000000000001,null,null,"","",null,"",20,"--","--","--","--","",""]
[null,null,null,null,null,null,null,null,17.396000000000001,null,null,"","",null,"",20,"--","--","--","--","",""]
[null,null,null,null,null,null,null,null,17.396000000000001,null,null,"","",null,"",20,"--","--","--","--","",""]
[null,null,null,null,null,null,null,null,17.396000000000001,null,null,"","",null,"",20,"--","--","--","--","",""]
[null,null,null,null,null,null,null,null,17.396000000000001,null,null,"","",null,"",20,"--","--","--","--","",""]
[null,null,null,null,null,null,null,null,17.396000000000001,null,null,"","",null,"",20,"--","--","--","--","",""]
[null,null,null,null,null,null,null,null,17.396000000000001,null,null,"","",null,"",20,"--","--","--","--","",""]
[null,null,null,null,null,null,null,null,17.396000000000001,null,null,"","",null,"",20,"--","--","--","--","",""]
[null,null,null,null,null,null,null,null,17.396000000000001,null,null,"","",null,"",20,"--","--","--","--","",""]
[null,null,null,null,null,null,null,null,17.396000000000001,null,null,"","",null,"",20,"--","--","--","--","",""]
[null,null,null,null,null,null,null,null,17.396000000000001,null,null,"","",null,"",20,"--","--","--","--","",""]
[null,null,null,null,null,null,null,null,17.396000000000001,null,null,"","",null,"",20,"--","--","--","--","",""]
[null,null,null,null,null,null,null,null,17.396000000000001,null,null,"","",null,"",20,"--","--","--","--","",""]
[null,null,null,null,null,null,null,null,17.396000000000001,null,null,"","",null,"",20,"--","--","--","--","",""]
[]
[null,null,"(²)"," P - PROGRAMADA",null,null,null,null,null,null,null,null,null,null,null,null,null,null,null,null,null,{"$f":"ROUND(SUM(V19:V41),2)","v":1229.3399999999999}]

{"sheet":"Tasa de Falla","index":3,"n_rows":45,"n_cols":20,"rows_kept":45,"cut":false,"hidden":false,"merged":[[2,0,2,1]]}
[]
[null,{"$f":"'TOT-0216'!B2","v":"ANEXO V   al Memorandum  D.T.E.E.    N° 687 / 2016"}]
["ENTE NACIONAL REGULADOR "]
["DE LA ELECTRICIDAD"]
[]
[null,"ENTE PROVINCIAL DE ENERGIA DEL NEUQUEN - EPEN"]
[]
[null," (TRANSPORTISTA POR DISTRIBUCIÓN TRONCAL)"]
[]
[null,"INDISPONIBILIDADES FORZADAS DE LÍNEAS - TASA DE FALLA"]
[]
[]
[null,"Correspondiente al mes de Febrero de 2016"]
[]
[null,null,null,"LÍNEAS","U\n[kV[","Long.\n[km]","Tipo",{"$f":"'[1]TASA DE FALLA'!DO15","v":"2015-02-01"},{"$f":"'[1]TASA DE FALLA'!DP15","v":"2015-03-01"},{"$f":"'[1]TASA DE FALLA'!DQ15","v":"2015-04-01"},{"$f":"'[1]TASA DE FALLA'!DR15","v":"2015-05-01"},{"$f":"'[1]TASA DE FALLA'!DS15","v":"2015-06-01"},{"$f":"'[1]TASA DE FALLA'!DT15","v":"2015-07-01"},{"$f":"'[1]TASA DE FALLA'!DU15","v":"2015-08-01"},{"$f":"'[1]TASA DE FALLA'!DV15","v":"2015-09-01"},{"$f":"'[1]TASA DE FALLA'!DW15","v":"2015-10-01"},{"$f":"'[1]TASA DE FALLA'!DX15","v":"2015-11-01"},{"$f":"'[1]TASA DE FALLA'!DY15","v":"2015-12-01"},{"$f":"'[1]TASA DE FALLA'!DZ15","v":"2016-01-01"},{"$f":"'[1]TASA DE FALLA'!EA15","v":"2016-02-01"}]
[]
[]
[]
[null,null,{"$f":"'[1]TASA DE FALLA'!C19","v":1},{"$f":"'[1]TASA DE FALLA'!D19","v":"ARROYITO - CHARROYITO 1"},{"$f":"'[1]TASA DE FALLA'!E19","v":132},{"$f":"'[1]TASA DE FALLA'!F19","v":1},{"$f":"'[1]TASA DE FALLA'!G19","v":"L"},{"$f":"+IF('[1]TASA DE FALLA'!DO19=0,\"\",'[1]TASA DE FALLA'!DO19)","v":""},{"$f":"+IF('[1]TASA DE FALLA'!DP19=0,\"\",'[1]TASA DE FALLA'!DP19)","v":""},{"$f":"+IF('[1]TASA DE FALLA'!DQ19=0,\"\",'[1]TASA DE FALLA'!DQ19)","v":""},{"$f":"+IF('[1]TASA DE FALLA'!DR19=0,\"\",'[1]TASA DE FALLA'!DR19)","v":""},{"$f":"+IF('[1]TASA DE FALLA'!DS19=0,\"\",'[1]TASA DE FALLA'!DS19)","v":""},{"$f":"+IF('[1]TASA DE FALLA'!DT19=0,\"\",'[1]TASA DE FALLA'!DT19)","v":""},{"$f":"+IF('[1]TASA DE FALLA'!DU19=0,\"\",'[1]TASA DE FALLA'!DU19)","v":""},{"$f":"+IF('[1]TASA DE FALLA'!DV19=0,\"\",'[1]TASA DE FALLA'!DV19)","v":""},{"$f":"+IF('[1]TASA DE FALLA'!DW19=0,\"\",'[1]TASA DE FALLA'!DW19)","v":""},{"$f":"+IF('[1]TASA DE FALLA'!DX19=0,\"\",'[1]TASA DE FALLA'!DX19)","v":""},{"$f":"+IF('[1]TASA DE FALLA'!DY19=0,\"\",'[1]TASA DE FALLA'!DY19)","v":""},{"$f":"+IF('[1]TASA DE FALLA'!DZ19=0,\"\",'[1]TASA DE FALLA'!DZ19)","v":""}]
[null,null,{"$f":"'[1]TASA DE FALLA'!C20","v":2},{"$f":"'[1]TASA DE FALLA'!D20","v":"ARROYITO - CHARROYITO 2"},{"$f":"'[1]TASA DE FALLA'!E20","v":132},{"$f":"'[1]TASA DE FALLA'!F20","v":1},{"$f":"'[1]TASA DE FALLA'!G20","v":"L"},{"$f":"+IF('[1]TASA DE FALLA'!DO20=0,\"\",'[1]TASA DE FALLA'!DO20)","v":""},{"$f":"+IF('[1]TASA DE FALLA'!DP20=0,\"\",'[1]TASA DE FALLA'!DP20)","v":""},{"$f":"+IF('[1]TASA DE FALLA'!DQ20=0,\"\",'[1]TASA DE FALLA'!DQ20)","v":""},{"$f":"+IF('[1]TASA DE FALLA'!DR20=0,\"\",'[1]TASA DE FALLA'!DR20)","v":""},{"$f":"+IF('[1]TASA DE FALLA'!DS20=0,\"\",'[1]TASA DE FALLA'!DS20)","v":""},{"$f":"+IF('[1]TASA DE FALLA'!DT20=0,\"\",'[1]TASA DE FALLA'!DT20)","v":""},{"$f":"+IF('[1]TASA DE FALLA'!DU20=0,\"\",'[1]TASA DE FALLA'!DU20)","v":""},{"$f":"+IF('[1]TASA DE FALLA'!DV20=0,\"\",'[1]TASA DE FALLA'!DV20)","v":""},{"$f":"+IF('[1]TASA DE FALLA'!DW20=0,\"\",'[1]TASA DE FALLA'!DW20)","v":""},{"$f":"+IF('[1]TASA DE FALLA'!DX20=0,\"\",'[1]TASA DE FALLA'!DX20)","v":""},{"$f":"+IF('[1]TASA DE FALLA'!DY20=0,\"\",'[1]TASA DE FALLA'!DY20)","v":""},{"$f":"+IF('[1]TASA DE FALLA'!DZ20=0,\"\",'[1]TASA DE FALLA'!DZ20)","v":""}]
[null,null,{"$f":"'[1]TASA DE FALLA'!C21","v":3},{"$f":"'[1]TASA DE FALLA'!D21","v":"ARROYITO - CHARROYITO 3"},{"$f":"'[1]TASA DE FALLA'!E21","v":132},{"$f":"'[1]TASA DE FALLA'!F21","v":1},{"$f":"'[1]TASA DE FALLA'!G21","v":"L"},{"$f":"+IF('[1]TASA DE FALLA'!DO21=0,\"\",'[1]TASA DE FALLA'!DO21)","v":""},{"$f":"+IF('[1]TASA DE FALLA'!DP21=0,\"\",'[1]TASA DE FALLA'!DP21)","v":""},{"$f":"+IF('[1]TASA DE FALLA'!DQ21=0,\"\",'[1]TASA DE FALLA'!DQ21)","v":""},{"$f":"+IF('[1]TASA DE FALLA'!DR21=0,\"\",'[1]TASA DE FALLA'!DR21)","v":""},{"$f":"+IF('[1]TASA DE FALLA'!DS21=0,\"\",'[1]TASA DE FALLA'!DS21)","v":""},{"$f":"+IF('[1]TASA DE FALLA'!DT21=0,\"\",'[1]TASA DE FALLA'!DT21)","v":""},{"$f":"+IF('[1]TASA DE FALLA'!DU21=0,\"\",'[1]TASA DE FALLA'!DU21)","v":""},{"$f":"+IF('[1]TASA DE FALLA'!DV21=0,\"\",'[1]TASA DE FALLA'!DV21)","v":1},{"$f":"+IF('[1]TASA DE FALLA'!DW21=0,\"\",'[1]TASA DE FALLA'!DW21)","v":""},{"$f":"+IF('[1]TASA DE FALLA'!DX21=0,\"\",'[1]TASA DE FALLA'!DX21)","v":""},{"$f":"+IF('[1]TASA DE FALLA'!DY21=0,\"\",'[1]TASA DE FALLA'!DY21)","v":""},{"$f":"+IF('[1]TASA DE FALLA'!DZ21=0,\"\",'[1]TASA DE FALLA'!DZ21)","v":""}]
[null,null,{"$f":"'[1]TASA DE FALLA'!C22","v":4},{"$f":"'[1]TASA DE FALLA'!D22","v":"ARROYITO - CHOCON 1"},{"$f":"'[1]TASA DE FALLA'!E22","v":132},{"$f":"'[1]TASA DE FALLA'!F22","v":25},{"$f":"'[1]TASA DE FALLA'!G22","v":"L"},{"$f":"+IF('[1]TASA DE FALLA'!DO22=0,\"\",'[1]TASA DE FALLA'!DO22)","v":""},{"$f":"+IF('[1]TASA DE FALLA'!DP22=0,\"\",'[1]TASA DE FALLA'!DP22)","v":""},{"$f":"+IF('[1]TASA DE FALLA'!DQ22=0,\"\",'[1]TASA DE FALLA'!DQ22)","v":""},{"$f":"+IF('[1]TASA DE FALLA'!DR22=0,\"\",'[1]TASA DE FALLA'!DR22)","v":""},{"$f":"+IF('[1]TASA DE FALLA'!DS22=0,\"\",'[1]TASA DE FALLA'!DS22)","v":""},{"$f":"+IF('[1]TASA DE FALLA'!DT22=0,\"\",'[1]TASA DE FALLA'!DT22)","v":""},{"$f":"+IF('[1]TASA DE FALLA'!DU22=0,\"\",'[1]TASA DE FALLA'!DU22)","v":""},{"$f":"+IF('[1]TASA DE FALLA'!DV22=0,\"\",'[1]TASA DE FALLA'!DV22)","v":""},{"$f":"+IF('[1]TASA DE FALLA'!DW22=0,\"\",'[1]TASA DE FALLA'!DW22)","v":""},{"$f":"+IF('[1]TASA DE FALLA'!DX22=0,\"\",'[1]TASA DE FALLA'!DX22)","v":""},{"$f":"+IF('[1]TASA DE FALLA'!DY22=0,\"\",'[1]TASA DE FALLA'!DY22)","v":""},{"$f":"+IF('[1]TASA DE FALLA'!DZ22=0,\"\",'[1]TASA DE FALLA'!DZ22)","v":""}]
[null,null,{"$f":"'[1]TASA DE FALLA'!C23","v":5},{"$f":"'[1]TASA DE FALLA'!D23","v":"ARROYITO - CHOCON 2"},{"$f":"'[1]TASA DE FALLA'!E23","v":132},{"$f":"'[1]TASA DE FALLA'!F23","v":25},{"$f":"'[1]TASA DE FALLA'!G23","v":"L"},{"$f":"+IF('[1]TASA DE FALLA'!DO23=0,\"\",'[1]TASA DE FALLA'!DO23)","v":""},{"$f":"+IF('[1]TASA DE FALLA'!DP23=0,\"\",'[1]TASA DE FALLA'!DP23)","v":""},{"$f":"+IF('[1]TASA DE FALLA'!DQ23=0,\"\",'[1]TASA DE FALLA'!DQ23)","v":""},{"$f":"+IF('[1]TASA DE FALLA'!DR23=0,\"\",'[1]TASA DE FALLA'!DR23)","v":""},{"$f":"+IF('[1]TASA DE FALLA'!DS23=0,\"\",'[1]TASA DE FALLA'!DS23)","v":""},{"$f":"+IF('[1]TASA DE FALLA'!DT23=0,\"\",'[1]TASA DE FALLA'!DT23)","v":""},{"$f":"+IF('[1]TASA DE FALLA'!DU23=0,\"\",'[1]TASA DE FALLA'!DU23)","v":""},{"$f":"+IF('[1]TASA DE FALLA'!DV23=0,\"\",'[1]TASA DE FALLA'!DV23)","v":""},{"$f":"+IF('[1]TASA DE FALLA'!DW23=0,\"\",'[1]TASA DE FALLA'!DW23)","v":""},{"$f":"+IF('[1]TASA DE FALLA'!DX23=0,\"\",'[1]TASA DE FALLA'!DX23)","v":""},{"$f":"+IF('[1]TASA DE FALLA'!DY23=0,\"\",'[1]TASA DE FALLA'!DY23)","v":""},{"$f":"+IF('[1]TASA DE FALLA'!DZ23=0,\"\",'[1]TASA DE FALLA'!DZ23)","v":""}]
[null,null,{"$f":"'[1]TASA DE FALLA'!C24","v":6},{"$f":"'[1]TASA DE FALLA'!D24","v":"ARROYITO - PIAP 1"},{"$f":"'[1]TASA DE FALLA'!E24","v":132},{"$f":"'[1]TASA DE FALLA'!F24","v":2},{"$f":"'[1]TASA DE FALLA'!G24","v":"L"},{"$f":"+IF('[1]TASA DE FALLA'!DO24=0,\"\",'[1]TASA DE FALLA'!DO24)","v":""},{"$f":"+IF('[1]TASA DE FALLA'!DP24=0,\"\",'[1]TASA DE FALLA'!DP24)","v":""},{"$f":"+IF('[1]TASA DE FALLA'!DQ24=0,\"\",'[1]TASA DE FALLA'!DQ24)","v":""},{"$f":"+IF('[1]TASA DE FALLA'!DR24=0,\"\",'[1]TASA DE FALLA'!DR24)","v":""},{"$f":"+IF('[1]TASA DE FALLA'!DS24=0,\"\",'[1]TASA DE FALLA'!DS24)","v":""},{"$f":"+IF('[1]TASA DE FALLA'!DT24=0,\"\",'[1]TASA DE FALLA'!DT24)","v":""},{"$f":"+IF('[1]TASA DE FALLA'!DU24=0,\"\",'[1]TASA DE FALLA'!DU24)","v":""},{"$f":"+IF('[1]TASA DE FALLA'!DV24=0,\"\",'[1]TASA DE FALLA'!DV24)","v":""},{"$f":"+IF('[1]TASA DE FALLA'!DW24=0,\"\",'[1]TASA DE FALLA'!DW24)","v":""},{"$f":"+IF('[1]TASA DE FALLA'!DX24=0,\"\",'[1]TASA DE FALLA'!DX24)","v":""},{"$f":"+IF('[1]TASA DE FALLA'!DY24=0,\"\",'[1]TASA DE FALLA'!DY24)","v":""},{"$f":"+IF('[1]TASA DE FALLA'!DZ24=0,\"\",'[1]TASA DE FALLA'!DZ24)","v":""}]
[null,null,{"$f":"'[1]TASA DE FALLA'!C25","v":7},{"$f":"'[1]TASA DE FALLA'!D25","v":"ARROYITO - PIAP 2"},{"$f":"'[1]TASA DE FALLA'!E25","v":132},{"$f":"'[1]TASA DE FALLA'!F25","v":2},{"$f":"'[1]TASA DE FALLA'!G25","v":"L"},{"$f":"+IF('[1]TASA DE FALLA'!DO25=0,\"\",'[1]TASA DE FALLA'!DO25)","v":""},{"$f":"+IF('[1]TASA DE FALLA'!DP25=0,\"\",'[1]TASA DE FALLA'!DP25)","v":""},{"$f":"+IF('[1]TASA DE FALLA'!DQ25=0,\"\",'[1]TASA DE FALLA'!DQ25)","v":""},{"$f":"+IF('[1]TASA DE FALLA'!DR25=0,\"\",'[1]TASA DE FALLA'!DR25)","v":""},{"$f":"+IF('[1]TASA DE FALLA'!DS25=0,\"\",'[1]TASA DE FALLA'!DS25)","v":""},{"$f":"+IF('[1]TASA DE FALLA'!DT25=0,\"\",'[1]TASA DE FALLA'!DT25)","v":""},{"$f":"+IF('[1]TASA DE FALLA'!DU25=0,\"\",'[1]TASA DE FALLA'!DU25)","v":""},{"$f":"+IF('[1]TASA DE FALLA'!DV25=0,\"\",'[1]TASA DE FALLA'!DV25)","v":""},{"$f":"+IF('[1]TASA DE FALLA'!DW25=0,\"\",'[1]TASA DE FALLA'!DW25)","v":""},{"$f":"+IF('[1]TASA DE FALLA'!DX25=0,\"\",'[1]TASA DE FALLA'!DX25)","v":""},{"$f":"+IF('[1]TASA DE FALLA'!DY25=0,\"\",'[1]TASA DE FALLA'!DY25)","v":""},{"$f":"+IF('[1]TASA DE FALLA'!DZ25=0,\"\",'[1]TASA DE FALLA'!DZ25)","v":""}]
[null,null,{"$f":"'[1]TASA DE FALLA'!C26","v":8},{"$f":"'[1]TASA DE FALLA'!D26","v":"ALTO VALLE - CENTENARIO"},{"$f":"'[1]TASA DE FALLA'!E26","v":132},{"$f":"'[1]TASA DE FALLA'!F26","v":17},{"$f":"'[1]TASA DE FALLA'!G26","v":"L"},{"$f":"+IF('[1]TASA DE FALLA'!DO26=0,\"\",'[1]TASA DE FALLA'!DO26)","v":""},{"$f":"+IF('[1]TASA DE FALLA'!DP26=0,\"\",'[1]TASA DE FALLA'!DP26)","v":""},{"$f":"+IF('[1]TASA DE FALLA'!DQ26=0,\"\",'[1]TASA DE FALLA'!DQ26)","v":""},{"$f":"+IF('[1]TASA DE FALLA'!DR26=0,\"\",'[1]TASA DE FALLA'!DR26)","v":""},{"$f":"+IF('[1]TASA DE FALLA'!DS26=0,\"\",'[1]TASA DE FALLA'!DS26)","v":""},{"$f":"+IF('[1]TASA DE FALLA'!DT26=0,\"\",'[1]TASA DE FALLA'!DT26)","v":""},{"$f":"+IF('[1]TASA DE FALLA'!DU26=0,\"\",'[1]TASA DE FALLA'!DU26)","v":1},{"$f":"+IF('[1]TASA DE FALLA'!DV26=0,\"\",'[1]TASA DE FALLA'!DV26)","v":""},{"$f":"+IF('[1]TASA DE FALLA'!DW26=0,\"\",'[1]TASA DE FALLA'!DW26)","v":""},{"$f":"+IF('[1]TASA DE FALLA'!DX26=0,\"\",'[1]TASA DE FALLA'!DX26)","v":""},{"$f":"+IF('[1]TASA DE FALLA'!DY26=0,\"\",'[1]TASA DE FALLA'!DY26)","v":""},{"$f":"+IF('[1]TASA DE FALLA'!DZ26=0,\"\",'[1]TASA DE FALLA'!DZ26)","v":3}]
[null,null,{"$f":"'[1]TASA DE FALLA'!C27","v":10},{"$f":"'[1]TASA DE FALLA'!D27","v":"ALTO VALLE - COLONIA VALENTINA - ARROYITO"},{"$f":"'[1]TASA DE FALLA'!E27","v":132},{"$f":"'[1]TASA DE FALLA'!F27","v":58.9},{"$f":"'[1]TASA DE FALLA'!G27","v":"L"},{"$f":"+IF('[1]TASA DE FALLA'!DO27=0,\"\",'[1]TASA DE FALLA'!DO27)","v":""},{"$f":"+IF('[1]TASA DE FALLA'!DP27=0,\"\",'[1]TASA DE FALLA'!DP27)","v":""},{"$f":"+IF('[1]TASA DE FALLA'!DQ27=0,\"\",'[1]TASA DE FALLA'!DQ27)","v":""},{"$f":"+IF('[1]TASA DE FALLA'!DR27=0,\"\",'[1]TASA DE FALLA'!DR27)","v":""},{"$f":"+IF('[1]TASA DE FALLA'!DS27=0,\"\",'[1]TASA DE FALLA'!DS27)","v":""},{"$f":"+IF('[1]TASA DE FALLA'!DT27=0,\"\",'[1]TASA DE FALLA'!DT27)","v":""},{"$f":"+IF('[1]TASA DE FALLA'!DU27=0,\"\",'[1]TASA DE FALLA'!DU27)","v":""},{"$f":"+IF('[1]TASA DE FALLA'!DV27=0,\"\",'[1]TASA DE FALLA'!DV27)","v":""},{"$f":"+IF('[1]TASA DE FALLA'!DW27=0,\"\",'[1]TASA DE FALLA'!DW27)","v":""},{"$f":"+IF('[1]TASA DE FALLA'!DX27=0,\"\",'[1]TASA DE FALLA'!DX27)","v":""},{"$f":"+IF('[1]TASA DE FALLA'!DY27=0,\"\",'[1]TASA DE FALLA'!DY27)","v":""},{"$f":"+IF('[1]TASA DE FALLA'!DZ27=0,\"\",'[1]TASA DE FALLA'!DZ27)","v":""}]
[null,null,{"$f":"'[1]TASA DE FALLA'!C28","v":11},{"$f":"'[1]TASA DE FALLA'!D28","v":"CHOCON OESTE - CHOCON"},{"$f":"'[1]TASA DE FALLA'!E28","v":132},{"$f":"'[1]TASA DE FALLA'!F28","v":3.5},{"$f":"'[1]TASA DE FALLA'!G28","v":"L"},{"$f":"+IF('[1]TASA DE FALLA'!DO28=0,\"\",'[1]TASA DE FALLA'!DO28)","v":""},{"$f":"+IF('[1]TASA DE FALLA'!DP28=0,\"\",'[1]TASA DE FALLA'!DP28)","v":""},{"$f":"+IF('[1]TASA DE FALLA'!DQ28=0,\"\",'[1]TASA DE FALLA'!DQ28)","v":""},{"$f":"+IF('[1]TASA DE FALLA'!DR28=0,\"\",'[1]TASA DE FALLA'!DR28)","v":""},{"$f":"+IF('[1]TASA DE FALLA'!DS28=0,\"\",'[1]TASA DE FALLA'!DS28)","v":""},{"$f":"+IF('[1]TASA DE FALLA'!DT28=0,\"\",'[1]TASA DE FALLA'!DT28)","v":""},{"$f":"+IF('[1]TASA DE FALLA'!DU28=0,\"\",'[1]TASA DE FALLA'!DU28)","v":""},{"$f":"+IF('[1]TASA DE FALLA'!DV28=0,\"\",'[1]TASA DE FALLA'!DV28)","v":""},{"$f":"+IF('[1]TASA DE FALLA'!DW28=0,\"\",'[1]TASA DE FALLA'!DW28)","v":""},{"$f":"+IF('[1]TASA DE FALLA'!DX28=0,\"\",'[1]TASA DE FALLA'!DX28)","v":""},{"$f":"+IF('[1]TASA DE FALLA'!DY28=0,\"\",'[1]TASA DE FALLA'!DY28)","v":""},{"$f":"+IF('[1]TASA DE FALLA'!DZ28=0,\"\",'[1]TASA DE FALLA'!DZ28)","v":""}]
[null,null,{"$f":"'[1]TASA DE FALLA'!C29","v":18},{"$f":"'[1]TASA DE FALLA'!D29","v":"MEDANITOS - PTO. SECCIONAMIENTO"},{"$f":"'[1]TASA DE FALLA'!E29","v":132},{"$f":"'[1]TASA DE FALLA'!F29","v":41},{"$f":"'[1]TASA DE FALLA'!G29","v":"L"},{"$f":"+IF('[1]TASA DE FALLA'!DO29=0,\"\",'[1]TASA DE FALLA'!DO29)","v":""},{"$f":"+IF('[1]TASA DE FALLA'!DP29=0,\"\",'[1]TASA DE FALLA'!DP29)","v":""},{"$f":"+IF('[1]TASA DE FALLA'!DQ29=0,\"\",'[1]TASA DE FALLA'!DQ29)","v":""},{"$f":"+IF('[1]TASA DE FALLA'!DR29=0,\"\",'[1]TASA DE FALLA'!DR29)","v":""},{"$f":"+IF('[1]TASA DE FALLA'!DS29=0,\"\",'[1]TASA DE FALLA'!DS29)","v":""},{"$f":"+IF('[1]TASA DE FALLA'!DT29=0,\"\",'[1]TASA DE FALLA'!DT29)","v":""},{"$f":"+IF('[1]TASA DE FALLA'!DU29=0,\"\",'[1]TASA DE FALLA'!DU29)","v":""},{"$f":"+IF('[1]TASA DE FALLA'!DV29=0,\"\",'[1]TASA DE FALLA'!DV29)","v":""},{"$f":"+IF('[1]TASA DE FALLA'!DW29=0,\"\",'[1]TASA DE FALLA'!DW29)","v":""},{"$f":"+IF('[1]TASA DE FALLA'!DX29=0,\"\",'[1]TASA DE FALLA'!DX29)","v":""},{"$f":"+IF('[1]TASA DE FALLA'!DY29=0,\"\",'[1]TASA DE FALLA'!DY29)","v":1},{"$f":"+IF('[1]TASA DE FALLA'!DZ29=0,\"\",'[1]TASA DE FALLA'!DZ29)","v":1}]
[null,null,{"$f":"'[1]TASA DE FALLA'!C30","v":19},{"$f":"'[1]TASA DE FALLA'!D30","v":"PIEDRA DEL AGUILA - EL CHOCON"},{"$f":"'[1]TASA DE FALLA'!E30","v":132},{"$f":"'[1]TASA DE FALLA'!F30","v":170},{"$f":"'[1]TASA DE FALLA'!G30","v":"L"},{"$f":"+IF('[1]TASA DE FALLA'!DO30=0,\"\",'[1]TASA DE FALLA'!DO30)","v":""},{"$f":"+IF('[1]TASA DE FALLA'!DP30=0,\"\",'[1]TASA DE FALLA'!DP30)","v":""},{"$f":"+IF('[1]TASA DE FALLA'!DQ30=0,\"\",'[1]TASA DE FALLA'!DQ30)","v":""},{"$f":"+IF('[1]TASA DE FALLA'!DR30=0,\"\",'[1]TASA DE FALLA'!DR30)","v":""},{"$f":"+IF('[1]TASA DE FALLA'!DS30=0,\"\",'[1]TASA DE FALLA'!DS30)","v":""},{"$f":"+IF('[1]TASA DE FALLA'!DT30=0,\"\",'[1]TASA DE FALLA'!DT30)","v":""},{"$f":"+IF('[1]TASA DE FALLA'!DU30=0,\"\",'[1]TASA DE FALLA'!DU30)","v":""},{"$f":"+IF('[1]TASA DE FALLA'!DV30=0,\"\",'[1]TASA DE FALLA'!DV30)","v":""},{"$f":"+IF('[1]TASA DE FALLA'!DW30=0,\"\",'[1]TASA DE FALLA'!DW30)","v":""},{"$f":"+IF('[1]TASA DE FALLA'!DX30=0,\"\",'[1]TASA DE FALLA'!DX30)","v":""},{"$f":"+IF('[1]TASA DE FALLA'!DY30=0,\"\",'[1]TASA DE FALLA'!DY30)","v":""},{"$f":"+IF('[1]TASA DE FALLA'!DZ30=0,\"\",'[1]TASA DE FALLA'!DZ30)","v":""}]
[null,null,{"$f":"'[1]TASA DE FALLA'!C31","v":20},{"$f":"'[1]TASA DE FALLA'!D31","v":"PLAYA PLANICIE BANDERITA - PCIE. BANDERITA"},{"$f":"'[1]TASA DE FALLA'!E31","v":132},{"$f":"'[1]TASA DE FALLA'!F31","v":1.5},{"$f":"'[1]TASA DE FALLA'!G31","v":"L"},{"$f":"+IF('[1]TASA DE FALLA'!DO31=0,\"\",'[1]TASA DE FALLA'!DO31)","v":""},{"$f":"+IF('[1]TASA DE FALLA'!DP31=0,\"\",'[1]TASA DE FALLA'!DP31)","v":""},{"$f":"+IF('[1]TASA DE FALLA'!DQ31=0,\"\",'[1]TASA DE FALLA'!DQ31)","v":""},{"$f":"+IF('[1]TASA DE FALLA'!DR31=0,\"\",'[1]TASA DE FALLA'!DR31)","v":""},{"$f":"+IF('[1]TASA DE FALLA'!DS31=0,\"\",'[1]TASA DE FALLA'!DS31)","v":""},{"$f":"+IF('[1]TASA DE FALLA'!DT31=0,\"\",'[1]TASA DE FALLA'!DT31)","v":""},{"$f":"+IF('[1]TASA DE FALLA'!DU31=0,\"\",'[1]TASA DE FALLA'!DU31)","v":""},{"$f":"+IF('[1]TASA DE FALLA'!DV31=0,\"\",'[1]TASA DE FALLA'!DV31)","v":""},{"$f":"+IF('[1]TASA DE FALLA'!DW31=0,\"\",'[1]TASA DE FALLA'!DW31)","v":""},{"$f":"+IF('[1]TASA DE FALLA'!DX31=0,\"\",'[1]TASA DE FALLA'!DX31)","v":""},{"$f":"+IF('[1]TASA DE FALLA'!DY31=0,\"\",'[1]TASA DE FALLA'!DY31)","v":""},{"$f":"+IF('[1]TASA DE FALLA'!DZ31=0,\"\",'[1]TASA DE FALLA'!DZ31)","v":""}]
[null,null,{"$f":"'[1]TASA DE FALLA'!C32","v":21},{"$f":"'[1]TASA DE FALLA'!D32","v":"PTO. SECCIONAMIENTO - PTO. HERNANDEZ"},{"$f":"'[1]TASA DE FALLA'!E32","v":132},{"$f":"'[1]TASA DE FALLA'!F32","v":89},{"$f":"'[1]TASA DE FALLA'!G32","v":"L"},{"$f":"+IF('[1]TASA DE FALLA'!DO32=0,\"\",'[1]TASA DE FALLA'!DO32)","v":"XXXX"},{"$f":"+IF('[1]TASA DE FALLA'!DP32=0,\"\",'[1]TASA DE FALLA'!DP32)","v":"XXXX"},{"$f":"+IF('[1]TASA DE FALLA'!DQ32=0,\"\",'[1]TASA DE FALLA'!DQ32)","v":"XXXX"},{"$f":"+IF('[1]TASA DE FALLA'!DR32=0,\"\",'[1]TASA DE FALLA'!DR32)","v":"XXXX"},{"$f":"+IF('[1]TASA DE FALLA'!DS32=0,\"\",'[1]TASA DE FALLA'!DS32)","v":"XXXX"},{"$f":"+IF('[1]TASA DE FALLA'!DT32=0,\"\",'[1]TASA DE FALLA'!DT32)","v":"XXXX"},{"$f":"+IF('[1]TASA DE FALLA'!DU32=0,\"\",'[1]TASA DE FALLA'!DU32)","v":"XXXX"},{"$f":"+IF('[1]TASA DE FALLA'!DV32=0,\"\",'[1]TASA DE FALLA'!DV32)","v":"XXXX"},{"$f":"+IF('[1]TASA DE FALLA'!DW32=0,\"\",'[1]TASA DE FALLA'!DW32)","v":"XXXX"},{"$f":"+IF('[1]TASA DE FALLA'!DX32=0,\"\",'[1]TASA DE FALLA'!DX32)","v":"XXXX"},{"$f":"+IF('[1]TASA DE FALLA'!DY32=0,\"\",'[1]TASA DE FALLA'!DY32)","v":"XXXX"},{"$f":"+IF('[1]TASA DE FALLA'!DZ32=0,\"\",'[1]TASA DE FALLA'!DZ32)","v":"XXXX"}]
[null,null,{"$f":"'[1]TASA DE FALLA'!C33","v":22},{"$f":"'[1]TASA DE FALLA'!D33","v":"PTO. SECCIONAMIENTO - SEÑAL PICADA"},{"$f":"'[1]TASA DE FALLA'!E33","v":132},{"$f":"'[1]TASA DE FALLA'!F33","v":18},{"$f":"'[1]TASA DE FALLA'!G33","v":"L"},{"$f":"+IF('[1]TASA DE FALLA'!DO33=0,\"\",'[1]TASA DE FALLA'!DO33)","v":""},{"$f":"+IF('[1]TASA DE FALLA'!DP33=0,\"\",'[1]TASA DE FALLA'!DP33)","v":""},{"$f":"+IF('[1]TASA DE FALLA'!DQ33=0,\"\",'[1]TASA DE FALLA'!DQ33)","v":""},{"$f":"+IF('[1]TASA DE FALLA'!DR33=0,\"\",'[1]TASA DE FALLA'!DR33)","v":""},{"$f":"+IF('[1]TASA DE FALLA'!DS33=0,\"\",'[1]TASA DE FALLA'!DS33)","v":""},{"$f":"+IF('[1]TASA DE FALLA'!DT33=0,\"\",'[1]TASA DE FALLA'!DT33)","v":""},{"$f":"+IF('[1]TASA DE FALLA'!DU33=0,\"\",'[1]TASA DE FALLA'!DU33)","v":""},{"$f":"+IF('[1]TASA DE FALLA'!DV33=0,\"\",'[1]TASA DE FALLA'!DV33)","v":""},{"$f":"+IF('[1]TASA DE FALLA'!DW33=0,\"\",'[1]TASA DE FALLA'!DW33)","v":""},{"$f":"+IF('[1]TASA DE FALLA'!DX33=0,\"\",'[1]TASA DE FALLA'!DX33)","v":""},{"$f":"+IF('[1]TASA DE FALLA'!DY33=0,\"\",'[1]TASA DE FALLA'!DY33)","v":""},{"$f":"+IF('[1]TASA DE FALLA'!DZ33=0,\"\",'[1]TASA DE FALLA'!DZ33)","v":""}]
[null,null,{"$f":"'[1]TASA DE FALLA'!C34","v":29},{"$f":"'[1]TASA DE FALLA'!D34","v":"PUESTO HERNANDEZ - CHIUHIDO II"},{"$f":"'[1]TASA DE FALLA'!E34","v":132},{"$f":"'[1]TASA DE FALLA'!F34","v":19.5},{"$f":"'[1]TASA DE FALLA'!G34","v":"L"},{"$f":"+IF('[1]TASA DE FALLA'!DO34=0,\"\",'[1]TASA DE FALLA'!DO34)","v":""},{"$f":"+IF('[1]TASA DE FALLA'!DP34=0,\"\",'[1]TASA DE FALLA'!DP34)","v":""},{"$f":"+IF('[1]TASA DE FALLA'!DQ34=0,\"\",'[1]TASA DE FALLA'!DQ34)","v":""},{"$f":"+IF('[1]TASA DE FALLA'!DR34=0,\"\",'[1]TASA DE FALLA'!DR34)","v":""},{"$f":"+IF('[1]TASA DE FALLA'!DS34=0,\"\",'[1]TASA DE FALLA'!DS34)","v":""},{"$f":"+IF('[1]TASA DE FALLA'!DT34=0,\"\",'[1]TASA DE FALLA'!DT34)","v":""},{"$f":"+IF('[1]TASA DE FALLA'!DU34=0,\"\",'[1]TASA DE FALLA'!DU34)","v":""},{"$f":"+IF('[1]TASA DE FALLA'!DV34=0,\"\",'[1]TASA DE FALLA'!DV34)","v":""},{"$f":"+IF('[1]TASA DE FALLA'!DW34=0,\"\",'[1]TASA DE FALLA'!DW34)","v":""},{"$f":"+IF('[1]TASA DE FALLA'!DX34=0,\"\",'[1]TASA DE FALLA'!DX34)","v":""},{"$f":"+IF('[1]TASA DE FALLA'!DY34=0,\"\",'[1]TASA DE FALLA'!DY34)","v":""},{"$f":"+IF('[1]TASA DE FALLA'!DZ34=0,\"\",'[1]TASA DE FALLA'!DZ34)","v":""}]
[null,null,{"$f":"'[1]TASA DE FALLA'!C35","v":30},{"$f":"'[1]TASA DE FALLA'!D35","v":"CHIUHIDO II - EL TRAPIAL"},{"$f":"'[1]TASA DE FALLA'!E35","v":132},{"$f":"'[1]TASA DE FALLA'!F35","v":4.9000000000000004},{"$f":"'[1]TASA DE FALLA'!G35","v":"L"},{"$f":"+IF('[1]TASA DE FALLA'!DO35=0,\"\",'[1]TASA DE FALLA'!DO35)","v":""},{"$f":"+IF('[1]TASA DE FALLA'!DP35=0,\"\",'[1]TASA DE FALLA'!DP35)","v":""},{"$f":"+IF('[1]TASA DE FALLA'!DQ35=0,\"\",'[1]TASA DE FALLA'!DQ35)","v":""},{"$f":"+IF('[1]TASA DE FALLA'!DR35=0,\"\",'[1]TASA DE FALLA'!DR35)","v":""},{"$f":"+IF('[1]TASA DE FALLA'!DS35=0,\"\",'[1]TASA DE FALLA'!DS35)","v":""},{"$f":"+IF('[1]TASA DE FALLA'!DT35=0,\"\",'[1]TASA DE FALLA'!DT35)","v":""},{"$f":"+IF('[1]TASA DE FALLA'!DU35=0,\"\",'[1]TASA DE FALLA'!DU35)","v":""},{"$f":"+IF('[1]TASA DE FALLA'!DV35=0,\"\",'[1]TASA DE FALLA'!DV35)","v":""},{"$f":"+IF('[1]TASA DE FALLA'!DW35=0,\"\",'[1]TASA DE FALLA'!DW35)","v":""},{"$f":"+IF('[1]TASA DE FALLA'!DX35=0,\"\",'[1]TASA DE FALLA'!DX35)","v":""},{"$f":"+IF('[1]TASA DE FALLA'!DY35=0,\"\",'[1]TASA DE FALLA'!DY35)","v":""},{"$f":"+IF('[1]TASA DE FALLA'!DZ35=0,\"\",'[1]TASA DE FALLA'!DZ35)","v":""}]
[null,null,{"$f":"'[1]TASA DE FALLA'!C36","v":31},{"$f":"'[1]TASA DE FALLA'!D36","v":"EL TRAPIAL - LOMA DE LA LATA 1"},{"$f":"'[1]TASA DE FALLA'!E36","v":132},{"$f":"'[1]TASA DE FALLA'!F36","v":142},{"$f":"'[1]TASA DE FALLA'!G36","v":"L"},{"$f":"+IF('[1]TASA DE FALLA'!DO36=0,\"\",'[1]TASA DE FALLA'!DO36)","v":""},{"$f":"+IF('[1]TASA DE FALLA'!DP36=0,\"\",'[1]TASA DE FALLA'!DP36)","v":""},{"$f":"+IF('[1]TASA DE FALLA'!DQ36=0,\"\",'[1]TASA DE FALLA'!DQ36)","v":""},{"$f":"+IF('[1]TASA DE FALLA'!DR36=0,\"\",'[1]TASA DE FALLA'!DR36)","v":""},{"$f":"+IF('[1]TASA DE FALLA'!DS36=0,\"\",'[1]TASA DE FALLA'!DS36)","v":""},{"$f":"+IF('[1]TASA DE FALLA'!DT36=0,\"\",'[1]TASA DE FALLA'!DT36)","v":""},{"$f":"+IF('[1]TASA DE FALLA'!DU36=0,\"\",'[1]TASA DE FALLA'!DU36)","v":""},{"$f":"+IF('[1]TASA DE FALLA'!DV36=0,\"\",'[1]TASA DE FALLA'!DV36)","v":""},{"$f":"+IF('[1]TASA DE FALLA'!DW36=0,\"\",'[1]TASA DE FALLA'!DW36)","v":""},{"$f":"+IF('[1]TASA DE FALLA'!DX36=0,\"\",'[1]TASA DE FALLA'!DX36)","v":""},{"$f":"+IF('[1]TASA DE FALLA'!DY36=0,\"\",'[1]TASA DE FALLA'!DY36)","v":""},{"$f":"+IF('[1]TASA DE FALLA'!DZ36=0,\"\",'[1]TASA DE FALLA'!DZ36)","v":1}]
[null,null,{"$f":"'[1]TASA DE FALLA'!C37","v":32},{"$f":"'[1]TASA DE FALLA'!D37","v":"EL TRAPIAL - LOMA DE LA LATA 2"},{"$f":"'[1]TASA DE FALLA'!E37","v":132},{"$f":"'[1]TASA DE FALLA'!F37","v":142},{"$f":"'[1]TASA DE FALLA'!G37","v":"L"},{"$f":"+IF('[1]TASA DE FALLA'!DO37=0,\"\",'[1]TASA DE FALLA'!DO37)","v":""},{"$f":"+IF('[1]TASA DE FALLA'!DP37=0,\"\",'[1]TASA DE FALLA'!DP37)","v":""},{"$f":"+IF('[1]TASA DE FALLA'!DQ37=0,\"\",'[1]TASA DE FALLA'!DQ37)","v":""},{"$f":"+IF('[1]TASA DE FALLA'!DR37=0,\"\",'[1]TASA DE FALLA'!DR37)","v":""},{"$f":"+IF('[1]TASA DE FALLA'!DS37=0,\"\",'[1]TASA DE FALLA'!DS37)","v":""},{"$f":"+IF('[1]TASA DE FALLA'!DT37=0,\"\",'[1]TASA DE FALLA'!DT37)","v":""},{"$f":"+IF('[1]TASA DE FALLA'!DU37=0,\"\",'[1]TASA DE FALLA'!DU37)","v":""},{"$f":"+IF('[1]TASA DE FALLA'!DV37=0,\"\",'[1]TASA DE FALLA'!DV37)","v":""},{"$f":"+IF('[1]TASA DE FALLA'!DW37=0,\"\",'[1]TASA DE FALLA'!DW37)","v":""},{"$f":"+IF('[1]TASA DE FALLA'!DX37=0,\"\",'[1]TASA DE FALLA'!DX37)","v":""},{"$f":"+IF('[1]TASA DE FALLA'!DY37=0,\"\",'[1]TASA DE FALLA'!DY37)","v":""},{"$f":"+IF('[1]TASA DE FALLA'!DZ37=0,\"\",'[1]TASA DE FALLA'!DZ37)","v":1}]
[null,null,{"$f":"'[1]TASA DE FALLA'!C38","v":33},{"$f":"'[1]TASA DE FALLA'!D38","v":"PTO. SECCIONAMIENTO - RINCON DE LOS SAUCES"},{"$f":"'[1]TASA DE FALLA'!E38","v":132},{"$f":"'[1]TASA DE FALLA'!F38","v":67.704999999999998},{"$f":"'[1]TASA DE FALLA'!G38","v":"L"},{"$f":"+IF('[1]TASA DE FALLA'!DO38=0,\"\",'[1]TASA DE FALLA'!DO38)","v":""},{"$f":"+IF('[1]TASA DE FALLA'!DP38=0,\"\",'[1]TASA DE FALLA'!DP38)","v":""},{"$f":"+IF('[1]TASA DE FALLA'!DQ38=0,\"\",'[1]TASA DE FALLA'!DQ38)","v":""},{"$f":"+IF('[1]TASA DE FALLA'!DR38=0,\"\",'[1]TASA DE FALLA'!DR38)","v":""},{"$f":"+IF('[1]TASA DE FALLA'!DS38=0,\"\",'[1]TASA DE FALLA'!DS38)","v":""},{"$f":"+IF('[1]TASA DE FALLA'!DT38=0,\"\",'[1]TASA DE FALLA'!DT38)","v":""},{"$f":"+IF('[1]TASA DE FALLA'!DU38=0,\"\",'[1]TASA DE FALLA'!DU38)","v":""},{"$f":"+IF('[1]TASA DE FALLA'!DV38=0,\"\",'[1]TASA DE FALLA'!DV38)","v":""},{"$f":"+IF('[1]TASA DE FALLA'!DW38=0,\"\",'[1]TASA DE FALLA'!DW38)","v":""},{"$f":"+IF('[1]TASA DE FALLA'!DX38=0,\"\",'[1]TASA DE FALLA'!DX38)","v":""},{"$f":"+IF('[1]TASA DE FALLA'!DY38=0,\"\",'[1]TASA DE FALLA'!DY38)","v":""},{"$f":"+IF('[1]TASA DE FALLA'!DZ38=0,\"\",'[1]TASA DE FALLA'!DZ38)","v":1}]
[null,null,{"$f":"'[1]TASA DE FALLA'!C39","v":34},{"$f":"'[1]TASA DE FALLA'!D39","v":"PTO. HERNANDEZ - RINCON DE LOS SAUCES"},{"$f":"'[1]TASA DE FALLA'!E39","v":132},{"$f":"'[1]TASA DE FALLA'!F39","v":21},{"$f":"'[1]TASA DE FALLA'!G39","v":"L"},{"$f":"+IF('[1]TASA DE FALLA'!DO39=0,\"\",'[1]TASA DE FALLA'!DO39)","v":1},{"$f":"+IF('[1]TASA DE FALLA'!DP39=0,\"\",'[1]TASA DE FALLA'!DP39)","v":""},{"$f":"+IF('[1]TASA DE FALLA'!DQ39=0,\"\",'[1]TASA DE FALLA'!DQ39)","v":""},{"$f":"+IF('[1]TASA DE FALLA'!DR39=0,\"\",'[1]TASA DE FALLA'!DR39)","v":""},{"$f":"+IF('[1]TASA DE FALLA'!DS39=0,\"\",'[1]TASA DE FALLA'!DS39)","v":""},{"$f":"+IF('[1]TASA DE FALLA'!DT39=0,\"\",'[1]TASA DE FALLA'!DT39)","v":""},{"$f":"+IF('[1]TASA DE FALLA'!DU39=0,\"\",'[1]TASA DE FALLA'!DU39)","v":""},{"$f":"+IF('[1]TASA DE FALLA'!DV39=0,\"\",'[1]TASA DE FALLA'!DV39)","v":""},{"$f":"+IF('[1]TASA DE FALLA'!DW39=0,\"\",'[1]TASA DE FALLA'!DW39)","v":""},{"$f":"+IF('[1]TASA DE FALLA'!DX39=0,\"\",'[1]TASA DE FALLA'!DX39)","v":""},{"$f":"+IF('[1]TASA DE FALLA'!DY39=0,\"\",'[1]TASA DE FALLA'!DY39)","v":""},{"$f":"+IF('[1]TASA DE FALLA'!DZ39=0,\"\",'[1]TASA DE FALLA'!DZ39)","v":""}]
[null,null,null,null,null,null,null,{"$f":"+IF('[1]TASA DE FALLA'!DO40=0,\"\",'[1]TASA DE FALLA'!DO40)","v":""},{"$f":"+IF('[1]TASA DE FALLA'!DP40=0,\"\",'[1]TASA DE FALLA'!DP40)","v":""},{"$f":"+IF('[1]TASA DE FALLA'!DQ40=0,\"\",'[1]TASA DE FALLA'!DQ40)","v":""},{"$f":"+IF('[1]TASA DE FALLA'!DR40=0,\"\",'[1]TASA DE FALLA'!DR40)","v":""},{"$f":"+IF('[1]TASA DE FALLA'!DS40=0,\"\",'[1]TASA DE FALLA'!DS40)","v":""},{"$f":"+IF('[1]TASA DE FALLA'!DT40=0,\"\",'[1]TASA DE FALLA'!DT40)","v":""},{"$f":"+IF('[1]TASA DE FALLA'!DU40=0,\"\",'[1]TASA DE FALLA'!DU40)","v":""},{"$f":"+IF('[1]TASA DE FALLA'!DV40=0,\"\",'[1]TASA DE FALLA'!DV40)","v":""},{"$f":"+IF('[1]TASA DE FALLA'!DW40=0,\"\",'[1]TASA DE FALLA'!DW40)","v":""},{"$f":"+IF('[1]TASA DE FALLA'!DX40=0,\"\",'[1]TASA DE FALLA'!DX40)","v":""},{"$f":"+IF('[1]TASA DE FALLA'!DY40=0,\"\",'[1]TASA DE FALLA'!DY40)","v":""},{"$f":"+IF('[1]TASA DE FALLA'!DZ40=0,\"\",'[1]TASA DE FALLA'!DZ40)","v":""}]
[null,null,null,null,"Longitud Total ",{"$f":"SUM(F19:F40)-F32","v":764.005}]
[null,null,null,null,null,null,"Indisponibilidades Forzadas ",{"$f":"SUM(H19:H40)","v":1},{"$f":"SUM(I19:I40)","v":0},{"$f":"SUM(J19:J40)","v":0},0,0,0,1,1,0,0,1,7]
[null,null,null,null,null,null,"TASA DE FALLA ",{"$f":"'[1]TASA DE FALLA'!DO43","v":1.96},{"$f":"'[1]TASA DE FALLA'!DP43","v":1.83},{"$f":"'[1]TASA DE FALLA'!DQ43","v":1.57},{"$f":"'[1]TASA DE FALLA'!DR43","v":1.44},{"$f":"'[1]TASA DE FALLA'!DS43","v":1.05},{"$f":"'[1]TASA DE FALLA'!DT43","v":1.05},{"$f":"'[1]TASA DE FALLA'!DU43","v":1.05},{"$f":"'[1]TASA DE FALLA'!DV43","v":1.05},{"$f":"'[1]TASA DE FALLA'!DW43","v":1.05},{"$f":"'[1]TASA DE FALLA'!DX43","v":0.52},{"$f":"'[1]TASA DE FALLA'!DY43","v":0.52},{"$f":"'[1]TASA DE FALLA'!DZ43","v":0.65},{"$f":"'[1]TASA DE FALLA'!EA43","v":1.44}]
[]
[null,null,null,null,null,null,null,"TASA DE FALLA",null,{"$f":"+T43","v":1.44},null,"SALIDAS x AÑO / 100 km"]

{"sheet":"DATO","index":4,"n_rows":21,"n_cols":29,"rows_kept":21,"cut":false,"hidden":false,"merged":[]}
["Mes","Mes","Dia","Año",null,"E.N.R.E."]
["enero","01",31,2006]
["febrero","02",{"$f":"IF(MOD(E14,4)=0,29,28)","v":29},{"$f":"+D2+1","v":2007}]
["marzo","03",31,2008]
["abril","04",30,2009]
["mayo","05",31,2010]
["junio","06",30,2011]
["julio","07",31,2012]
["agosto","08",31,2013]
["septiembre","09",30,2014]
["octubre","10",31,2015]
["noviembre","11",30,2016]
["diciembre","12",31,null,null,null,null,null,"Total"]
[11,2,{"$f":"CELL(\"CONTENIDO\",OFFSET(A1,B14,0))","v":"febrero"},{"$f":"CELL(\"CONTENIDO\",OFFSET(C1,B14,0))","v":29},{"$f":"CELL(\"CONTENIDO\",OFFSET(D1,A14,0))","v":2016},{"$f":"\"Desde el 01 al \" & D14 & \" de \" & C14 & \" de \" & E14","v":"Desde el 01 al 29 de febrero de 2016"},{"$f":"CELL(\"CONTENIDO\",OFFSET(B1,B14,0))","v":"02"},{"$f":"RIGHT(E14,2)","v":"16"},"B14"]
[null,{"$f":"\"\\\\rugor\\files\\Transporte\\Transporte\\AA PROCESO AUT ARCHIVOS J\\EPEN_TRONCAL\\\" &E14","v":"\\\\rugor\\files\\Transporte\\Transporte\\AA PROCESO AUT ARCHIVOS J\\EPEN_TRONCAL\\2016"},null,null,null,null,{"$f":"\"J\"&G14&H14&\"PEN\"","v":"J0216PEN"}]
[null,{"$f":"\"\\\\rugor\\files\\Transporte\\transporte\\AA PROCESO AUT\\INTERCAMBIO\\\" &H14&G14","v":"\\\\rugor\\files\\Transporte\\transporte\\AA PROCESO AUT\\INTERCAMBIO\\1602"}]
["Hoja","FilaInicio","FilasPlantilla","Columnas","NombreHoja","OrigenDeDatos","Col00","Col01","Col02","Col03","Col04","Col05","Col06","Col07","Col08","Col09","Col10","Col11","Col12","Col13","Col14","Col15","FILHTOTAL","COLHTOTAL","FILHCALC","COLHCALC","FILTRANSP","COLTRANSP","COL TSAL"]
["MODELO L",19,19,12,{"$f":"\"LI-\" & $G$14","v":"LI-02"},"EPEN_INDISPONIBILIDADES_LINEAS_EPEN.XLS",3,5,4,6,7,8,0,10,11,14,16,27,15,0,0,0,18,9,40,28,17,28,14]
["MODELO T",22,19,13,{"$f":"\"T-\" & $G$14","v":"T-02"},"EPEN_INDISPONIBILIDADES_TRAFOS_EPEN.XLS",3,5,4,6,7,8,9,11,12,15,16,18,28,17,0,0,22,9,43,29,20,29,15]
["MODELO S",21,19,10,{"$f":"\"SA-\" & $G$14","v":"SA-02"},"EPEN_INDISPONIBILIDADES_SALIDAS_EPEN.XLS",3,5,4,6,7,8,10,11,14,15,21,0,0,0,0,0,24,9,42,22,19,22,14]
["MODELO VST",19,24,4,{"$f":"\"CAUSAS-VST-\" & $G$14","v":"CAUSAS-VST-02"},"EPEN_CAUSAS_VST.XLS",3,4,5,6,7,0,0,0,0,0,0,0,0,0,0,0,999,999,0,0,0,0,0]