{"text_format":"1","workbook":"xlsx","n_sheets":7,"sheets":["TOT-0116","LI-01 (1)","T-01 (1)","SA-01 (1)","SA-01 (2)","Tasa de Falla","DATO"],"not_rendered":{"charts":0,"images":2,"macros":1,"external_links":1,"defined_names":2,"comments":0,"pivot_tables":0},"unopened":[],"bounds":{"document_bytes":16777216,"sheet_cells":100000,"rows_first":2000,"rows_last":500,"rows_between":2000,"halvings":0,"cell_chars":16384,"cell_head_chars":4096},"cells_cut":0,"cells_raw":0,"read":"whole","date_system":"1900"}

{"sheet":"TOT-0116","index":0,"n_rows":30,"n_cols":9,"rows_kept":30,"cut":false,"hidden":false,"merged":[]}
[]
[null,"ANEXO IV  al Memorandum  D.T.E.E.  N° 687/ 2016"]
[]
["ENTE NACIONAL REGULADOR "]
["DE LA ELECTRICIDAD"]
[]
[null,"SISTEMA DE TRANSPORTE DE ENERGÍA ELÉCTRICA POR DISTRIBUCIÓN TRONCAL"]
[]
[null,"EPEN"]
[]
[null,{"$f":"CONCATENATE(\"TOTAL DE PENALIZACIONES A \",IF(DATO!$F$1=\"E.N.R.E.\",\"APLICAR\",\"FORMULAR\"))","v":"TOTAL DE PENALIZACIONES A APLICAR"}]
[]
[null,{"$f":"IF(C13=TRUE,2,1)","v":1}]
[null,"Desde el 01 al 31 de enero de 2016"]
[]
[]
[]
[null,null,"1.-","LÍNEAS",null,null,null,null,{"$f":"'LI-01 (1)'!AB40","v":93095}]
[]
[null,null,"2.-","CONEXIÓN"]
[]
[null,null,null,"2.1.-","Transformación",null,null,null,{"$f":"'T-01 (1)'!AC45","v":20842.46}]
[]
[null,null,null,"2.2.-","Salidas",null,null,null,{"$f":"'SA-01 (2)'!V42","v":35826.49}]
[]
[]
[]
[null,null,null,null,null,"TOTAL ",{"$f":"SUM(I18:I24)","v":149763.94999999998}]
[]
[null,null,"Valores de remuneración según  el Acuerdo Instrumental. Nota ENRE Nº 117663"]

{"sheet":"LI-01 (1)","index":1,"n_rows":40,"n_cols":28,"rows_kept":40,"cut":false,"hidden":false,"merged":[]}
[]
[null,{"$f":"+'TOT-0116'!B2","v":"ANEXO IV  al Memorandum  D.T.E.E.  N° 687/ 2016"}]
[]
[null,null,null,"ENTE NACIONAL REGULADOR "]
[null,null,null,"DE LA ELECTRICIDAD"]
[]
[]
[null,null,null,null,null,"SISTEMA DE TRANSPORTE DE ENERGÍA ELÉCTRICA POR DISTRIBUCIÓN TRONCAL - EPEN"]
[]
[null,null,null,null,null,"1.- LÍNEAS"]
[]
[null,{"$f":"+'TOT-0116'!B14","v":"Desde el 01 al 31 de enero de 2016"}]
[]
[null,null,null,null,null,"$/100 km-h : LÍNEAS 132 kV",498.71,null,null,null,"FACTOR DE PENALIZACIÓN  K =",{"$f":"30*'TOT-0116'!B13","v":30},{"$f":"IF(L14=30,\" \",IF(L14=60,\"Coeficiente duplicado por tasa de falla >4 Sal. x año/100 km.\",\"REVISAR COEFICIENTE\"))","v":" "}]
[null,null,3,4,5,6,7,8,9,10,11,12,13,14,15,16,17,18,19,20,21,22,23,24,25,26,27,28]
[null,null,"N°","INDISP","ID EQUIPO","LÍNEAS","U\n[kV]","Long.\n[km]","$/h","Salida","Entrada","Hs.\nIndisp.","Minutos\nIndisp.","Tipo \nSal.(²)","C.R.\n%","AUT.","PENALIZ.\nPROGRAM.","REDUCCIÓN\nPROGRAM.","PENALIZACIÓN FORZADA\nPor Salida     1ras. 3 hs.     hs. Restantes",null,null,"REDUCCIÓN FORZADA\nPor Salida     1ras. 3 hs.     hs. Restantes",null,null,"RESTANTE\nFORZADA (RF)","REDUCCIÓN\nRESTANTE (RR)","Informó\nen Térm.","TOTAL\nPENALIZAC."]
[]
[]
[null,null,1,297407,150,"ALTO VALLE - CENTENARIO",132,16.600000381469727,{"$f":"H19*$G$14/100","v":82.785861902427683},"2016-01-02T23:43:00","2016-01-02T23:50:00",{"$f":"IF(J19=\"\",\"\",(K19-J19)*24)","v":0.11666666669771075},{"$f":"IF(K19=\"\",\"\",ROUND((K19-J19)*24*60,0))","v":7},"F","0,000",{"$f":"IF(F19=\"\",\"\",IF(OR(N19=\"P\",N19=\"RP\"),\"--\",\"NO\"))","v":"NO"},{"$f":"IF(N19=\"P\",ROUND(M19/60,2)*I19*$L$14*0.01,\"--\")","v":"--"},{"$f":"IF(N19=\"RP\",ROUND(M19/60,2)*I19*$L$14*0.01*O19/100,\"--\")","v":"--"},{"$f":"IF(P19=\"SI\",\"--\",IF(N19=\"F\",ROUND(I19*$L$14,2),\"--\"))","v":2483.58},{"$f":"IF(N19=\"F\",IF(M19<10,\"--\",IF(M19>180,ROUND(I19*$L$14*3,2),I19*$L$14*ROUND(M19/60,2))),\"--\")","v":"--"},{"$f":"IF(AND(N19=\"F\",M19>180),I19*$L$14*0.1*(ROUND(M19/60,2)-3),\"--\")","v":"--"},{"$f":"IF(P19=\"SI\",\"--\",IF(N19=\"R\",ROUND(I19*$L$14*O19/100,2),\"--\"))","v":"--"},{"$f":"IF(N19=\"R\",IF(M19<10,\"--\",IF(M19>180,ROUND(I19*$L$14*3*O19/100,2),I19*$L$14*O19/100*ROUND(M19/60,2))),\"--\")","v":"--"},{"$f":"IF(AND(N19=\"R\",M19>180),I19*$L$14*O19/100*0.1*(ROUND(M19/60,2)-3),\"--\")","v":"--"},{"$f":"IF(N19=\"RF\",I19*$L$14*0.1*ROUND(M19/60,2),\"--\")","v":"--"},{"$f":"IF(N19=\"RR\",I19*$L$14*0.1*O19/100*ROUND(M19/60,2),\"--\")","v":"--"},"SI",{"$f":"IF(F19=\"\",\"\",IF(AA19=\"SI\",SUM(Q19:Z19),2*SUM(Q19:Z19)))","v":2483.58}]
[null,null,2,297408,150,"ALTO VALLE - CENTENARIO",132,16.600000381469727,{"$f":"H20*$G$14/100","v":82.785861902427683},"2016-01-03T10:09:00","2016-01-03T16:12:00",6.0499999999883585,363,"F","0,000","NO","--","--",2483.58,7450.73,757.49063640721329,"--","--","--","--","--","SI",10691.800636407213]
[null,null,3,297410,4655,"TRAPIAL LOMA L.LATA 1",132,140,698.19399999999996,"2016-01-06T10:47:00","2016-01-06T12:02:00",1.2499999998835847,75,"P","0,000","--",261.82274999999998,"--","--","--","--","--","--","--","--","--","SI",261.82274999999998]
[null,null,4,297841,150,"ALTO VALLE - CENTENARIO",132,16.600000381469727,82.785861902427683,"2016-01-11T08:31:00","2016-01-11T16:29:00",7.96666666661622,478,"P","0,000","--",197.94099580870457,"--","--","--","--","--","--","--","--","--","SI",197.94099580870457]
[null,null,5,297818,160,"CHOCON OESTE - CHOCON",132,3.5,17.45485,"2016-01-19T09:27:00","2016-01-19T14:44:00",5.2833333332673647,317,"P","0,000","--",27.648482400000002,"--","--","--","--","--","--","--","--","--","SI",27.648482400000002]
[null,null,6,297830,4655,"TRAPIAL LOMA L.LATA 1",132,140,698.19399999999996,"2016-01-23T21:59:00","2016-01-23T22:18:00",0.31666666665114462,19,"F","0,000","NO","--","--",20945.82,6702.6624000000002,"--","--","--","--","--","--","SI",27648.482400000001]
[null,null,7,297831,4656,"TRAPIAL LOMA L.LATA 2",132,140,698.19399999999996,"2016-01-23T21:59:00","2016-01-23T22:24:00",0.41666666662786156,25,"F","0,000","NO","--","--",20945.82,8797.2443999999996,"--","--","--","--","--","--","SI",29743.064399999999]
[null,null,8,298499,5028,"P. SECC. - RINCON DE LOS SAUCES",132,69,344.10989999999998,"2016-01-26T22:08:00","2016-01-26T22:13:00",8.3333333255723119E-2,5,"F","0,000","NO","--","--",10323.299999999999,"--","--","--","--","--","--","--",{"$f":"IF(F26=\"\",\"\",\"SI\")","v":"SI"},10323.299999999999]
[null,null,9,298500,168,"P.SECC. - MEDANITOS",132,41,204.47110000000001,"2016-01-26T22:08:00","2016-01-26T22:13:00",8.3333333255723119E-2,5,"F","0,000","NO","--","--",6134.13,"--","--","--","--","--","--","--","SI",6134.13]
[null,null,10,298512,5028,"P. SECC. - RINCON DE LOS SAUCES",132,69,344.10989999999998,"2016-01-30T09:22:00","2016-01-30T16:44:00",7.3666666667559184,442,"P","0,000","--",760.82698890000006,"--","--","--","--","--","--","--","--","--","SI",760.82698890000006]
[null,null,11,298513,5029,"RINCON DE LOS SAUCES - P. HERNANDEZ",132,21,104.7291,"2016-01-30T09:28:00","2016-01-30T16:43:00",7.2500000000582077,435,"P","0,000","--",227.78579249999999,"--","--","--","--","--","--","--","--","--","SI",227.78579249999999]
[null,null,12,298516,150,"ALTO VALLE - CENTENARIO",132,16.600000000000001,82.785860000000014,"2016-01-30T17:30:00","2016-01-30T18:21:00",0.84999999997671694,51,"F","0,000","NO","--","--",2483.58,2111.0394300000003,"--","--","--","--","--","--","SI",4594.6194300000006]
[null,null,null,null,null,null,null,null,0,null,null,"","",null,{"$f":"IF(F31=\"\",\"\",\"--\")","v":""},"","--","--","--","--","--","--","--","--","--","--","",""]
[null,null,null,null,null,null,null,null,0,null,null,"","",null,"","","--","--","--","--","--","--","--","--","--","--","",""]
[null,null,null,null,null,null,null,null,0,null,null,"","",null,"","","--","--","--","--","--","--","--","--","--","--","",""]
[null,null,null,null,null,null,null,null,0,null,null,"","",null,"","","--","--","--","--","--","--","--","--","--","--","",""]
[null,null,null,null,null,null,null,null,0,null,null,"","",null,"","","--","--","--","--","--","--","--","--","--","--","",""]
[null,null,null,null,null,null,null,null,0,null,null,"","",null,"","","--","--","--","--","--","--","--","--","--","--","",""]
[null,null,null,null,null,null,null,null,0,null,null,"","",null,"","","--","--","--","--","--","--","--","--","--","--","",""]
[null,null,null,null,null,null,null,null,0,null,null,"","",null,"","","--","--","--","--","--","--","--","--","--","--","",""]
[]
[null,null,"(²)","P - PROGRAMADA  ; F - FORZADA",null,null,null,null,null,null,null,null,null,null,null,null,null,null,null,null,null,null,null,null,null,null,null,{"$f":"ROUND(SUM(AB17:AB39),2)","v":93095}]

{"sheet":"T-01 (1)","index":2,"n_rows":45,"n_cols":29,"rows_kept":45,"cut":false,"hidden":false,"merged":[]}
[]
[null,{"$f":"+'TOT-0116'!B2","v":"ANEXO IV  al Memorandum  D.T.E.E.  N° 687/ 2016"}]
[]
[null,null,null,"ENTE NACIONAL REGULADOR "]
[null,null,null,"DE LA ELECTRICIDAD"]
[]
[]
[null,null,null,null,null,"SISTEMA DE TRANSPORTE DE ENERGÍA ELÉCTRICA POR DISTRIBUCIÓN TRONCAL - EPEN"]
[]
[null,null,null,null,null,"2.- CONEXIÓN"]
[]
[null,null,null,null,null,"2.1.- Transformación"]
[]
[null,{"$f":"+'TOT-0116'!B14","v":"Desde el 01 al 31 de enero de 2016"}]
[]
[null,null,null,null,null,"Por Transformador por MVA    $ =",null,null,1.752]
[null,null,null,null,null,"Coeficiente de penalización por salida forzada   =",null,null,{"$f":"30*'TOT-0116'!B13","v":30},null,{"$f":"IF(I17=30,\" \",IF(I17=60,\"    Coeficiente duplicado por tasa de falla >4 Sal. x año/100 km.\",\"   REVISAR COEFICIENTE\"))","v":" "},null,null,null,null,null," "]
[null,null,3,4,5,6,7,8,9,10,11,12,13,14,15,16,17,18,19,20,21,22,23,24,25,26,27,28,29]
[null,null,"N°","INDISP","ID EQUIPO","ESTACIÓN\nTRANSFORMADORA","EQUIPO","POT.\n[ MVA ]","U\n[ kV ]","$/h","Salida","Entrada","Hs\nIndisp.","Minutos.\nIndisp.","Tipo \nSal.(²)","AUT.","C.R.\n%","E.N.S.","K (P;ENS)","PENALIZ.\nPROGRAM.","REDUCCIÓN\nPROGRAM.","PENALIZACIÓN FORZADA\nPor Salida     hs. Restantes",null,"REDUCCIÓN FORZADA\nPor Salida     hs. Restantes",null,"RESTANTE\nFORZADA","REDUCCIÓN\nRESTANTE","Informó \nen Térm.","TOTAL\nPENALIZAC."]
[]
[]
[null,null,13,297413,196,"COLONIA VALENTINA ","TRAFO 1",15,"132/33/13,2",{"$f":"H22*$I$16","v":26.28},"2016-01-06T18:34:00","2016-01-06T19:38:00",{"$f":"IF(K22=\"\",\"\",(L22-K22)*24)","v":1.0666666668257676},{"$f":"IF(L22=\"\",\"\",ROUND((L22-K22)*24*60,0))","v":64},"F",{"$f":"IF(O22=\"\",\"\",IF(OR(O22=\"P\",O22=\"RP\"),\"--\",\"NO\"))","v":"NO"},"0,000","NO",{"$f":"$I$17*IF(R22=\"SI\",1,0.1)*IF(OR(O22=\"P\",O22=\"RP\"),0.1,1)","v":3},{"$f":"IF(O22=\"P\",J22*S22*ROUND(N22/60,2),\"--\")","v":"--"},{"$f":"IF(O22=\"RP\",J22*S22*Q22/100*ROUND(N22/60,2),\"--\")","v":"--"},{"$f":"IF(AND(O22=\"F\",P22=\"NO\"),J22*S22,\"--\")","v":78.84},{"$f":"IF(O22=\"F\",J22*S22*ROUND(N22/60,2),\"--\")","v":84.358800000000002},{"$f":"IF(AND(O22=\"R\",P22=\"NO\"),J22*S22*Q22/100,\"--\")","v":"--"},{"$f":"IF(O22=\"R\",J22*S22*ROUND(N22/60,2)*Q22/100,\"--\")","v":"--"},{"$f":"IF(O22=\"RF\",J22*S22*ROUND(N22/60,2),\"--\")","v":"--"},{"$f":"IF(O22=\"RR\",J22*S22*ROUND(N22/60,2)*Q22/100,\"--\")","v":"--"},"SI",{"$f":"IF(F22=\"\",\"\",SUM(T22:AA22)*IF(AB22=\"SI\",1,2))","v":163.19880000000001}]
[null,null,14,297842,176,"ALTO VALLE "," TRAFO 2",30,"132/33/13,2",{"$f":"H23*$I$16","v":52.56},"2016-01-14T12:05:00","2016-01-14T12:28:00",{"$f":"IF(K23=\"\",\"\",(L23-K23)*24)","v":0.38333333336049691},{"$f":"IF(L23=\"\",\"\",ROUND((L23-K23)*24*60,0))","v":23},"F",{"$f":"IF(O23=\"\",\"\",IF(OR(O23=\"P\",O23=\"RP\"),\"--\",\"NO\"))","v":"NO"},"0,000","SI",{"$f":"$I$17*IF(R23=\"SI\",1,0.1)*IF(OR(O23=\"P\",O23=\"RP\"),0.1,1)","v":30},{"$f":"IF(O23=\"P\",J23*S23*ROUND(N23/60,2),\"--\")","v":"--"},{"$f":"IF(O23=\"RP\",J23*S23*Q23/100*ROUND(N23/60,2),\"--\")","v":"--"},{"$f":"IF(AND(O23=\"F\",P23=\"NO\"),J23*S23,\"--\")","v":1576.8000000000002},{"$f":"IF(O23=\"F\",J23*S23*ROUND(N23/60,2),\"--\")","v":599.18400000000008},{"$f":"IF(AND(O23=\"R\",P23=\"NO\"),J23*S23*Q23/100,\"--\")","v":"--"},{"$f":"IF(O23=\"R\",J23*S23*ROUND(N23/60,2)*Q23/100,\"--\")","v":"--"},{"$f":"IF(O23=\"RF\",J23*S23*ROUND(N23/60,2),\"--\")","v":"--"},{"$f":"IF(O23=\"RR\",J23*S23*ROUND(N23/60,2)*Q23/100,\"--\")","v":"--"},"SI",2175.9840000000004]
[null,null,15,297843,3601,"ALTO VALLE "," TRAFO 6",30,"132/33/13,2",{"$f":"H24*$I$16","v":52.56},"2016-01-14T12:05:00","2016-01-14T12:28:00",0.38333333336049691,23,"F","NO","0,000","SI",{"$f":"$I$17*IF(R24=\"SI\",1,0.1)*IF(OR(O24=\"P\",O24=\"RP\"),0.1,1)","v":30},"--","--",{"$f":"IF(AND(O24=\"F\",P24=\"NO\"),J24*S24,\"--\")","v":1576.8000000000002},{"$f":"IF(O24=\"F\",J24*S24*ROUND(N24/60,2),\"--\")","v":599.18400000000008},{"$f":"IF(AND(O24=\"R\",P24=\"NO\"),J24*S24*Q24/100,\"--\")","v":"--"},{"$f":"IF(O24=\"R\",J24*S24*ROUND(N24/60,2)*Q24/100,\"--\")","v":"--"},{"$f":"IF(O24=\"RF\",J24*S24*ROUND(N24/60,2),\"--\")","v":"--"},{"$f":"IF(O24=\"RR\",J24*S24*ROUND(N24/60,2)*Q24/100,\"--\")","v":"--"},"SI",2175.9840000000004]
[null,null,16,297819,196,"COLONIA VALENTINA ","TRAFO 1",15,"132/33/13,2",26.28,"2016-01-20T22:35:00","2016-01-20T23:54:00",1.3166666667675599,79,"F","NO","0,000","NO",3,"--","--",78.84,104.06880000000001,"--","--","--","--","SI",182.90880000000001]
[null,null,17,297823,196,"COLONIA VALENTINA ","TRAFO 1",15,"132/33/13,2",26.28,"2016-01-21T13:35:00","2016-01-21T14:24:00",0.81666666670935228,49,"F","NO","0,000","SI",30,"--","--",788.40000000000009,646.48800000000006,"--","--","--","--","SI",1434.8880000000001]
[null,null,18,297824,196,"COLONIA VALENTINA ","TRAFO 1",15,"132/33/13,2",26.28,"2016-01-21T14:43:00","2016-01-21T14:52:00",0.1499999999650754,9,"F","NO","0,000","SI",30,"--","--",788.40000000000009,118.26,"--","--","--","--","SI",906.66000000000008]
[null,null,19,297828,3601,"ALTO VALLE "," TRAFO 6",30,"132/33/13,2",52.56,"2016-01-22T06:34:00","2016-01-22T09:26:00",2.8666666667559184,172,"P","--","0,000","NO",0.30000000000000004,45.254160000000006,"--","--","--","--","--","--","--","SI",45.254160000000006]
[null,null,20,297829,196,"COLONIA VALENTINA ","TRAFO 1",15,"132/33/13,2",26.28,"2016-01-22T20:01:00","2016-01-22T20:51:00",0.8333333334303461,50,"F","NO","0,000","SI",30,"--","--",788.40000000000009,654.37200000000007,"--","--","--","--","SI",1442.7720000000002]
[null,null,21,298498,3601,"ALTO VALLE ","TRAFO6",30,"132/33/13,2",52.56,"2016-01-21T21:20:00","2016-01-21T21:58:00",0.63333333330228925,38,"F","NO","0,000","SI",30,"--","--",1576.8000000000002,993.38400000000013,"--","--","--","--",{"$f":"IF(F30=\"\",\"\",\"SI\")","v":"SI"},2570.1840000000002]
[null,null,22,298509,177,"P.P. BANDERITA","TRAFO 1",15,"132/33/13,2",26.28,"2016-01-28T19:40:00","2016-01-28T19:59:00",0.31666666665114462,19,"F","NO","0,000","SI",30,"--","--",788.40000000000009,252.28800000000004,"--","--","--","--","SI",1040.6880000000001]
[null,null,23,298514,3601,"ALTO VALLE ","TRAFO 6",30,"132/33/13,2",52.56,"2016-01-30T17:29:00","2016-01-30T19:15:00",1.7666666666627862,106,"F","NO","0,000","SI",{"$f":"$I$17*IF(R32=\"SI\",1,0.1)*IF(OR(O32=\"P\",O32=\"RP\"),0.1,1)","v":30},{"$f":"IF(O32=\"P\",J32*S32*ROUND(N32/60,2),\"--\")","v":"--"},{"$f":"IF(O32=\"RP\",J32*S32*Q32/100*ROUND(N32/60,2),\"--\")","v":"--"},{"$f":"IF(AND(O32=\"F\",P32=\"NO\"),J32*S32,\"--\")","v":1576.8000000000002},{"$f":"IF(O32=\"F\",J32*S32*ROUND(N32/60,2),\"--\")","v":2790.9360000000001},{"$f":"IF(AND(O32=\"R\",P32=\"NO\"),J32*S32*Q32/100,\"--\")","v":"--"},{"$f":"IF(O32=\"R\",J32*S32*ROUND(N32/60,2)*Q32/100,\"--\")","v":"--"},{"$f":"IF(O32=\"RF\",J32*S32*ROUND(N32/60,2),\"--\")","v":"--"},{"$f":"IF(O32=\"RR\",J32*S32*ROUND(N32/60,2)*Q32/100,\"--\")","v":"--"},{"$f":"IF(F32=\"\",\"\",\"SI\")","v":"SI"},4367.7360000000008]
[null,null,24,298515,176,"ALTO VALLE ","TRAFO 2",30,"132/33/13,2",52.56,"2016-01-30T17:29:00","2016-01-30T19:14:00",1.7499999999417923,105,"F","NO","0,000","SI",30,"--","--",1576.8000000000002,2759.4000000000005,"--","--","--","--","SI",4336.2000000000007]
[null,null,null,null,null,null,null,null,null,0,null,null,"","",null,"",{"$f":"IF(F34=\"\",\"\",\"--\")","v":""},null,3,"--","--","--","--","--","--","--","--","",{"$f":"IF(F34=\"\",\"\",SUM(T34:AA34)*IF(AB34=\"SI\",1,2))","v":""}]
[null,null,null,null,null,null,null,null,null,0,null,null,"","",null,"","",null,3,"--","--","--","--","--","--","--","--","",""]
[null,null,null,null,null,null,null,null,null,0,null,null,"","",null,"","",null,3,"--","--","--","--","--","--","--","--","",""]
[null,null,null,null,null,null,null,null,null,0,null,null,"","",null,"","",null,3,"--","--","--","--","--","--","--","--","",""]
[null,null,null,null,null,null,null,null,null,0,null,null,"","",null,"","",null,3,"--","--","--","--","--","--","--","--","",""]
[null,null,null,null,null,null,null,null,null,0,null,null,"","",null,"","",null,3,"--","--","--","--","--","--","--","--","",""]
[null,null,null,null,null,null,null,null,null,0,null,null,"","",null,"","",null,3,"--","--","--","--","--","--","--","--","",""]
[null,null,null,null,null,null,null,null,null,0,null,null,"","",null,"","",null,3,"--","--","--","--","--","--","--","--","",""]
[null,null,null,null,null,null,null,null,null,0,null,null,"","",null,"","",null,3,"--","--","--","--","--","--","--","--","",""]
[null,null,null,null,null,null,null,null,null,0,null,null,"","",null,"","",null,3,{"$f":"IF(O43=\"P\",J43*S43*ROUND(N43/60,2),\"--\")","v":"--"},"--","--","--","--","--","--","--","",""]
[]
[null,null,"(²)","P - PROGRAMADA  ; F - FORZADA",null,null,null,null,null,null,null,null,null,null,null,null,null,null,null,null,null,null,null,null,null,null,null,null,{"$f":"ROUND(SUM(AC20:AC44),2)","v":20842.46}]

{"sheet":"SA-01 (1)","index":3,"n_rows":42,"n_cols":22,"rows_kept":42,"cut":false,"hidden":false,"merged":[]}
[]
[null,{"$f":"+'TOT-0116'!B2","v":"ANEXO IV  al Memorandum  D.T.E.E.  N° 687/ 2016"}]
[]
[null,null,null,"ENTE NACIONAL REGULADOR "]
[null,null,null,"DE LA ELECTRICIDAD"]
[]
[]
[null,null,null,null,null,"SISTEMA DE TRANSPORTE DE ENERGÍA ELÉCTRICA POR DISTRIBUCIÓN TRONCAL - EPEN"]
[]
[null,null,null,null,null,"2.2.- Salidas"]
[]
[null,{"$f":"+'TOT-0116'!B14","v":"Desde el 01 al 31 de enero de 2016"}]
[]
[null,null,null,null,null,"Salida en 132 kV = ",23.195,{"$f":"50*'TOT-0116'!B13","v":50},null,{"$f":"IF(H14=50,\" \",IF(H14=100,\"  Coeficiente duplicado por tasa de falla >4 Sal. x año/100 km.\",\"REVISAR COEFICIENTE\"))","v":" "}]
[null,null,null,null,null,"Salida en 33 kV =",17.396000000000001,{"$f":"25*'TOT-0116'!B13","v":25},null,{"$f":"IF(H15=25,\" \",IF(H15=50,\"  Coeficiente duplicado por tasa de falla >4 Sal. x año/100 km.\",\"REVISAR COEFICIENTE\"))","v":" "}]
[null,null,null,null,null,"Salida en 13,2 kV =",17.396000000000001,{"$f":"20*'TOT-0116'!B13","v":20},null,{"$f":"IF(H16=20,\" \",IF(H16=40,\"  Coeficiente duplicado por tasa de falla >4 Sal. x año/100 km.\",\"REVISAR COEFICIENTE\"))","v":" "}]
[null,null,3,4,5,6,7,8,9,10,11,12,13,14,15,16,17,18,19,20,21,22]
[null,null,"N°","INDISP","ID EQUIPO","ESTACIÓN \nTRANSFORMADORA","EQUIPO","U\n[kV]","$/h","Salida","Entrada","Hs\nIndisp.","Minutos.\nIndisp.","Tipo \nSal.(²)","AUT.","K (U)","PENALIZ.\nPROGRAM.","PENALIZAC. FORZADA\nPor Salida    Hs. Restantes",null,"RESTANTE\nFORZADA","Informó\nen Térm.","TOTAL\nPENALIZAC."]
[]
[null,null,25,297403,200,"ALTO VALLE ","SALIDA ALIMENT. N° 5 EDERSA",13.199999809265137,{"$f":"IF(OR(H20=132,H20=66),$G$14,IF(H20=33,$G$15,$G$16))","v":17.396000000000001},"2016-01-01T13:07:00","2016-01-01T17:10:00",{"$f":"IF(J20=\"\",\"\",(K20-J20)*24)","v":4.0500000001047738},{"$f":"IF(K20=\"\",\"\",ROUND((K20-J20)*24*60,0))","v":243},"F",{"$f":"IF(N20=\"\",\"\",IF(OR(N20=\"P\",N20=\"RP\"),\"--\",\"NO\"))","v":"NO"},{"$f":"IF(OR(H20=132,H20=66),$H$14,IF(H20=33,$H$15,$H$16))","v":20},{"$f":"IF(N20=\"P\",I20*P20*0.1*ROUND(M20/60,2),\"--\")","v":"--"},{"$f":"IF(O20=\"NO\",IF(N20=\"F\",I20*P20,\"--\"),\"--\")","v":347.92},{"$f":"IF(N20=\"F\",I20*P20*ROUND(M20/60,2),\"--\")","v":1409.076},{"$f":"IF(N20=\"RF\",I20*P20*ROUND(M20/60,2),\"--\")","v":"--"},"SI",{"$f":"IF(F20=\"\",\"\",IF(H20=\"500/220\",0,IF(U20=\"SI\",SUM(Q20:T20),2*SUM(Q20:T20))))","v":1756.9960000000001}]
[null,null,26,297404,202,"ALTO VALLE","SALIDA ALIMENT. N° 7 EDERSA",13.199999809265137,{"$f":"IF(OR(H21=132,H21=66),$G$14,IF(H21=33,$G$15,$G$16))","v":17.396000000000001},"2016-01-01T13:29:00","2016-01-01T18:17:00",4.8000000001047738,288,"F",{"$f":"IF(N21=\"\",\"\",IF(OR(N21=\"P\",N21=\"RP\"),\"--\",\"NO\"))","v":"NO"},20,"--",347.92,1670.0160000000001,"--","SI",2017.9360000000001]
[null,null,27,297405,200,"ALTO VALLE ","SALIDA ALIMENT. N° 5 EDERSA",13.199999809265137,17.396000000000001,"2016-01-01T17:11:00","2016-01-01T17:16:00",8.3333333430346102E-2,5,"F","NO",20,"--",347.92,27.833600000000001,"--","SI",375.75360000000001]
[null,null,28,297406,233,"ARROYITO","SALIDA EPEN",13.199999809265137,17.396000000000001,"2016-01-02T22:14:00","2016-01-03T00:25:00",2.1833333332906477,131,"F","NO",20,"--",347.92,758.46560000000011,"--","SI",1106.3856000000001]
[null,null,29,297409,231,"ARROYITO"," SALIDA LINEA AGUA CAJON 1",132,23.195,"2016-01-05T10:06:00","2016-01-05T12:00:00",1.9000000000814907,114,"P","--",50,220.35249999999999,"--","--","--","SI",220.35249999999999]
[null,null,30,297411,200,"ALTO VALLE ","SALIDA ALIMENT. N° 5 EDERSA",13.199999809265137,17.396000000000001,"2016-01-06T16:01:00","2016-01-06T19:25:00",3.4000000000814907,204,"F","NO",20,"--",347.92,1182.9280000000001,"--","SI",1530.8480000000002]
[null,null,31,297412,199,"ALTO VALLE ","SALIDA ALIMENT. N° 3 EDERSA",13.199999809265137,17.396000000000001,"2016-01-06T16:01:00","2016-01-06T19:56:00",3.9166666666860692,235,"F","NO",20,"--",347.92,1363.8464000000001,"--","SI",1711.7664000000002]
[null,null,32,297414,202,"ALTO VALLE","SALIDA ALIMENT. N° 7 EDERSA",13.199999809265137,17.396000000000001,"2016-01-06T19:03:00","2016-01-06T23:40:00",4.6166666666977108,277,"F","NO",20,"--",347.92,1607.3904,"--","SI",1955.3104000000001]
[null,null,33,297844,4093,"ALTO VALLE ","SALIDA ALIMENT. N° 1 EDERSA",33,17.396000000000001,"2016-01-14T12:10:00","2016-01-14T12:33:00",0.38333333336049691,23,"F","NO",25,"--",434.90000000000003,165.26200000000003,"--","SI",600.16200000000003]
[null,null,34,297845,4829,"ALTO VALLE","SALIDA ALIMENT. N° 2 EDERSA",33,17.396000000000001,"2016-01-14T12:10:00","2016-01-14T12:34:00",0.39999999990686774,24,"F","NO",25,"--",434.90000000000003,173.96000000000004,"--","SI",608.86000000000013]
[null,null,35,297820,4829,"ALTO VALLE","SALIDA ALIMENT. N° 2 EDERSA",33,17.396000000000001,"2016-01-20T09:46:00","2016-01-20T11:18:00",1.5333333332673647,92,"F","NO",25,"--",434.90000000000003,665.39700000000005,"--","SI",1100.297]
[null,null,36,297821,200,"ALTO VALLE ","SALIDA ALIMENT. N° 5 EDERSA",13.199999809265137,17.396000000000001,"2016-01-20T21:54:00","2016-01-20T22:58:00",1.0666666666511446,64,"F","NO",20,"--",347.92,372.27440000000001,"--","SI",720.19440000000009]
[null,null,37,297822,202,"ALTO VALLE","SALIDA ALIMENT. N° 7 EDERSA",13.199999809265137,17.396000000000001,"2016-01-20T22:09:00","2016-01-21T01:55:00",3.7666666665463708,226,"F","NO",20,"--",347.92,1311.6584,"--","SI",1659.5784000000001]
[null,null,38,297825,202,"ALTO VALLE","SALIDA ALIMENT. N° 7 EDERSA",13.199999809265137,17.396000000000001,"2016-01-21T18:12:00","2016-01-21T18:17:00",8.3333333430346102E-2,5,"F","NO",20,"--",347.92,27.833600000000001,"--","SI",375.75360000000001]
[null,null,39,297826,198,"ALTO VALLE ","SALIDA ALIMENT. N° 4 CALF",13.199999809265137,17.396000000000001,"2016-01-21T21:21:00","2016-01-22T00:52:00",3.5166666667792015,211,"F","NO",20,"--",347.92,1224.6784,"--","SI",1572.5984000000001]
[null,null,40,297827,4255,"ALTO VALLE ","SALIDA ALIMENT. N° 6 CALF",13.199999809265137,17.396000000000001,"2016-01-21T21:24:00","2016-01-22T03:16:00",5.8666666665812954,352,"F","NO",20,"--",347.92,2042.2904000000001,"--","SI",2390.2103999999999]
[null,null,41,298501,205,"P.P. BANDERITA","SALIDA ALIMENT. EL CHAÑAR",13.2,17.396000000000001,"2016-01-28T19:53:00","2016-01-28T23:03:00",3.1666666666860692,190,"F","NO",20,"--",347.92,1102.9064000000001,"--","SI",1450.8264000000001]
[null,null,42,298502,206,"P.P. BANDERITA","SALIDA H.C.C.",13.2,17.396000000000001,"2016-01-28T19:40:00","2016-01-29T11:36:00",15.93333333323244,956,"F","NO",20,"--",347.92,5542.3656000000001,"--",{"$f":"IF(F37=\"\",\"\",\"SI\")","v":"SI"},5890.2856000000002]
[null,null,43,298503,204,"P.P. BANDERITA","LINEA P. GRANDE",33,17.396000000000001,"2016-01-28T18:54:00","2016-01-28T19:32:00",0.63333333330228925,38,"F","NO",25,"--",434.90000000000003,273.98700000000002,"--","SI",708.88700000000006]
[null,null,44,298504,4416,"P.P. BANDERITA","SALIDA ALIMENT. EL CHAÑAR",33,17.396000000000001,"2016-01-28T19:40:00","2016-01-28T23:01:00",3.3499999999185093,201,"F","NO",25,"--",434.90000000000003,1456.9150000000002,"--","SI",1891.8150000000003]
[null,null,45,298505,4951,"P.P. BANDERITA","SALIDA ALIMENT. MARI MENUCO",33,{"$f":"IF(OR(H40=132,H40=66),$G$14,IF(H40=33,$G$15,$G$16))","v":17.396000000000001},"2016-01-28T05:18:00","2016-01-28T05:35:00",{"$f":"IF(J40=\"\",\"\",(K40-J40)*24)","v":0.28333333338377997},{"$f":"IF(K40=\"\",\"\",ROUND((K40-J40)*24*60,0))","v":17},"F",{"$f":"IF(N40=\"\",\"\",IF(OR(N40=\"P\",N40=\"RP\"),\"--\",\"NO\"))","v":"NO"},{"$f":"IF(OR(H40=132,H40=66),$H$14,IF(H40=33,$H$15,$H$16))","v":25},{"$f":"IF(N40=\"P\",I40*P40*0.1*ROUND(M40/60,2),\"--\")","v":"--"},{"$f":"IF(O40=\"NO\",IF(N40=\"F\",I40*P40,\"--\"),\"--\")","v":434.90000000000003},{"$f":"IF(N40=\"F\",I40*P40*ROUND(M40/60,2),\"--\")","v":121.77200000000002},{"$f":"IF(N40=\"RF\",I40*P40*ROUND(M40/60,2),\"--\")","v":"--"},{"$f":"IF(F40=\"\",\"\",\"SI\")","v":"SI"},{"$f":"IF(F40=\"\",\"\",IF(H40=\"500/220\",0,IF(U40=\"SI\",SUM(Q40:T40),2*SUM(Q40:T40))))","v":556.67200000000003}]
[]
[null,null,"(²)","P - PROGRAMADA  ; F - FORZADA",null,null,null,null,null,null,null,null,null,null,null,null,null,null,null,null,null,{"$f":"ROUND(SUM(V19:V41),2)","v":30201.49}]

{"sheet":"SA-01 (2)","index":4,"n_rows":42,"n_cols":22,"rows_kept":42,"cut":false,"hidden":false,"merged":[]}
[]
[null,{"$f":"+'TOT-0116'!B2","v":"ANEXO IV  al Memorandum  D.T.E.E.  N° 687/ 2016"}]
[]
[null,null,null,"ENTE NACIONAL REGULADOR "]
[null,null,null,"DE LA ELECTRICIDAD"]
[]
[]
[null,null,null,null,null,"SISTEMA DE TRANSPORTE DE ENERGÍA ELÉCTRICA POR DISTRIBUCIÓN TRONCAL - EPEN"]
[]
[null,null,null,null,null,"2.2.- Salidas"]
[]
[null,{"$f":"+'TOT-0116'!B14","v":"Desde el 01 al 31 de enero de 2016"}]
[]
[null,null,null,null,null,"Salida en 132 kV = ",23.195,{"$f":"50*'TOT-0116'!B13","v":50},null,{"$f":"IF(H14=50,\" \",IF(H14=100,\"  Coeficiente duplicado por tasa de falla >4 Sal. x año/100 km.\",\"REVISAR COEFICIENTE\"))","v":" "}]
[null,null,null,null,null,"Salida en 33 kV =",17.396000000000001,{"$f":"25*'TOT-0116'!B13","v":25},null,{"$f":"IF(H15=25,\" \",IF(H15=50,\"  Coeficiente duplicado por tasa de falla >4 Sal. x año/100 km.\",\"REVISAR COEFICIENTE\"))","v":" "}]
[null,null,null,null,null,"Salida en 13,2 kV =",17.396000000000001,{"$f":"20*'TOT-0116'!B13","v":20},null,{"$f":"IF(H16=20,\" \",IF(H16=40,\"  Coeficiente duplicado por tasa de falla >4 Sal. x año/100 km.\",\"REVISAR COEFICIENTE\"))","v":" "}]
[null,null,3,4,5,6,7,8,9,10,11,12,13,14,15,16,17,18,19,20,21,22]
[null,null,"N°","INDISP","ID EQUIPO","ESTACIÓN \nTRANSFORMADORA","EQUIPO","U\n[kV]","$/h","Salida","Entrada","Hs\nIndisp.","Minutos.\nIndisp.","Tipo \nSal.(²)","AUT.","K (U)","PENALIZ.\nPROGRAM.","PENALIZAC. FORZADA\nPor Salida    Hs. Restantes",null,"RESTANTE\nFORZADA","Informó\nen Térm.","TOTAL\nPENALIZAC."]
[null,null,null,null,null,null,null,null,null,null,null,null,null,null,null,null,null,null,null,null,null,{"$f":"'SA-01 (1)'!V42","v":30201.49}]
[]
[null,null,46,298506,204,"P.P. BANDERITA","LINEA P. GRANDE",33,{"$f":"IF(OR(H21=132,H21=66),$G$14,IF(H21=33,$G$15,$G$16))","v":17.396000000000001},"2016-01-28T19:39:00","2016-01-28T23:01:00",{"$f":"IF(J21=\"\",\"\",(K21-J21)*24)","v":3.3666666666395031},{"$f":"IF(K21=\"\",\"\",ROUND((K21-J21)*24*60,0))","v":202},"F",{"$f":"IF(N21=\"\",\"\",IF(OR(N21=\"P\",N21=\"RP\"),\"--\",\"NO\"))","v":"NO"},{"$f":"IF(OR(H21=132,H21=66),$H$14,IF(H21=33,$H$15,$H$16))","v":25},{"$f":"IF(N21=\"P\",I21*P21*0.1*ROUND(M21/60,2),\"--\")","v":"--"},{"$f":"IF(O21=\"NO\",IF(N21=\"F\",I21*P21,\"--\"),\"--\")","v":434.90000000000003},{"$f":"IF(N21=\"F\",I21*P21*ROUND(M21/60,2),\"--\")","v":1465.6130000000001},{"$f":"IF(N21=\"RF\",I21*P21*ROUND(M21/60,2),\"--\")","v":"--"},{"$f":"IF(F21=\"\",\"\",\"SI\")","v":"SI"},{"$f":"IF(F21=\"\",\"\",IF(H21=\"500/220\",0,IF(U21=\"SI\",SUM(Q21:T21),2*SUM(Q21:T21))))","v":1900.5130000000001}]
[null,null,47,298507,4951,"P.P. BANDERITA","ALIMENT. MARI MENUCO",33,{"$f":"IF(OR(H22=132,H22=66),$G$14,IF(H22=33,$G$15,$G$16))","v":17.396000000000001},"2016-01-28T19:59:00","2016-01-28T23:02:00",3.0499999999883585,183,"F",{"$f":"IF(N22=\"\",\"\",IF(OR(N22=\"P\",N22=\"RP\"),\"--\",\"NO\"))","v":"NO"},25,"--",434.90000000000003,1326.4449999999999,"--","SI",1761.345]
[null,null,48,298508,4416,"P.P. BANDERITA","SALIDA ALIMENT. EL CHAÑAR",33,17.396000000000001,"2016-01-28T23:17:00","2016-01-29T00:13:00",0.93333333340706304,56,"F","NO",25,"--",434.90000000000003,404.45700000000005,"--","SI",839.35700000000008]
[null,null,49,298510,202,"ALTO VALLE","SALIDA ALIMENT. N° 7 EDERSA",13.199999809265137,17.396000000000001,"2016-01-29T11:44:00","2016-01-29T12:41:00",0.94999999995343387,57,"F","NO",20,"--",347.92,330.524,"--","SI",678.44399999999996]
[null,null,50,298511,206,"P.P. BANDERITA","SALIDA H.C.C.",13.2,17.396000000000001,"2016-01-29T14:06:00","2016-01-29T14:23:00",0.28333333338377997,17,"F","NO",20,"--",347.92,97.417600000000007,"--","SI",445.33760000000001]
[null,null,null,null,null,null,null,null,17.396000000000001,null,null,"","",null,"",20,"--","--","--","--","",""]
[null,null,null,null,null,null,null,null,17.396000000000001,null,null,"","",null,"",20,"--","--","--","--","",""]
[null,null,null,null,null,null,null,null,17.396000000000001,null,null,"","",null,"",20,"--","--","--","--","",""]
[null,null,null,null,null,null,null,null,17.396000000000001,null,null,"","",null,"",20,"--","--","--","--","",""]
[null,null,null,null,null,null,null,null,17.396000000000001,null,null,"","",null,"",20,"--","--","--","--","",""]
[null,null,null,null,null,null,null,null,17.396000000000001,null,null,"","",null,"",20,"--","--","--","--","",""]
[null,null,null,null,null,null,null,null,17.396000000000001,null,null,"","",null,"",20,"--","--","--","--","",""]
[null,null,null,null,null,null,null,null,17.396000000000001,null,null,"","",null,"",20,"--","--","--","--","",""]
[null,null,null,null,null,null,null,null,17.396000000000001,null,null,"","",null,"",20,"--","--","--","--","",""]
[null,null,null,null,null,null,null,null,17.396000000000001,null,null,"","",null,"",20,"--","--","--","--","",""]
[null,null,null,null,null,null,null,null,17.396000000000001,null,null,"","",null,"",20,"--","--","--","--","",""]
[null,null,null,null,null,null,null,null,17.396000000000001,null,null,"","",null,"",20,"--","--","--","--","",""]
[null,null,null,null,null,null,null,null,17.396000000000001,null,null,"","",null,"",20,"--","--","--","--","",""]
[null,null,null,null,null,null,null,null,17.396000000000001,null,null,"","",null,"",20,"--","--","--","--","",""]
[null,null,null,null,null,null,null,null,17.396000000000001,null,null,"","",null,"",20,"--","--","--","--","",""]
[]
[null,null,"(²)"," F - FORZADA",null,null,null,null,null,null,null,null,null,null,null,null,null,null,null,null,null,{"$f":"ROUND(SUM(V19:V41),2)","v":35826.49}]

{"sheet":"Tasa de Falla","index":5,"n_rows":45,"n_cols":20,"rows_kept":45,"cut":false,"hidden":false,"merged":[[2,0,2,1]]}
[]
[null,{"$f":"'TOT-0116'!B2","v":"ANEXO IV  al Memorandum  D.T.E.E.  N° 687/ 2016"}]
["ENTE NACIONAL REGULADOR "]
["DE LA ELECTRICIDAD"]
[]
[null,"ENTE PROVINCIAL DE ENERGIA DEL NEUQUEN - EPEN"]
[]
[null," (TRANSPORTISTA POR DISTRIBUCIÓN TRONCAL)"]
[]
[null,"INDISPONIBILIDADES FORZADAS DE LÍNEAS - TASA DE FALLA"]
[]
[]
[null,"Correspondiente al mes de Enero de 2016"]
[]
[null,null,null,"LÍNEAS","U\n[kV[","Long.\n[km]","Tipo",{"$f":"'[1]TASA DE FALLA'!DN15","v":"2015-01-01"},{"$f":"'[1]TASA DE FALLA'!DO15","v":"2015-02-01"},{"$f":"'[1]TASA DE FALLA'!DP15","v":"2015-03-01"},{"$f":"'[1]TASA DE FALLA'!DQ15","v":"2015-04-01"},{"$f":"'[1]TASA DE FALLA'!DR15","v":"2015-05-01"},{"$f":"'[1]TASA DE FALLA'!DS15","v":"2015-06-01"},{"$f":"'[1]TASA DE FALLA'!DT15","v":"2015-07-01"},{"$f":"'[1]TASA DE FALLA'!DU15","v":"2015-08-01"},{"$f":"'[1]TASA DE FALLA'!DV15","v":"2015-09-01"},{"$f":"'[1]TASA DE FALLA'!DW15","v":"2015-10-01"},{"$f":"'[1]TASA DE FALLA'!DX15","v":"2015-11-01"},{"$f":"'[1]TASA DE FALLA'!DY15","v":"2015-12-01"},{"$f":"'[1]TASA DE FALLA'!DZ15","v":"2016-01-01"}]
[]
[]
[]
[null,null,{"$f":"'[1]TASA DE FALLA'!C19","v":1},{"$f":"'[1]TASA DE FALLA'!D19","v":"ARROYITO - CHARROYITO 1"},{"$f":"'[1]TASA DE FALLA'!E19","v":132},{"$f":"'[1]TASA DE FALLA'!F19","v":1},{"$f":"'[1]TASA DE FALLA'!G19","v":"L"},{"$f":"+IF('[1]TASA DE FALLA'!DN19=0,\"\",'[1]TASA DE FALLA'!DN19)","v":""},{"$f":"+IF('[1]TASA DE FALLA'!DO19=0,\"\",'[1]TASA DE FALLA'!DO19)","v":""},{"$f":"+IF('[1]TASA DE FALLA'!DP19=0,\"\",'[1]TASA DE FALLA'!DP19)","v":""},{"$f":"+IF('[1]TASA DE FALLA'!DQ19=0,\"\",'[1]TASA DE FALLA'!DQ19)","v":""},{"$f":"+IF('[1]TASA DE FALLA'!DR19=0,\"\",'[1]TASA DE FALLA'!DR19)","v":""},{"$f":"+IF('[1]TASA DE FALLA'!DS19=0,\"\",'[1]TASA DE FALLA'!DS19)","v":""},{"$f":"+IF('[1]TASA DE FALLA'!DT19=0,\"\",'[1]TASA DE FALLA'!DT19)","v":""},{"$f":"+IF('[1]TASA DE FALLA'!DU19=0,\"\",'[1]TASA DE FALLA'!DU19)","v":""},{"$f":"+IF('[1]TASA DE FALLA'!DV19=0,\"\",'[1]TASA DE FALLA'!DV19)","v":""},{"$f":"+IF('[1]TASA DE FALLA'!DW19=0,\"\",'[1]TASA DE FALLA'!DW19)","v":""},{"$f":"+IF('[1]TASA DE FALLA'!DX19=0,\"\",'[1]TASA DE FALLA'!DX19)","v":""},{"$f":"+IF('[1]TASA DE FALLA'!DY19=0,\"\",'[1]TASA DE FALLA'!DY19)","v":""}]
[null,null,{"$f":"'[1]TASA DE FALLA'!C20","v":2},{"$f":"'[1]TASA DE FALLA'!D20","v":"ARROYITO - CHARROYITO 2"},{"$f":"'[1]TASA DE FALLA'!E20","v":132},{"$f":"'[1]TASA DE FALLA'!F20","v":1},{"$f":"'[1]TASA DE FALLA'!G20","v":"L"},{"$f":"+IF('[1]TASA DE FALLA'!DN20=0,\"\",'[1]TASA DE FALLA'!DN20)","v":""},{"$f":"+IF('[1]TASA DE FALLA'!DO20=0,\"\",'[1]TASA DE FALLA'!DO20)","v":""},{"$f":"+IF('[1]TASA DE FALLA'!DP20=0,\"\",'[1]TASA DE FALLA'!DP20)","v":""},{"$f":"+IF('[1]TASA DE FALLA'!DQ20=0,\"\",'[1]TASA DE FALLA'!DQ20)","v":""},{"$f":"+IF('[1]TASA DE FALLA'!DR20=0,\"\",'[1]TASA DE FALLA'!DR20)","v":""},{"$f":"+IF('[1]TASA DE FALLA'!DS20=0,\"\",'[1]TASA DE FALLA'!DS20)","v":""},{"$f":"+IF('[1]TASA DE FALLA'!DT20=0,\"\",'[1]TASA DE FALLA'!DT20)","v":""},{"$f":"+IF('[1]TASA DE FALLA'!DU20=0,\"\",'[1]TASA DE FALLA'!DU20)","v":""},{"$f":"+IF('[1]TASA DE FALLA'!DV20=0,\"\",'[1]TASA DE FALLA'!DV20)","v":""},{"$f":"+IF('[1]TASA DE FALLA'!DW20=0,\"\",'[1]TASA DE FALLA'!DW20)","v":""},{"$f":"+IF('[1]TASA DE FALLA'!DX20=0,\"\",'[1]TASA DE FALLA'!DX20)","v":""},{"$f":"+IF('[1]TASA DE FALLA'!DY20=0,\"\",'[1]TASA DE FALLA'!DY20)","v":""}]
[null,null,{"$f":"'[1]TASA DE FALLA'!C21","v":3},{"$f":"'[1]TASA DE FALLA'!D21","v":"ARROYITO - CHARROYITO 3"},{"$f":"'[1]TASA DE FALLA'!E21","v":132},{"$f":"'[1]TASA DE FALLA'!F21","v":1},{"$f":"'[1]TASA DE FALLA'!G21","v":"L"},{"$f":"+IF('[1]TASA DE FALLA'!DN21=0,\"\",'[1]TASA DE FALLA'!DN21)","v":""},{"$f":"+IF('[1]TASA DE FALLA'!DO21=0,\"\",'[1]TASA DE FALLA'!DO21)","v":""},{"$f":"+IF('[1]TASA DE FALLA'!DP21=0,\"\",'[1]TASA DE FALLA'!DP21)","v":""},{"$f":"+IF('[1]TASA DE FALLA'!DQ21=0,\"\",'[1]TASA DE FALLA'!DQ21)","v":""},{"$f":"+IF('[1]TASA DE FALLA'!DR21=0,\"\",'[1]TASA DE FALLA'!DR21)","v":""},{"$f":"+IF('[1]TASA DE FALLA'!DS21=0,\"\",'[1]TASA DE FALLA'!DS21)","v":""},{"$f":"+IF('[1]TASA DE FALLA'!DT21=0,\"\",'[1]TASA DE FALLA'!DT21)","v":""},{"$f":"+IF('[1]TASA DE FALLA'!DU21=0,\"\",'[1]TASA DE FALLA'!DU21)","v":""},{"$f":"+IF('[1]TASA DE FALLA'!DV21=0,\"\",'[1]TASA DE FALLA'!DV21)","v":1},{"$f":"+IF('[1]TASA DE FALLA'!DW21=0,\"\",'[1]TASA DE FALLA'!DW21)","v":""},{"$f":"+IF('[1]TASA DE FALLA'!DX21=0,\"\",'[1]TASA DE FALLA'!DX21)","v":""},{"$f":"+IF('[1]TASA DE FALLA'!DY21=0,\"\",'[1]TASA DE FALLA'!DY21)","v":""}]
[null,null,{"$f":"'[1]TASA DE FALLA'!C22","v":4},{"$f":"'[1]TASA DE FALLA'!D22","v":"ARROYITO - CHOCON 1"},{"$f":"'[1]TASA DE FALLA'!E22","v":132},{"$f":"'[1]TASA DE FALLA'!F22","v":25},{"$f":"'[1]TASA DE FALLA'!G22","v":"L"},{"$f":"+IF('[1]TASA DE FALLA'!DN22=0,\"\",'[1]TASA DE FALLA'!DN22)","v":1},{"$f":"+IF('[1]TASA DE FALLA'!DO22=0,\"\",'[1]TASA DE FALLA'!DO22)","v":""},{"$f":"+IF('[1]TASA DE FALLA'!DP22=0,\"\",'[1]TASA DE FALLA'!DP22)","v":""},{"$f":"+IF('[1]TASA DE FALLA'!DQ22=0,\"\",'[1]TASA DE FALLA'!DQ22)","v":""},{"$f":"+IF('[1]TASA DE FALLA'!DR22=0,\"\",'[1]TASA DE FALLA'!DR22)","v":""},{"$f":"+IF('[1]TASA DE FALLA'!DS22=0,\"\",'[1]TASA DE FALLA'!DS22)","v":""},{"$f":"+IF('[1]TASA DE FALLA'!DT22=0,\"\",'[1]TASA DE FALLA'!DT22)","v":""},{"$f":"+IF('[1]TASA DE FALLA'!DU22=0,\"\",'[1]TASA DE FALLA'!DU22)","v":""},{"$f":"+IF('[1]TASA DE FALLA'!DV22=0,\"\",'[1]TASA DE FALLA'!DV22)","v":""},{"$f":"+IF('[1]TASA DE FALLA'!DW22=0,\"\",'[1]TASA DE FALLA'!DW22)","v":""},{"$f":"+IF('[1]TASA DE FALLA'!DX22=0,\"\",'[1]TASA DE FALLA'!DX22)","v":""},{"$f":"+IF('[1]TASA DE FALLA'!DY22=0,\"\",'[1]TASA DE FALLA'!DY22)","v":""}]
[null,null,{"$f":"'[1]TASA DE FALLA'!C23","v":5},{"$f":"'[1]TASA DE FALLA'!D23","v":"ARROYITO - CHOCON 2"},{"$f":"'[1]TASA DE FALLA'!E23","v":132},{"$f":"'[1]TASA DE FALLA'!F23","v":25},{"$f":"'[1]TASA DE FALLA'!G23","v":"L"},{"$f":"+IF('[1]TASA DE FALLA'!DN23=0,\"\",'[1]TASA DE FALLA'!DN23)","v":""},{"$f":"+IF('[1]TASA DE FALLA'!DO23=0,\"\",'[1]TASA DE FALLA'!DO23)","v":""},{"$f":"+IF('[1]TASA DE FALLA'!DP23=0,\"\",'[1]TASA DE FALLA'!DP23)","v":""},{"$f":"+IF('[1]TASA DE FALLA'!DQ23=0,\"\",'[1]TASA DE FALLA'!DQ23)","v":""},{"$f":"+IF('[1]TASA DE FALLA'!DR23=0,\"\",'[1]TASA DE FALLA'!DR23)","v":""},{"$f":"+IF('[1]TASA DE FALLA'!DS23=0,\"\",'[1]TASA DE FALLA'!DS23)","v":""},{"$f":"+IF('[1]TASA DE FALLA'!DT23=0,\"\",'[1]TASA DE FALLA'!DT23)","v":""},{"$f":"+IF('[1]TASA DE FALLA'!DU23=0,\"\",'[1]TASA DE FALLA'!DU23)","v":""},{"$f":"+IF('[1]TASA DE FALLA'!DV23=0,\"\",'[1]TASA DE FALLA'!DV23)","v":""},{"$f":"+IF('[1]TASA DE FALLA'!DW23=0,\"\",'[1]TASA DE FALLA'!DW23)","v":""},{"$f":"+IF('[1]TASA DE FALLA'!DX23=0,\"\",'[1]TASA DE FALLA'!DX23)","v":""},{"$f":"+IF('[1]TASA DE FALLA'!DY23=0,\"\",'[1]TASA DE FALLA'!DY23)","v":""}]
[null,null,{"$f":"'[1]TASA DE FALLA'!C24","v":6},{"$f":"'[1]TASA DE FALLA'!D24","v":"ARROYITO - PIAP 1"},{"$f":"'[1]TASA DE FALLA'!E24","v":132},{"$f":"'[1]TASA DE FALLA'!F24","v":2},{"$f":"'[1]TASA DE FALLA'!G24","v":"L"},{"$f":"+IF('[1]TASA DE FALLA'!DN24=0,\"\",'[1]TASA DE FALLA'!DN24)","v":""},{"$f":"+IF('[1]TASA DE FALLA'!DO24=0,\"\",'[1]TASA DE FALLA'!DO24)","v":""},{"$f":"+IF('[1]TASA DE FALLA'!DP24=0,\"\",'[1]TASA DE FALLA'!DP24)","v":""},{"$f":"+IF('[1]TASA DE FALLA'!DQ24=0,\"\",'[1]TASA DE FALLA'!DQ24)","v":""},{"$f":"+IF('[1]TASA DE FALLA'!DR24=0,\"\",'[1]TASA DE FALLA'!DR24)","v":""},{"$f":"+IF('[1]TASA DE FALLA'!DS24=0,\"\",'[1]TASA DE FALLA'!DS24)","v":""},{"$f":"+IF('[1]TASA DE FALLA'!DT24=0,\"\",'[1]TASA DE FALLA'!DT24)","v":""},{"$f":"+IF('[1]TASA DE FALLA'!DU24=0,\"\",'[1]TASA DE FALLA'!DU24)","v":""},{"$f":"+IF('[1]TASA DE FALLA'!DV24=0,\"\",'[1]TASA DE FALLA'!DV24)","v":""},{"$f":"+IF('[1]TASA DE FALLA'!DW24=0,\"\",'[1]TASA DE FALLA'!DW24)","v":""},{"$f":"+IF('[1]TASA DE FALLA'!DX24=0,\"\",'[1]TASA DE FALLA'!DX24)","v":""},{"$f":"+IF('[1]TASA DE FALLA'!DY24=0,\"\",'[1]TASA DE FALLA'!DY24)","v":""}]
[null,null,{"$f":"'[1]TASA DE FALLA'!C25","v":7},{"$f":"'[1]TASA DE FALLA'!D25","v":"ARROYITO - PIAP 2"},{"$f":"'[1]TASA DE FALLA'!E25","v":132},{"$f":"'[1]TASA DE FALLA'!F25","v":2},{"$f":"'[1]TASA DE FALLA'!G25","v":"L"},{"$f":"+IF('[1]TASA DE FALLA'!DN25=0,\"\",'[1]TASA DE FALLA'!DN25)","v":""},{"$f":"+IF('[1]TASA DE FALLA'!DO25=0,\"\",'[1]TASA DE FALLA'!DO25)","v":""},{"$f":"+IF('[1]TASA DE FALLA'!DP25=0,\"\",'[1]TASA DE FALLA'!DP25)","v":""},{"$f":"+IF('[1]TASA DE FALLA'!DQ25=0,\"\",'[1]TASA DE FALLA'!DQ25)","v":""},{"$f":"+IF('[1]TASA DE FALLA'!DR25=0,\"\",'[1]TASA DE FALLA'!DR25)","v":""},{"$f":"+IF('[1]TASA DE FALLA'!DS25=0,\"\",'[1]TASA DE FALLA'!DS25)","v":""},{"$f":"+IF('[1]TASA DE FALLA'!DT25=0,\"\",'[1]TASA DE FALLA'!DT25)","v":""},{"$f":"+IF('[1]TASA DE FALLA'!DU25=0,\"\",'[1]TASA DE FALLA'!DU25)","v":""},{"$f":"+IF('[1]TASA DE FALLA'!DV25=0,\"\",'[1]TASA DE FALLA'!DV25)","v":""},{"$f":"+IF('[1]TASA DE FALLA'!DW25=0,\"\",'[1]TASA DE FALLA'!DW25)","v":""},{"$f":"+IF('[1]TASA DE FALLA'!DX25=0,\"\",'[1]TASA DE FALLA'!DX25)","v":""},{"$f":"+IF('[1]TASA DE FALLA'!DY25=0,\"\",'[1]TASA DE FALLA'!DY25)","v":""}]
[null,null,{"$f":"'[1]TASA DE FALLA'!C26","v":8},{"$f":"'[1]TASA DE FALLA'!D26","v":"ALTO VALLE - CENTENARIO"},{"$f":"'[1]TASA DE FALLA'!E26","v":132},{"$f":"'[1]TASA DE FALLA'!F26","v":17},{"$f":"'[1]TASA DE FALLA'!G26","v":"L"},{"$f":"+IF('[1]TASA DE FALLA'!DN26=0,\"\",'[1]TASA DE FALLA'!DN26)","v":""},{"$f":"+IF('[1]TASA DE FALLA'!DO26=0,\"\",'[1]TASA DE FALLA'!DO26)","v":""},{"$f":"+IF('[1]TASA DE FALLA'!DP26=0,\"\",'[1]TASA DE FALLA'!DP26)","v":""},{"$f":"+IF('[1]TASA DE FALLA'!DQ26=0,\"\",'[1]TASA DE FALLA'!DQ26)","v":""},{"$f":"+IF('[1]TASA DE FALLA'!DR26=0,\"\",'[1]TASA DE FALLA'!DR26)","v":""},{"$f":"+IF('[1]TASA DE FALLA'!DS26=0,\"\",'[1]TASA DE FALLA'!DS26)","v":""},{"$f":"+IF('[1]TASA DE FALLA'!DT26=0,\"\",'[1]TASA DE FALLA'!DT26)","v":""},{"$f":"+IF('[1]TASA DE FALLA'!DU26=0,\"\",'[1]TASA DE FALLA'!DU26)","v":1},{"$f":"+IF('[1]TASA DE FALLA'!DV26=0,\"\",'[1]TASA DE FALLA'!DV26)","v":""},{"$f":"+IF('[1]TASA DE FALLA'!DW26=0,\"\",'[1]TASA DE FALLA'!DW26)","v":""},{"$f":"+IF('[1]TASA DE FALLA'!DX26=0,\"\",'[1]TASA DE FALLA'!DX26)","v":""},{"$f":"+IF('[1]TASA DE FALLA'!DY26=0,\"\",'[1]TASA DE FALLA'!DY26)","v":""}]
[null,null,{"$f":"'[1]TASA DE FALLA'!C27","v":10},{"$f":"'[1]TASA DE FALLA'!D27","v":"ALTO VALLE - COLONIA VALENTINA - ARROYITO"},{"$f":"'[1]TASA DE FALLA'!E27","v":132},{"$f":"'[1]TASA DE FALLA'!F27","v":58.9},{"$f":"'[1]TASA DE FALLA'!G27","v":"L"},{"$f":"+IF('[1]TASA DE FALLA'!DN27=0,\"\",'[1]TASA DE FALLA'!DN27)","v":""},{"$f":"+IF('[1]TASA DE FALLA'!DO27=0,\"\",'[1]TASA DE FALLA'!DO27)","v":""},{"$f":"+IF('[1]TASA DE FALLA'!DP27=0,\"\",'[1]TASA DE FALLA'!DP27)","v":""},{"$f":"+IF('[1]TASA DE FALLA'!DQ27=0,\"\",'[1]TASA DE FALLA'!DQ27)","v":""},{"$f":"+IF('[1]TASA DE FALLA'!DR27=0,\"\",'[1]TASA DE FALLA'!DR27)","v":""},{"$f":"+IF('[1]TASA DE FALLA'!DS27=0,\"\",'[1]TASA DE FALLA'!DS27)","v":""},{"$f":"+IF('[1]TASA DE FALLA'!DT27=0,\"\",'[1]TASA DE FALLA'!DT27)","v":""},{"$f":"+IF('[1]TASA DE FALLA'!DU27=0,\"\",'[1]TASA DE FALLA'!DU27)","v":""},{"$f":"+IF('[1]TASA DE FALLA'!DV27=0,\"\",'[1]TASA DE FALLA'!DV27)","v":""},{"$f":"+IF('[1]TASA DE FALLA'!DW27=0,\"\",'[1]TASA DE FALLA'!DW27)","v":""},{"$f":"+IF('[1]TASA DE FALLA'!DX27=0,\"\",'[1]TASA DE FALLA'!DX27)","v":""},{"$f":"+IF('[1]TASA DE FALLA'!DY27=0,\"\",'[1]TASA DE FALLA'!DY27)","v":""}]
[null,null,{"$f":"'[1]TASA DE FALLA'!C28","v":11},{"$f":"'[1]TASA DE FALLA'!D28","v":"CHOCON OESTE - CHOCON"},{"$f":"'[1]TASA DE FALLA'!E28","v":132},{"$f":"'[1]TASA DE FALLA'!F28","v":3.5},{"$f":"'[1]TASA DE FALLA'!G28","v":"L"},{"$f":"+IF('[1]TASA DE FALLA'!DN28=0,\"\",'[1]TASA DE FALLA'!DN28)","v":""},{"$f":"+IF('[1]TASA DE FALLA'!DO28=0,\"\",'[1]TASA DE FALLA'!DO28)","v":""},{"$f":"+IF('[1]TASA DE FALLA'!DP28=0,\"\",'[1]TASA DE FALLA'!DP28)","v":""},{"$f":"+IF('[1]TASA DE FALLA'!DQ28=0,\"\",'[1]TASA DE FALLA'!DQ28)","v":""},{"$f":"+IF('[1]TASA DE FALLA'!DR28=0,\"\",'[1]TASA DE FALLA'!DR28)","v":""},{"$f":"+IF('[1]TASA DE FALLA'!DS28=0,\"\",'[1]TASA DE FALLA'!DS28)","v":""},{"$f":"+IF('[1]TASA DE FALLA'!DT28=0,\"\",'[1]TASA DE FALLA'!DT28)","v":""},{"$f":"+IF('[1]TASA DE FALLA'!DU28=0,\"\",'[1]TASA DE FALLA'!DU28)","v":""},{"$f":"+IF('[1]TASA DE FALLA'!DV28=0,\"\",'[1]TASA DE FALLA'!DV28)","v":""},{"$f":"+IF('[1]TASA DE FALLA'!DW28=0,\"\",'[1]TASA DE FALLA'!DW28)","v":""},{"$f":"+IF('[1]TASA DE FALLA'!DX28=0,\"\",'[1]TASA DE FALLA'!DX28)","v":""},{"$f":"+IF('[1]TASA DE FALLA'!DY28=0,\"\",'[1]TASA DE FALLA'!DY28)","v":""}]
[null,null,{"$f":"'[1]TASA DE FALLA'!C29","v":18},{"$f":"'[1]TASA DE FALLA'!D29","v":"MEDANITOS - PTO. SECCIONAMIENTO"},{"$f":"'[1]TASA DE FALLA'!E29","v":132},{"$f":"'[1]TASA DE FALLA'!F29","v":41},{"$f":"'[1]TASA DE FALLA'!G29","v":"L"},{"$f":"+IF('[1]TASA DE FALLA'!DN29=0,\"\",'[1]TASA DE FALLA'!DN29)","v":""},{"$f":"+IF('[1]TASA DE FALLA'!DO29=0,\"\",'[1]TASA DE FALLA'!DO29)","v":""},{"$f":"+IF('[1]TASA DE FALLA'!DP29=0,\"\",'[1]TASA DE FALLA'!DP29)","v":""},{"$f":"+IF('[1]TASA DE FALLA'!DQ29=0,\"\",'[1]TASA DE FALLA'!DQ29)","v":""},{"$f":"+IF('[1]TASA DE FALLA'!DR29=0,\"\",'[1]TASA DE FALLA'!DR29)","v":""},{"$f":"+IF('[1]TASA DE FALLA'!DS29=0,\"\",'[1]TASA DE FALLA'!DS29)","v":""},{"$f":"+IF('[1]TASA DE FALLA'!DT29=0,\"\",'[1]TASA DE FALLA'!DT29)","v":""},{"$f":"+IF('[1]TASA DE FALLA'!DU29=0,\"\",'[1]TASA DE FALLA'!DU29)","v":""},{"$f":"+IF('[1]TASA DE FALLA'!DV29=0,\"\",'[1]TASA DE FALLA'!DV29)","v":""},{"$f":"+IF('[1]TASA DE FALLA'!DW29=0,\"\",'[1]TASA DE FALLA'!DW29)","v":""},{"$f":"+IF('[1]TASA DE FALLA'!DX29=0,\"\",'[1]TASA DE FALLA'!DX29)","v":""},{"$f":"+IF('[1]TASA DE FALLA'!DY29=0,\"\",'[1]TASA DE FALLA'!DY29)","v":1}]
[null,null,{"$f":"'[1]TASA DE FALLA'!C30","v":19},{"$f":"'[1]TASA DE FALLA'!D30","v":"PIEDRA DEL AGUILA - EL CHOCON"},{"$f":"'[1]TASA DE FALLA'!E30","v":132},{"$f":"'[1]TASA DE FALLA'!F30","v":170},{"$f":"'[1]TASA DE FALLA'!G30","v":"L"},{"$f":"+IF('[1]TASA DE FALLA'!DN30=0,\"\",'[1]TASA DE FALLA'!DN30)","v":""},{"$f":"+IF('[1]TASA DE FALLA'!DO30=0,\"\",'[1]TASA DE FALLA'!DO30)","v":""},{"$f":"+IF('[1]TASA DE FALLA'!DP30=0,\"\",'[1]TASA DE FALLA'!DP30)","v":""},{"$f":"+IF('[1]TASA DE FALLA'!DQ30=0,\"\",'[1]TASA DE FALLA'!DQ30)","v":""},{"$f":"+IF('[1]TASA DE FALLA'!DR30=0,\"\",'[1]TASA DE FALLA'!DR30)","v":""},{"$f":"+IF('[1]TASA DE FALLA'!DS30=0,\"\",'[1]TASA DE FALLA'!DS30)","v":""},{"$f":"+IF('[1]TASA DE FALLA'!DT30=0,\"\",'[1]TASA DE FALLA'!DT30)","v":""},{"$f":"+IF('[1]TASA DE FALLA'!DU30=0,\"\",'[1]TASA DE FALLA'!DU30)","v":""},{"$f":"+IF('[1]TASA DE FALLA'!DV30=0,\"\",'[1]TASA DE FALLA'!DV30)","v":""},{"$f":"+IF('[1]TASA DE FALLA'!DW30=0,\"\",'[1]TASA DE FALLA'!DW30)","v":""},{"$f":"+IF('[1]TASA DE FALLA'!DX30=0,\"\",'[1]TASA DE FALLA'!DX30)","v":""},{"$f":"+IF('[1]TASA DE FALLA'!DY30=0,\"\",'[1]TASA DE FALLA'!DY30)","v":""}]
[null,null,{"$f":"'[1]TASA DE FALLA'!C31","v":20},{"$f":"'[1]TASA DE FALLA'!D31","v":"PLAYA PLANICIE BANDERITA - PCIE. BANDERITA"},{"$f":"'[1]TASA DE FALLA'!E31","v":132},{"$f":"'[1]TASA DE FALLA'!F31","v":1.5},{"$f":"'[1]TASA DE FALLA'!G31","v":"L"},{"$f":"+IF('[1]TASA DE FALLA'!DN31=0,\"\",'[1]TASA DE FALLA'!DN31)","v":""},{"$f":"+IF('[1]TASA DE FALLA'!DO31=0,\"\",'[1]TASA DE FALLA'!DO31)","v":""},{"$f":"+IF('[1]TASA DE FALLA'!DP31=0,\"\",'[1]TASA DE FALLA'!DP31)","v":""},{"$f":"+IF('[1]TASA DE FALLA'!DQ31=0,\"\",'[1]TASA DE FALLA'!DQ31)","v":""},{"$f":"+IF('[1]TASA DE FALLA'!DR31=0,\"\",'[1]TASA DE FALLA'!DR31)","v":""},{"$f":"+IF('[1]TASA DE FALLA'!DS31=0,\"\",'[1]TASA DE FALLA'!DS31)","v":""},{"$f":"+IF('[1]TASA DE FALLA'!DT31=0,\"\",'[1]TASA DE FALLA'!DT31)","v":""},{"$f":"+IF('[1]TASA DE FALLA'!DU31=0,\"\",'[1]TASA DE FALLA'!DU31)","v":""},{"$f":"+IF('[1]TASA DE FALLA'!DV31=0,\"\",'[1]TASA DE FALLA'!DV31)","v":""},{"$f":"+IF('[1]TASA DE FALLA'!DW31=0,\"\",'[1]TASA DE FALLA'!DW31)","v":""},{"$f":"+IF('[1]TASA DE FALLA'!DX31=0,\"\",'[1]TASA DE FALLA'!DX31)","v":""},{"$f":"+IF('[1]TASA DE FALLA'!DY31=0,\"\",'[1]TASA DE FALLA'!DY31)","v":""}]
[null,null,{"$f":"'[1]TASA DE FALLA'!C32","v":21},{"$f":"'[1]TASA DE FALLA'!D32","v":"PTO. SECCIONAMIENTO - PTO. HERNANDEZ"},{"$f":"'[1]TASA DE FALLA'!E32","v":132},{"$f":"'[1]TASA DE FALLA'!F32","v":89},{"$f":"'[1]TASA DE FALLA'!G32","v":"L"},{"$f":"+IF('[1]TASA DE FALLA'!DN32=0,\"\",'[1]TASA DE FALLA'!DN32)","v":"XXXX"},{"$f":"+IF('[1]TASA DE FALLA'!DO32=0,\"\",'[1]TASA DE FALLA'!DO32)","v":"XXXX"},{"$f":"+IF('[1]TASA DE FALLA'!DP32=0,\"\",'[1]TASA DE FALLA'!DP32)","v":"XXXX"},{"$f":"+IF('[1]TASA DE FALLA'!DQ32=0,\"\",'[1]TASA DE FALLA'!DQ32)","v":"XXXX"},{"$f":"+IF('[1]TASA DE FALLA'!DR32=0,\"\",'[1]TASA DE FALLA'!DR32)","v":"XXXX"},{"$f":"+IF('[1]TASA DE FALLA'!DS32=0,\"\",'[1]TASA DE FALLA'!DS32)","v":"XXXX"},{"$f":"+IF('[1]TASA DE FALLA'!DT32=0,\"\",'[1]TASA DE FALLA'!DT32)","v":"XXXX"},{"$f":"+IF('[1]TASA DE FALLA'!DU32=0,\"\",'[1]TASA DE FALLA'!DU32)","v":"XXXX"},{"$f":"+IF('[1]TASA DE FALLA'!DV32=0,\"\",'[1]TASA DE FALLA'!DV32)","v":"XXXX"},{"$f":"+IF('[1]TASA DE FALLA'!DW32=0,\"\",'[1]TASA DE FALLA'!DW32)","v":"XXXX"},{"$f":"+IF('[1]TASA DE FALLA'!DX32=0,\"\",'[1]TASA DE FALLA'!DX32)","v":"XXXX"},{"$f":"+IF('[1]TASA DE FALLA'!DY32=0,\"\",'[1]TASA DE FALLA'!DY32)","v":"XXXX"}]
[null,null,{"$f":"'[1]TASA DE FALLA'!C33","v":22},{"$f":"'[1]TASA DE FALLA'!D33","v":"PTO. SECCIONAMIENTO - SEÑAL PICADA"},{"$f":"'[1]TASA DE FALLA'!E33","v":132},{"$f":"'[1]TASA DE FALLA'!F33","v":18},{"$f":"'[1]TASA DE FALLA'!G33","v":"L"},{"$f":"+IF('[1]TASA DE FALLA'!DN33=0,\"\",'[1]TASA DE FALLA'!DN33)","v":""},{"$f":"+IF('[1]TASA DE FALLA'!DO33=0,\"\",'[1]TASA DE FALLA'!DO33)","v":""},{"$f":"+IF('[1]TASA DE FALLA'!DP33=0,\"\",'[1]TASA DE FALLA'!DP33)","v":""},{"$f":"+IF('[1]TASA DE FALLA'!DQ33=0,\"\",'[1]TASA DE FALLA'!DQ33)","v":""},{"$f":"+IF('[1]TASA DE FALLA'!DR33=0,\"\",'[1]TASA DE FALLA'!DR33)","v":""},{"$f":"+IF('[1]TASA DE FALLA'!DS33=0,\"\",'[1]TASA DE FALLA'!DS33)","v":""},{"$f":"+IF('[1]TASA DE FALLA'!DT33=0,\"\",'[1]TASA DE FALLA'!DT33)","v":""},{"$f":"+IF('[1]TASA DE FALLA'!DU33=0,\"\",'[1]TASA DE FALLA'!DU33)","v":""},{"$f":"+IF('[1]TASA DE FALLA'!DV33=0,\"\",'[1]TASA DE FALLA'!DV33)","v":""},{"$f":"+IF('[1]TASA DE FALLA'!DW33=0,\"\",'[1]TASA DE FALLA'!DW33)","v":""},{"$f":"+IF('[1]TASA DE FALLA'!DX33=0,\"\",'[1]TASA DE FALLA'!DX33)","v":""},{"$f":"+IF('[1]TASA DE FALLA'!DY33=0,\"\",'[1]TASA DE FALLA'!DY33)","v":""}]
[null,null,{"$f":"'[1]TASA DE FALLA'!C34","v":29},{"$f":"'[1]TASA DE FALLA'!D34","v":"PUESTO HERNANDEZ - CHIUHIDO II"},{"$f":"'[1]TASA DE FALLA'!E34","v":132},{"$f":"'[1]TASA DE FALLA'!F34","v":19.5},{"$f":"'[1]TASA DE FALLA'!G34","v":"L"},{"$f":"+IF('[1]TASA DE FALLA'!DN34=0,\"\",'[1]TASA DE FALLA'!DN34)","v":""},{"$f":"+IF('[1]TASA DE FALLA'!DO34=0,\"\",'[1]TASA DE FALLA'!DO34)","v":""},{"$f":"+IF('[1]TASA DE FALLA'!DP34=0,\"\",'[1]TASA DE FALLA'!DP34)","v":""},{"$f":"+IF('[1]TASA DE FALLA'!DQ34=0,\"\",'[1]TASA DE FALLA'!DQ34)","v":""},{"$f":"+IF('[1]TASA DE FALLA'!DR34=0,\"\",'[1]TASA DE FALLA'!DR34)","v":""},{"$f":"+IF('[1]TASA DE FALLA'!DS34=0,\"\",'[1]TASA DE FALLA'!DS34)","v":""},{"$f":"+IF('[1]TASA DE FALLA'!DT34=0,\"\",'[1]TASA DE FALLA'!DT34)","v":""},{"$f":"+IF('[1]TASA DE FALLA'!DU34=0,\"\",'[1]TASA DE FALLA'!DU34)","v":""},{"$f":"+IF('[1]TASA DE FALLA'!DV34=0,\"\",'[1]TASA DE FALLA'!DV34)","v":""},{"$f":"+IF('[1]TASA DE FALLA'!DW34=0,\"\",'[1]TASA DE FALLA'!DW34)","v":""},{"$f":"+IF('[1]TASA DE FALLA'!DX34=0,\"\",'[1]TASA DE FALLA'!DX34)","v":""},{"$f":"+IF('[1]TASA DE FALLA'!DY34=0,\"\",'[1]TASA DE FALLA'!DY34)","v":""}]
[null,null,{"$f":"'[1]TASA DE FALLA'!C35","v":30},{"$f":"'[1]TASA DE FALLA'!D35","v":"CHIUHIDO II - EL TRAPIAL"},{"$f":"'[1]TASA DE FALLA'!E35","v":132},{"$f":"'[1]TASA DE FALLA'!F35","v":4.9000000000000004},{"$f":"'[1]TASA DE FALLA'!G35","v":"L"},{"$f":"+IF('[1]TASA DE FALLA'!DN35=0,\"\",'[1]TASA DE FALLA'!DN35)","v":""},{"$f":"+IF('[1]TASA DE FALLA'!DO35=0,\"\",'[1]TASA DE FALLA'!DO35)","v":""},{"$f":"+IF('[1]TASA DE FALLA'!DP35=0,\"\",'[1]TASA DE FALLA'!DP35)","v":""},{"$f":"+IF('[1]TASA DE FALLA'!DQ35=0,\"\",'[1]TASA DE FALLA'!DQ35)","v":""},{"$f":"+IF('[1]TASA DE FALLA'!DR35=0,\"\",'[1]TASA DE FALLA'!DR35)","v":""},{"$f":"+IF('[1]TASA DE FALLA'!DS35=0,\"\",'[1]TASA DE FALLA'!DS35)","v":""},{"$f":"+IF('[1]TASA DE FALLA'!DT35=0,\"\",'[1]TASA DE FALLA'!DT35)","v":""},{"$f":"+IF('[1]TASA DE FALLA'!DU35=0,\"\",'[1]TASA DE FALLA'!DU35)","v":""},{"$f":"+IF('[1]TASA DE FALLA'!DV35=0,\"\",'[1]TASA DE FALLA'!DV35)","v":""},{"$f":"+IF('[1]TASA DE FALLA'!DW35=0,\"\",'[1]TASA DE FALLA'!DW35)","v":""},{"$f":"+IF('[1]TASA DE FALLA'!DX35=0,\"\",'[1]TASA DE FALLA'!DX35)","v":""},{"$f":"+IF('[1]TASA DE FALLA'!DY35=0,\"\",'[1]TASA DE FALLA'!DY35)","v":""}]
[null,null,{"$f":"'[1]TASA DE FALLA'!C36","v":31},{"$f":"'[1]TASA DE FALLA'!D36","v":"EL TRAPIAL - LOMA DE LA LATA 1"},{"$f":"'[1]TASA DE FALLA'!E36","v":132},{"$f":"'[1]TASA DE FALLA'!F36","v":142},{"$f":"'[1]TASA DE FALLA'!G36","v":"L"},{"$f":"+IF('[1]TASA DE FALLA'!DN36=0,\"\",'[1]TASA DE FALLA'!DN36)","v":""},{"$f":"+IF('[1]TASA DE FALLA'!DO36=0,\"\",'[1]TASA DE FALLA'!DO36)","v":""},{"$f":"+IF('[1]TASA DE FALLA'!DP36=0,\"\",'[1]TASA DE FALLA'!DP36)","v":""},{"$f":"+IF('[1]TASA DE FALLA'!DQ36=0,\"\",'[1]TASA DE FALLA'!DQ36)","v":""},{"$f":"+IF('[1]TASA DE FALLA'!DR36=0,\"\",'[1]TASA DE FALLA'!DR36)","v":""},{"$f":"+IF('[1]TASA DE FALLA'!DS36=0,\"\",'[1]TASA DE FALLA'!DS36)","v":""},{"$f":"+IF('[1]TASA DE FALLA'!DT36=0,\"\",'[1]TASA DE FALLA'!DT36)","v":""},{"$f":"+IF('[1]TASA DE FALLA'!DU36=0,\"\",'[1]TASA DE FALLA'!DU36)","v":""},{"$f":"+IF('[1]TASA DE FALLA'!DV36=0,\"\",'[1]TASA DE FALLA'!DV36)","v":""},{"$f":"+IF('[1]TASA DE FALLA'!DW36=0,\"\",'[1]TASA DE FALLA'!DW36)","v":""},{"$f":"+IF('[1]TASA DE FALLA'!DX36=0,\"\",'[1]TASA DE FALLA'!DX36)","v":""},{"$f":"+IF('[1]TASA DE FALLA'!DY36=0,\"\",'[1]TASA DE FALLA'!DY36)","v":""}]
[null,null,{"$f":"'[1]TASA DE FALLA'!C37","v":32},{"$f":"'[1]TASA DE FALLA'!D37","v":"EL TRAPIAL - LOMA DE LA LATA 2"},{"$f":"'[1]TASA DE FALLA'!E37","v":132},{"$f":"'[1]TASA DE FALLA'!F37","v":142},{"$f":"'[1]TASA DE FALLA'!G37","v":"L"},{"$f":"+IF('[1]TASA DE FALLA'!DN37=0,\"\",'[1]TASA DE FALLA'!DN37)","v":""},{"$f":"+IF('[1]TASA DE FALLA'!DO37=0,\"\",'[1]TASA DE FALLA'!DO37)","v":""},{"$f":"+IF('[1]TASA DE FALLA'!DP37=0,\"\",'[1]TASA DE FALLA'!DP37)","v":""},{"$f":"+IF('[1]TASA DE FALLA'!DQ37=0,\"\",'[1]TASA DE FALLA'!DQ37)","v":""},{"$f":"+IF('[1]TASA DE FALLA'!DR37=0,\"\",'[1]TASA DE FALLA'!DR37)","v":""},{"$f":"+IF('[1]TASA DE FALLA'!DS37=0,\"\",'[1]TASA DE FALLA'!DS37)","v":""},{"$f":"+IF('[1]TASA DE FALLA'!DT37=0,\"\",'[1]TASA DE FALLA'!DT37)","v":""},{"$f":"+IF('[1]TASA DE FALLA'!DU37=0,\"\",'[1]TASA DE FALLA'!DU37)","v":""},{"$f":"+IF('[1]TASA DE FALLA'!DV37=0,\"\",'[1]TASA DE FALLA'!DV37)","v":""},{"$f":"+IF('[1]TASA DE FALLA'!DW37=0,\"\",'[1]TASA DE FALLA'!DW37)","v":""},{"$f":"+IF('[1]TASA DE FALLA'!DX37=0,\"\",'[1]TASA DE FALLA'!DX37)","v":""},{"$f":"+IF('[1]TASA DE FALLA'!DY37=0,\"\",'[1]TASA DE FALLA'!DY37)","v":""}]
[null,null,{"$f":"'[1]TASA DE FALLA'!C38","v":33},{"$f":"'[1]TASA DE FALLA'!D38","v":"PTO. SECCIONAMIENTO - RINCON DE LOS SAUCES"},{"$f":"'[1]TASA DE FALLA'!E38","v":132},{"$f":"'[1]TASA DE FALLA'!F38","v":67.704999999999998},{"$f":"'[1]TASA DE FALLA'!G38","v":"L"},{"$f":"+IF('[1]TASA DE FALLA'!DN38=0,\"\",'[1]TASA DE FALLA'!DN38)","v":""},{"$f":"+IF('[1]TASA DE FALLA'!DO38=0,\"\",'[1]TASA DE FALLA'!DO38)","v":""},{"$f":"+IF('[1]TASA DE FALLA'!DP38=0,\"\",'[1]TASA DE FALLA'!DP38)","v":""},{"$f":"+IF('[1]TASA DE FALLA'!DQ38=0,\"\",'[1]TASA DE FALLA'!DQ38)","v":""},{"$f":"+IF('[1]TASA DE FALLA'!DR38=0,\"\",'[1]TASA DE FALLA'!DR38)","v":""},{"$f":"+IF('[1]TASA DE FALLA'!DS38=0,\"\",'[1]TASA DE FALLA'!DS38)","v":""},{"$f":"+IF('[1]TASA DE FALLA'!DT38=0,\"\",'[1]TASA DE FALLA'!DT38)","v":""},{"$f":"+IF('[1]TASA DE FALLA'!DU38=0,\"\",'[1]TASA DE FALLA'!DU38)","v":""},{"$f":"+IF('[1]TASA DE FALLA'!DV38=0,\"\",'[1]TASA DE FALLA'!DV38)","v":""},{"$f":"+IF('[1]TASA DE FALLA'!DW38=0,\"\",'[1]TASA DE FALLA'!DW38)","v":""},{"$f":"+IF('[1]TASA DE FALLA'!DX38=0,\"\",'[1]TASA DE FALLA'!DX38)","v":""},{"$f":"+IF('[1]TASA DE FALLA'!DY38=0,\"\",'[1]TASA DE FALLA'!DY38)","v":""}]
[null,null,{"$f":"'[1]TASA DE FALLA'!C39","v":34},{"$f":"'[1]TASA DE FALLA'!D39","v":"PTO. HERNANDEZ - RINCON DE LOS SAUCES"},{"$f":"'[1]TASA DE FALLA'!E39","v":132},{"$f":"'[1]TASA DE FALLA'!F39","v":21},{"$f":"'[1]TASA DE FALLA'!G39","v":"L"},{"$f":"+IF('[1]TASA DE FALLA'!DN39=0,\"\",'[1]TASA DE FALLA'!DN39)","v":""},{"$f":"+IF('[1]TASA DE FALLA'!DO39=0,\"\",'[1]TASA DE FALLA'!DO39)","v":1},{"$f":"+IF('[1]TASA DE FALLA'!DP39=0,\"\",'[1]TASA DE FALLA'!DP39)","v":""},{"$f":"+IF('[1]TASA DE FALLA'!DQ39=0,\"\",'[1]TASA DE FALLA'!DQ39)","v":""},{"$f":"+IF('[1]TASA DE FALLA'!DR39=0,\"\",'[1]TASA DE FALLA'!DR39)","v":""},{"$f":"+IF('[1]TASA DE FALLA'!DS39=0,\"\",'[1]TASA DE FALLA'!DS39)","v":""},{"$f":"+IF('[1]TASA DE FALLA'!DT39=0,\"\",'[1]TASA DE FALLA'!DT39)","v":""},{"$f":"+IF('[1]TASA DE FALLA'!DU39=0,\"\",'[1]TASA DE FALLA'!DU39)","v":""},{"$f":"+IF('[1]TASA DE FALLA'!DV39=0,\"\",'[1]TASA DE FALLA'!DV39)","v":""},{"$f":"+IF('[1]TASA DE FALLA'!DW39=0,\"\",'[1]TASA DE FALLA'!DW39)","v":""},{"$f":"+IF('[1]TASA DE FALLA'!DX39=0,\"\",'[1]TASA DE FALLA'!DX39)","v":""},{"$f":"+IF('[1]TASA DE FALLA'!DY39=0,\"\",'[1]TASA DE FALLA'!DY39)","v":""}]
[null,null,null,null,null,null,null,{"$f":"+IF('[1]TASA DE FALLA'!DN40=0,\"\",'[1]TASA DE FALLA'!DN40)","v":""},{"$f":"+IF('[1]TASA DE FALLA'!DO40=0,\"\",'[1]TASA DE FALLA'!DO40)","v":""},{"$f":"+IF('[1]TASA DE FALLA'!DP40=0,\"\",'[1]TASA DE FALLA'!DP40)","v":""},{"$f":"+IF('[1]TASA DE FALLA'!DQ40=0,\"\",'[1]TASA DE FALLA'!DQ40)","v":""},{"$f":"+IF('[1]TASA DE FALLA'!DR40=0,\"\",'[1]TASA DE FALLA'!DR40)","v":""},{"$f":"+IF('[1]TASA DE FALLA'!DS40=0,\"\",'[1]TASA DE FALLA'!DS40)","v":""},{"$f":"+IF('[1]TASA DE FALLA'!DT40=0,\"\",'[1]TASA DE FALLA'!DT40)","v":""},{"$f":"+IF('[1]TASA DE FALLA'!DU40=0,\"\",'[1]TASA DE FALLA'!DU40)","v":""},{"$f":"+IF('[1]TASA DE FALLA'!DV40=0,\"\",'[1]TASA DE FALLA'!DV40)","v":""},{"$f":"+IF('[1]TASA DE FALLA'!DW40=0,\"\",'[1]TASA DE FALLA'!DW40)","v":""},{"$f":"+IF('[1]TASA DE FALLA'!DX40=0,\"\",'[1]TASA DE FALLA'!DX40)","v":""},{"$f":"+IF('[1]TASA DE FALLA'!DY40=0,\"\",'[1]TASA DE FALLA'!DY40)","v":""}]
[null,null,null,null,"Longitud Total ",{"$f":"SUM(F19:F40)-F32","v":764.005}]
[null,null,null,null,null,null,"Indisponibilidades Forzadas ",{"$f":"SUM(H19:H40)","v":1},{"$f":"SUM(I19:I40)","v":1},{"$f":"SUM(J19:J40)","v":0},0,0,0,0,1,1,0,0,1]
[null,null,null,null,null,null,"TASA DE FALLA ",{"$f":"'[1]TASA DE FALLA'!DN43","v":2.36},{"$f":"'[1]TASA DE FALLA'!DO43","v":1.96},{"$f":"'[1]TASA DE FALLA'!DP43","v":1.83},{"$f":"'[1]TASA DE FALLA'!DQ43","v":1.57},{"$f":"'[1]TASA DE FALLA'!DR43","v":1.44},{"$f":"'[1]TASA DE FALLA'!DS43","v":1.05},{"$f":"'[1]TASA DE FALLA'!DT43","v":1.05},{"$f":"'[1]TASA DE FALLA'!DU43","v":1.05},{"$f":"'[1]TASA DE FALLA'!DV43","v":1.05},{"$f":"'[1]TASA DE FALLA'!DW43","v":1.05},{"$f":"'[1]TASA DE FALLA'!DX43","v":0.52},{"$f":"'[1]TASA DE FALLA'!DY43","v":0.52},{"$f":"'[1]TASA DE FALLA'!DZ43","v":0.65}]
[]
[null,null,null,null,null,null,null,"TASA DE FALLA",null,{"$f":"+T43","v":0.65},null,"SALIDAS x AÑO / 100 km"]

{"sheet":"DATO","index":6,"n_rows":21,"n_cols":29,"rows_kept":21,"cut":false,"hidden":false,"merged":[]}
["Mes","Mes","Dia","Año",null,"E.N.R.E."]
["enero","01",31,2006]
["febrero","02",{"$f":"IF(MOD(E14,4)=0,29,28)","v":29},{"$f":"+D2+1","v":2007}]
["marzo","03",31,2008]
["abril","04",30,2009]
["mayo","05",31,2010]
["junio","06",30,2011]
["julio","07",31,2012]
["agosto","08",31,2013]
["septiembre","09",30,2014]
["octubre","10",31,2015]
["noviembre","11",30,2016]
["diciembre","12",31,null,null,null,null,null,"Total"]
[11,1,{"$f":"CELL(\"CONTENIDO\",OFFSET(A1,B14,0))","v":"enero"},{"$f":"CELL(\"CONTENIDO\",OFFSET(C1,B14,0))","v":31},{"$f":"CELL(\"CONTENIDO\",OFFSET(D1,A14,0))","v":2016},{"$f":"\"Desde el 01 al \" & D14 & \" de \" & C14 & \" de \" & E14","v":"Desde el 01 al 31 de enero de 2016"},{"$f":"CELL(\"CONTENIDO\",OFFSET(B1,B14,0))","v":"01"},{"$f":"RIGHT(E14,2)","v":"16"},"B14"]
[null,{"$f":"\"\\\\rugor\\files\\Transporte\\Transporte\\AA PROCESO AUT ARCHIVOS J\\EPEN_TRONCAL\\\" &E14","v":"\\\\rugor\\files\\Transporte\\Transporte\\AA PROCESO AUT ARCHIVOS J\\EPEN_TRONCAL\\2016"},null,null,null,null,{"$f":"\"J\"&G14&H14&\"PEN\"","v":"J0116PEN"}]
[null,{"$f":"\"\\\\rugor\\files\\Transporte\\transporte\\AA PROCESO AUT\\INTERCAMBIO\\\" &H14&G14","v":"\\\\rugor\\files\\Transporte\\transporte\\AA PROCESO AUT\\INTERCAMBIO\\1601"}]
["Hoja","FilaInicio","FilasPlantilla","Columnas","NombreHoja","OrigenDeDatos","Col00","Col01","Col02","Col03","Col04","Col05","Col06","Col07","Col08","Col09","Col10","Col11","Col12","Col13","Col14","Col15","FILHTOTAL","COLHTOTAL","FILHCALC","COLHCALC","FILTRANSP","COLTRANSP","COL TSAL"]
["MODELO L",19,19,12,{"$f":"\"LI-\" & $G$14","v":"LI-01"},"EPEN_INDISPONIBILIDADES_LINEAS_EPEN.XLS",3,5,4,6,7,8,0,10,11,14,16,27,15,0,0,0,18,9,40,28,17,28,14]
["MODELO T",22,19,13,{"$f":"\"T-\" & $G$14","v":"T-01"},"EPEN_INDISPONIBILIDADES_TRAFOS_EPEN.XLS",3,5,4,6,7,8,9,11,12,15,16,18,28,17,0,0,22,9,43,29,20,29,15]
["MODELO S",21,19,10,{"$f":"\"SA-\" & $G$14","v":"SA-01"},"EPEN_INDISPONIBILIDADES_SALIDAS_EPEN.XLS",3,5,4,6,7,8,10,11,14,15,21,0,0,0,0,0,24,9,42,22,19,22,14]
["MODELO VST",19,24,4,{"$f":"\"CAUSAS-VST-\" & $G$14","v":"CAUSAS-VST-01"},"EPEN_CAUSAS_VST.XLS",3,4,5,6,7,0,0,0,0,0,0,0,0,0,0,0,999,999,0,0,0,0,0]