{"text_format":"1","workbook":"xlsx","n_sheets":12,"sheets":["TOT-0815","LI-08 (1)","LI-08 (2)","T-08 (1)","T-08 (2)","T-08 (3)","CAUSAS-VST-08 (1)","CAUSAS-VST-08 (2)","CAUSAS-VST-08 (3)","CAUSAS-VST-08 (4)","Tasa de Falla","DATO"],"not_rendered":{"charts":0,"images":2,"macros":1,"external_links":1,"defined_names":1,"comments":0,"pivot_tables":0},"unopened":[],"bounds":{"document_bytes":16777216,"sheet_cells":100000,"rows_first":2000,"rows_last":500,"rows_between":2000,"halvings":0,"cell_chars":16384,"cell_head_chars":4096},"cells_cut":0,"cells_raw":0,"read":"whole","date_system":"1900"}

{"sheet":"TOT-0815","index":0,"n_rows":32,"n_cols":10,"rows_kept":32,"cut":false,"hidden":false,"merged":[]}
[]
[null,"ANEXO V   al Memorandum   D.T.E.E. N°  526  / 2016"]
[]
["ENTE NACIONAL REGULADOR "]
["DE LA ELECTRICIDAD"]
[]
[null,"SISTEMA DE TRANSPORTE DE ENERGÍA ELÉCTRICA POR DISTRIBUCIÓN TRONCAL"]
[]
[null,"TRANSNOA S.A."]
[]
[null,"TOTAL DE PENALIZACIONES"]
[]
[null,1]
[null,"Desde el 01 al 31 de agosto de 2015"]
[]
[null,"Sanciones duplicadas por tasa de falla > 4 Sal. x año/100km."]
[]
[null,null,"1.-","LÍNEAS"]
[null,null,null,"1.1.-","Equipamiento propio",null,null,null,null,{"$f":"'LI-08 (2)'!AA42","v":337954.27}]
[]
[]
[]
[null,null,"2.-","CONEXIÓN"]
[null,null,null,"2.1.-","Transformación"]
[null,null,null,null,"2.1.1.-","Equipamiento propio",null,null,null,{"$f":"'T-08 (3)'!AC46","v":140556.51}]
[]
[]
[]
[]
[null,null,null,null,null,null,"TOTAL ",{"$f":"SUM(J18:J28)","v":478510.78}]
[]
[null,null,"Valores remuneratorios según Convenio de Renovación del acuerdo Instrumental, Nota ENRE Nº 112130"]

{"sheet":"LI-08 (1)","index":1,"n_rows":43,"n_cols":27,"rows_kept":43,"cut":false,"hidden":false,"merged":[]}
[]
[null,{"$f":"+'TOT-0815'!B2","v":"ANEXO V   al Memorandum   D.T.E.E. N°  526  / 2016"}]
[]
[" ENTE NACIONAL REGULADOR "]
["       DE LA ELECTRICIDAD"]
[]
[]
[null,null,null,null,null,"SISTEMA DE TRANSPORTE DE ENERGÍA ELÉCTRICA POR DISTRIBUCIÓN TRONCAL - TRANSNOA S.A."]
[]
[null,null,null,null,null,"1.- LÍNEAS"]
[]
[null,null,null,null,null,"1.1.- Equipamiento propio"]
[]
[null,{"$f":"'TOT-0815'!B14","v":"Desde el 01 al 31 de agosto de 2015"}]
[]
[null,null,null,null,null,"$/100 km-h : LINEAS 132 kV ",464.68400000000003,null,null,null,"FACTOR DE PENALIZACION  K =",{"$f":"30*'TOT-0815'!B13","v":30},{"$f":"IF(L16=30,\" \",IF(L16=60,\"Coeficiente duplicado por tasa de falla >4 Sal. x año/100 km.\",\"REVISAR COEFICIENTE\"))","v":" "}]
[null,null,3,4,5,6,7,8,9,10,11,12,13,14,15,16,17,18,19,20,21,22,23,24,25,26,27]
[null,null,"N°","INDISP","ID EQUIPO","LÍNEAS","U\n[kV]","Long.\n[km]","$/h","Salida","Entrada","Hs. \nIndisp","Minutos\nIndisp.","Tipo \nSal.(²)","C.R.\n%","PENALIZ.\nPROGRAM.","REDUCC.\nPROGRAM.","PENALIZACION FORZADA\nPor Salida    1ras. 3 hs.   hs. Restantes",null,null,"REDUCC. FORZADA\nPor Salida     1ras. 3 hs.     hs. Restantes",null,null,"RESTANTE\nFORZADA","REDUCC.\nRESTANTE","Informó\nen Térm.","TOTAL\nPENALIZAC."]
[]
[]
[null,null,1,290646,278,"ESTATICA SUR - SARMIENTO NOA",132,4.4000000953674316,{"$f":"$G$16/100*IF(H21>25,H21,25)","v":116.17100000000001},"2015-08-01","2015-08-01T17:14:00",{"$f":"IF(F21=\"\",\"\",(K21-J21)*24)","v":17.233333333279006},{"$f":"IF(F21=\"\",\"\",ROUND((K21-J21)*24*60,0))","v":1034},"P",{"$f":"IF(F21=\"\",\"\",\"--\")","v":"--"},{"$f":"IF(N21=\"P\",ROUND(M21/60,2)*I21*$L$16*0.01,\"--\")","v":600.48789900000008},{"$f":"IF(N21=\"RP\",I21*O21*ROUND(L21/60,2)*0.01*M21/100,\"--\")","v":"--"},{"$f":"IF(N21=\"F\",I21*$L$16,\"--\")","v":"--"},{"$f":"IF(AND(M21>10,N21=\"F\"),I21*$L$16*IF(M21>180,3,ROUND((M21)/60,2)),\"--\")","v":"--"},{"$f":"IF(AND(M21>180,N21=\"F\"),(ROUND(M21/60,2)-3)*I21*$L$16*0.1,\"--\")","v":"--"},{"$f":"IF(N21=\"R\",I21*$L$16*O21/100,\"--\")","v":"--"},{"$f":"IF(AND(M21>10,N21=\"R\"),I21*$L$16*O21/100*IF(M21>180,3,ROUND(M21/60,2)),\"--\")","v":"--"},{"$f":"IF(AND(M21>180,N21=\"R\"),(ROUND(M21/60,2)-3)*I21*$L$16*0.1*O21/100,\"--\")","v":"--"},{"$f":"IF(N21=\"RF\",ROUND(M21/60,2)*I21*$L$16*0.1,\"--\")","v":"--"},{"$f":"IF(N21=\"RR\",ROUND(M21/60,2)*I21*$L$16*0.1*O21/100,\"--\")","v":"--"},"SI",{"$f":"IF(F21=\"\",\"\",SUM(P21:Y21)*IF(Z21=\"SI\",1,2))","v":600.48789900000008}]
[null,null,2,290651,279,"ESTATICA SUR - INDEPENDENCIA (O.F.)",132,2.5999999046325684,116.17100000000001,"2015-08-01T12:14:00","2015-08-01T17:11:00",4.9499999998952262,297,"P","--",172.51393500000003,"--","--","--","--","--","--","--","--","--","SI",172.51393500000003]
[null,null,3,"290658/59","4395/96","CEVIL POZO - POZO AVE - AVELLANEDA",132,8,116.17100000000001,"2015-08-02T08:20:00","2015-08-02T13:54:00",{"$f":"IF(F23=\"\",\"\",(K23-J23)*24)","v":5.5666666668257676},{"$f":"IF(F23=\"\",\"\",ROUND((K23-J23)*24*60,0))","v":334},"P","--",{"$f":"IF(N23=\"P\",ROUND(M23/60,2)*I23*$L$16*0.01,\"--\")","v":194.12174100000004},{"$f":"IF(N23=\"RP\",I23*O23*ROUND(L23/60,2)*0.01*M23/100,\"--\")","v":"--"},{"$f":"IF(N23=\"F\",I23*$L$16,\"--\")","v":"--"},{"$f":"IF(AND(M23>10,N23=\"F\"),I23*$L$16*IF(M23>180,3,ROUND((M23)/60,2)),\"--\")","v":"--"},{"$f":"IF(AND(M23>180,N23=\"F\"),(ROUND(M23/60,2)-3)*I23*$L$16*0.1,\"--\")","v":"--"},{"$f":"IF(N23=\"R\",I23*$L$16*O23/100,\"--\")","v":"--"},{"$f":"IF(AND(M23>10,N23=\"R\"),I23*$L$16*O23/100*IF(M23>180,3,ROUND(M23/60,2)),\"--\")","v":"--"},{"$f":"IF(AND(M23>180,N23=\"R\"),(ROUND(M23/60,2)-3)*I23*$L$16*0.1*O23/100,\"--\")","v":"--"},{"$f":"IF(N23=\"RF\",ROUND(M23/60,2)*I23*$L$16*0.1,\"--\")","v":"--"},{"$f":"IF(N23=\"RR\",ROUND(M23/60,2)*I23*$L$16*0.1*O23/100,\"--\")","v":"--"},"SI",194.12174100000004]
[null,null,4,290660,3621,"CEVIL POZO - BURRUYACU",132,56,260.22304000000003,"2015-08-02T08:22:00","2015-08-02T13:52:00",{"$f":"IF(F24=\"\",\"\",(K24-J24)*24)","v":5.4999999999417923},{"$f":"IF(F24=\"\",\"\",ROUND((K24-J24)*24*60,0))","v":330},"P","--",{"$f":"IF(N24=\"P\",ROUND(M24/60,2)*I24*$L$16*0.01,\"--\")","v":429.36801600000007},{"$f":"IF(N24=\"RP\",I24*O24*ROUND(L24/60,2)*0.01*M24/100,\"--\")","v":"--"},{"$f":"IF(N24=\"F\",I24*$L$16,\"--\")","v":"--"},{"$f":"IF(AND(M24>10,N24=\"F\"),I24*$L$16*IF(M24>180,3,ROUND((M24)/60,2)),\"--\")","v":"--"},{"$f":"IF(AND(M24>180,N24=\"F\"),(ROUND(M24/60,2)-3)*I24*$L$16*0.1,\"--\")","v":"--"},{"$f":"IF(N24=\"R\",I24*$L$16*O24/100,\"--\")","v":"--"},{"$f":"IF(AND(M24>10,N24=\"R\"),I24*$L$16*O24/100*IF(M24>180,3,ROUND(M24/60,2)),\"--\")","v":"--"},{"$f":"IF(AND(M24>180,N24=\"R\"),(ROUND(M24/60,2)-3)*I24*$L$16*0.1*O24/100,\"--\")","v":"--"},{"$f":"IF(N24=\"RF\",ROUND(M24/60,2)*I24*$L$16*0.1,\"--\")","v":"--"},{"$f":"IF(N24=\"RR\",ROUND(M24/60,2)*I24*$L$16*0.1*O24/100,\"--\")","v":"--"},"SI",429.36801600000007]
[null,null,5,290853,5579,"ESTATICA - INDEPENDENCIA    2",132,3.1,116.17100000000001,"2015-08-01T12:14:00","2015-08-01T17:11:00",4.9499999998952262,297,"P","--",172.51393500000003,"--","--","--","--","--","--","--","--","--","SI",172.51393500000003]
[null,null,6,290660,3621,"BURRUYACU - CEVIL POZO",132,56,260.22304000000003,"2015-08-02T08:22:00","2015-08-02T13:52:00",5.4999999999417923,330,"P","--",429.36801600000007,"--","--","--","--","--","--","--","--","--","SI",429.36801600000007]
[null,null,7,290661,275,"CEVIL POZO - TUCUMAN NORTE",132,14.5,116.17100000000001,"2015-08-02T08:24:00","2015-08-02T13:50:00",5.433333333407063,326,"P","--",189.242559,"--","--","--","--","--","--","--","--","--","SI",189.242559]
[null,null,8,290662,2878,"CEVIL POZO - EL BRACHO",132,17,116.17100000000001,"2015-08-02T08:26:00","2015-08-02T14:13:00",5.7833333333255723,347,"P","--",201.44051400000001,"--","--","--","--","--","--","--","--","--","SI",201.44051400000001]
[null,null,9,291023,5554,"STGO CENTRO - FERNANDEZ - SUNCHO CORRAL",132,103,478.62452000000002,"2015-08-03T07:23:00","2015-08-03T14:12:00",6.8166666667093523,409,"P","--",979.26576792000014,"--","--","--","--","--","--","--","--","--","SI",979.26576792000014]
[null,null,10,291024,5554,"STGO CENTRO - FERNANDEZ - SUNCHO CORRAL",132,103,478.62452000000002,"2015-08-05T07:22:00","2015-08-05T17:04:00",9.7000000000116415,582,"P","--",1392.7973531999999,"--","--","--","--","--","--","--","--","--","SI",1392.7973531999999]
[null,null,11,291028,5554,"STGO CENTRO - FERNANDEZ - SUNCHO CORRAL",132,103,478.62452000000002,"2015-08-06T07:22:00","2015-08-06T14:41:00",7.3166666667675599,439,"P","--",1051.0594459199999,"--","--","--","--","--","--","--","--","--","SI",1051.0594459199999]
[null,null,12,291029,305,"TUCUMAN NORTE - EL BRACHO",132,31.5,146.37546,"2015-08-06T10:11:00","2015-08-06T11:55:00",1.7333333333954215,104,"F","--","--","--",4391.2637999999997,7596.8863739999997,"--","--","--","--","--","--","SI",11988.150173999999]
[null,null,13,291030,4691,"VILLA QUINTEROS - ANDALGALA",132,102,473.97768000000002,"2015-08-06T11:26:00","2015-08-06T19:38:00",8.2000000000116415,492,"F","--","--","--",14219.330400000001,42657.991200000004,7394.0518080000002,"--","--","--","--","--","SI",64271.373407999999]
[null,null,14,291074,4250,"PAMPA GRANDE - TRANCAS",132,55,255.5762,"2015-08-06T15:15:00","2015-08-06T15:37:00",0.36666666663950309,22,"F","--","--","--",7667.2860000000001,2836.8958200000002,"--","--","--","--","--","--","SI",10504.18182]
[null,null,15,291147,4811,"ROSARIO DE LA FRONTERA - COBOS",132,130.39999389648437,605.94790763793947,"2015-08-12T07:03:00","2015-08-12T07:27:00",0.40000000008149073,24,"F","--","--","--",18178.437229138184,7271.374891655274,"--","--","--","--","--","--","SI",25449.81212079346]
[null,null,16,291148,4810,"BURRUYACU - R. DE LA FRONTERA",132,99.099998474121094,460.50183690948489,"2015-08-12T07:03:00","2015-08-12T07:48:00",0.75,45,"F","--","--","--",13815.055107284546,10361.291330463409,"--","--","--","--","--","--","SI",24176.346437747954]
[null,null,17,291156,293,"MINETTI - SAN JUANCITO",132,26,120.81784,"2015-08-13T18:22:00","2015-08-13T18:51:00",0.48333333333721384,29,"F","--","--","--",3624.5352000000003,1739.7768960000001,"--","--","--","--","--","--","SI",5364.3120960000006]
[null,null,18,291157,4677,"GUEMES SALTA - MINETTI",132,36.099998474121094,167.75091690948486,"2015-08-13T18:22:00","2015-08-14T13:13:00",18.849999999976717,1131,"F","--","--","--",5032.5275072845461,15097.582521853637,7976.5560990460062,"--","--","--","--","--","SI",28106.666128184192]
[null,null,19,291160,3944,"FRIAS - RECREO",132,74.540000915527344,346.3754578543091,"2015-08-16T07:19:00","2015-08-16T09:27:00",{"$f":"IF(F39=\"\",\"\",(K39-J39)*24)","v":2.1333333334769122},{"$f":"IF(F39=\"\",\"\",ROUND((K39-J39)*24*60,0))","v":128},"P",{"$f":"IF(F39=\"\",\"\",\"--\")","v":"--"},{"$f":"IF(N39=\"P\",ROUND(M39/60,2)*I39*$L$16*0.01,\"--\")","v":221.3339175689035},{"$f":"IF(N39=\"RP\",I39*O39*ROUND(L39/60,2)*0.01*M39/100,\"--\")","v":"--"},{"$f":"IF(N39=\"F\",I39*$L$16,\"--\")","v":"--"},{"$f":"IF(AND(M39>10,N39=\"F\"),I39*$L$16*IF(M39>180,3,ROUND((M39)/60,2)),\"--\")","v":"--"},{"$f":"IF(AND(M39>180,N39=\"F\"),(ROUND(M39/60,2)-3)*I39*$L$16*0.1,\"--\")","v":"--"},{"$f":"IF(N39=\"R\",I39*$L$16*O39/100,\"--\")","v":"--"},{"$f":"IF(AND(M39>10,N39=\"R\"),I39*$L$16*O39/100*IF(M39>180,3,ROUND(M39/60,2)),\"--\")","v":"--"},{"$f":"IF(AND(M39>180,N39=\"R\"),(ROUND(M39/60,2)-3)*I39*$L$16*0.1*O39/100,\"--\")","v":"--"},{"$f":"IF(N39=\"RF\",ROUND(M39/60,2)*I39*$L$16*0.1,\"--\")","v":"--"},{"$f":"IF(N39=\"RR\",ROUND(M39/60,2)*I39*$L$16*0.1*O39/100,\"--\")","v":"--"},"SI",{"$f":"IF(F39=\"\",\"\",SUM(P39:Y39)*IF(Z39=\"SI\",1,2))","v":221.3339175689035}]
[null,null,20,291161,289,"FRIAS - LA CALERA NOA",132,27.299999237060547,126.85872845474243,"2015-08-16T07:23:00","2015-08-16T10:18:00",{"$f":"IF(F40=\"\",\"\",(K40-J40)*24)","v":2.9166666667442769},{"$f":"IF(F40=\"\",\"\",ROUND((K40-J40)*24*60,0))","v":175},"P",{"$f":"IF(F40=\"\",\"\",\"--\")","v":"--"},{"$f":"IF(N40=\"P\",ROUND(M40/60,2)*I40*$L$16*0.01,\"--\")","v":111.12824612635437},{"$f":"IF(N40=\"RP\",I40*O40*ROUND(L40/60,2)*0.01*M40/100,\"--\")","v":"--"},{"$f":"IF(N40=\"F\",I40*$L$16,\"--\")","v":"--"},{"$f":"IF(AND(M40>10,N40=\"F\"),I40*$L$16*IF(M40>180,3,ROUND((M40)/60,2)),\"--\")","v":"--"},{"$f":"IF(AND(M40>180,N40=\"F\"),(ROUND(M40/60,2)-3)*I40*$L$16*0.1,\"--\")","v":"--"},{"$f":"IF(N40=\"R\",I40*$L$16*O40/100,\"--\")","v":"--"},{"$f":"IF(AND(M40>10,N40=\"R\"),I40*$L$16*O40/100*IF(M40>180,3,ROUND(M40/60,2)),\"--\")","v":"--"},{"$f":"IF(AND(M40>180,N40=\"R\"),(ROUND(M40/60,2)-3)*I40*$L$16*0.1*O40/100,\"--\")","v":"--"},{"$f":"IF(N40=\"RF\",ROUND(M40/60,2)*I40*$L$16*0.1,\"--\")","v":"--"},{"$f":"IF(N40=\"RR\",ROUND(M40/60,2)*I40*$L$16*0.1*O40/100,\"--\")","v":"--"},"SI",{"$f":"IF(F40=\"\",\"\",SUM(P40:Y40)*IF(Z40=\"SI\",1,2))","v":111.12824612635437}]
[null,null,21,291390,5482,"EL BRACHO - TERMAS NORTE",132,78.400000000000006,364.31225600000005,"2015-08-17T13:56:00","2015-08-17T18:00:00",{"$f":"IF(F41=\"\",\"\",(K41-J41)*24)","v":4.0666666666511446},{"$f":"IF(F41=\"\",\"\",ROUND((K41-J41)*24*60,0))","v":244},"F",{"$f":"IF(F41=\"\",\"\",\"--\")","v":"--"},{"$f":"IF(N41=\"P\",ROUND(M41/60,2)*I41*$L$16*0.01,\"--\")","v":"--"},{"$f":"IF(N41=\"RP\",I41*O41*ROUND(L41/60,2)*0.01*M41/100,\"--\")","v":"--"},{"$f":"IF(N41=\"F\",I41*$L$16,\"--\")","v":10929.367680000001},{"$f":"IF(AND(M41>10,N41=\"F\"),I41*$L$16*IF(M41>180,3,ROUND((M41)/60,2)),\"--\")","v":32788.103040000002},{"$f":"IF(AND(M41>180,N41=\"F\"),(ROUND(M41/60,2)-3)*I41*$L$16*0.1,\"--\")","v":1169.4423417600008},{"$f":"IF(N41=\"R\",I41*$L$16*O41/100,\"--\")","v":"--"},{"$f":"IF(AND(M41>10,N41=\"R\"),I41*$L$16*O41/100*IF(M41>180,3,ROUND(M41/60,2)),\"--\")","v":"--"},{"$f":"IF(AND(M41>180,N41=\"R\"),(ROUND(M41/60,2)-3)*I41*$L$16*0.1*O41/100,\"--\")","v":"--"},{"$f":"IF(N41=\"RF\",ROUND(M41/60,2)*I41*$L$16*0.1,\"--\")","v":"--"},{"$f":"IF(N41=\"RR\",ROUND(M41/60,2)*I41*$L$16*0.1*O41/100,\"--\")","v":"--"},"SI",{"$f":"IF(F41=\"\",\"\",SUM(P41:Y41)*IF(Z41=\"SI\",1,2))","v":44886.913061760002}]
[]
[null,null,"(²)","P - PROGRAMADA  ;  F - FORZADA",null,null,null,null,null,null,null,null,null,null,null,{"$f":"SUM(P19:P42)","v":6144.6413457352583},0,77857.802923707277,120349.90207397232,16540.050248806008,0,0,0,0,0,null,{"$f":"ROUND(SUM(AA19:AA42),2)","v":220892.4}]

{"sheet":"LI-08 (2)","index":2,"n_rows":42,"n_cols":27,"rows_kept":42,"cut":false,"hidden":false,"merged":[]}
[]
[null,{"$f":"+'TOT-0815'!B2","v":"ANEXO V   al Memorandum   D.T.E.E. N°  526  / 2016"}]
[]
[" ENTE NACIONAL REGULADOR "]
["       DE LA ELECTRICIDAD"]
[]
[]
[null,null,null,null,null,"SISTEMA DE TRANSPORTE DE ENERGÍA ELÉCTRICA POR DISTRIBUCIÓN TRONCAL - TRANSNOA S.A."]
[]
[null,null,null,null,null,"1.- LÍNEAS"]
[]
[null,null,null,null,null,"1.1.- Equipamiento propio"]
[]
[null,{"$f":"'TOT-0815'!B14","v":"Desde el 01 al 31 de agosto de 2015"}]
[]
[null,null,null,null,null,"$/100 km-h : LINEAS 132 kV ",464.68400000000003,null,null,null,"FACTOR DE PENALIZACION  K =",{"$f":"30*'TOT-0815'!B13","v":30},{"$f":"IF(L16=30,\" \",IF(L16=60,\"Coeficiente duplicado por tasa de falla >4 Sal. x año/100 km.\",\"REVISAR COEFICIENTE\"))","v":" "}]
[null,null,3,4,5,6,7,8,9,10,11,12,13,14,15,16,17,18,19,20,21,22,23,24,25,26,27]
[null,null,"N°","INDISP","ID EQUIPO","LÍNEAS","U\n[kV]","Long.\n[km]","$/h","Salida","Entrada","Hs. \nIndisp","Minutos\nIndisp.","Tipo \nSal.(²)","C.R.\n%","PENALIZ.\nPROGRAM.","REDUCC.\nPROGRAM.","PENALIZACION FORZADA\nPor Salida    1ras. 3 hs.   hs. Restantes",null,null,"REDUCC. FORZADA\nPor Salida     1ras. 3 hs.     hs. Restantes",null,null,"RESTANTE\nFORZADA","REDUCC.\nRESTANTE","Informó\nen Térm.","TOTAL\nPENALIZAC."]
[null,null,null,null,null,null,null,null,null,null,null,null,null,null,null,null,null,null,null,null,null,null,null,null,null,null,{"$f":"'LI-08 (1)'!AA43","v":220892.4}]
[]
[null,null,22,291391,4250,"PAMPA GRANDE - TRANCAS",132,55,{"$f":"$G$16/100*IF(H21>25,H21,25)","v":255.5762},"2015-08-18T02:42:00","2015-08-18T02:53:00",{"$f":"IF(F21=\"\",\"\",(K21-J21)*24)","v":0.18333333323244005},{"$f":"IF(F21=\"\",\"\",ROUND((K21-J21)*24*60,0))","v":11},"F",{"$f":"IF(F21=\"\",\"\",\"--\")","v":"--"},{"$f":"IF(N21=\"P\",ROUND(M21/60,2)*I21*$L$16*0.01,\"--\")","v":"--"},{"$f":"IF(N21=\"RP\",I21*O21*ROUND(L21/60,2)*0.01*M21/100,\"--\")","v":"--"},{"$f":"IF(N21=\"F\",I21*$L$16,\"--\")","v":7667.2860000000001},{"$f":"IF(AND(M21>10,N21=\"F\"),I21*$L$16*IF(M21>180,3,ROUND((M21)/60,2)),\"--\")","v":1380.11148},{"$f":"IF(AND(M21>180,N21=\"F\"),(ROUND(M21/60,2)-3)*I21*$L$16*0.1,\"--\")","v":"--"},{"$f":"IF(N21=\"R\",I21*$L$16*O21/100,\"--\")","v":"--"},{"$f":"IF(AND(M21>10,N21=\"R\"),I21*$L$16*O21/100*IF(M21>180,3,ROUND(M21/60,2)),\"--\")","v":"--"},{"$f":"IF(AND(M21>180,N21=\"R\"),(ROUND(M21/60,2)-3)*I21*$L$16*0.1*O21/100,\"--\")","v":"--"},{"$f":"IF(N21=\"RF\",ROUND(M21/60,2)*I21*$L$16*0.1,\"--\")","v":"--"},{"$f":"IF(N21=\"RR\",ROUND(M21/60,2)*I21*$L$16*0.1*O21/100,\"--\")","v":"--"},"SI",{"$f":"IF(F21=\"\",\"\",SUM(P21:Y21)*IF(Z21=\"SI\",1,2))","v":9047.3974799999996}]
[null,null,23,291392,3714,"LAS MADERAS - JUJUY SUR ",132,27.600000381469727,{"$f":"$G$16/100*IF(H22>25,H22,25)","v":128.25278577262878},"2015-08-18T13:22:00","2015-08-18T13:37:00",{"$f":"IF(F22=\"\",\"\",(K22-J22)*24)","v":0.25000000011641532},{"$f":"IF(F22=\"\",\"\",ROUND((K22-J22)*24*60,0))","v":15},"P",{"$f":"IF(F22=\"\",\"\",\"--\")","v":"--"},{"$f":"IF(N22=\"P\",ROUND(M22/60,2)*I22*$L$16*0.01,\"--\")","v":9.6189589329471588},{"$f":"IF(N22=\"RP\",I22*O22*ROUND(L22/60,2)*0.01*M22/100,\"--\")","v":"--"},{"$f":"IF(N22=\"F\",I22*$L$16,\"--\")","v":"--"},{"$f":"IF(AND(M22>10,N22=\"F\"),I22*$L$16*IF(M22>180,3,ROUND((M22)/60,2)),\"--\")","v":"--"},{"$f":"IF(AND(M22>180,N22=\"F\"),(ROUND(M22/60,2)-3)*I22*$L$16*0.1,\"--\")","v":"--"},{"$f":"IF(N22=\"R\",I22*$L$16*O22/100,\"--\")","v":"--"},{"$f":"IF(AND(M22>10,N22=\"R\"),I22*$L$16*O22/100*IF(M22>180,3,ROUND(M22/60,2)),\"--\")","v":"--"},{"$f":"IF(AND(M22>180,N22=\"R\"),(ROUND(M22/60,2)-3)*I22*$L$16*0.1*O22/100,\"--\")","v":"--"},{"$f":"IF(N22=\"RF\",ROUND(M22/60,2)*I22*$L$16*0.1,\"--\")","v":"--"},{"$f":"IF(N22=\"RR\",ROUND(M22/60,2)*I22*$L$16*0.1*O22/100,\"--\")","v":"--"},"SI",{"$f":"IF(F22=\"\",\"\",SUM(P22:Y22)*IF(Z22=\"SI\",1,2))","v":9.6189589329471588}]
[null,null,24,291393,5061,"SUNCHO CORRAL - QUIMILI",132,108,501.85872000000001,"2015-08-19T10:33:00","2015-08-19T14:18:00",3.75,225,"P","--",564.59105999999997,"--","--","--","--","--","--","--","--","--","SI",564.59105999999997]
[null,null,25,291395,5061,"SUNCHO CORRAL - QUIMILI",132,108,501.85872000000001,"2015-08-20T07:31:00","2015-08-20T14:11:00",6.6666666665696539,400,"P","--",1004.2192987200001,"--","--","--","--","--","--","--","--","--","SI",1004.2192987200001]
[null,null,26,291397,5061,"SUNCHO CORRAL - QUIMILI",132,108,501.85872000000001,"2015-08-21T07:34:00","2015-08-21T13:48:00",6.2333333332207985,374,"P","--",937.97394768000015,"--","--","--","--","--","--","--","--","--","SI",937.97394768000015]
[null,null,27,291401,279,"ESTATICA SUR - INDEPENDENCIA (O.F.)",132,2.5999999046325684,116.17100000000001,"2015-08-22T08:58:00","2015-08-22T19:56:00",10.96666666661622,658,"P","--",382.31876099999999,"--","--","--","--","--","--","--","--","--","SI",382.31876099999999]
[null,null,28,291402,5579,"ESTATICA - INDEPENDENCIA    2",132,3.1,116.17100000000001,"2015-08-22T08:58:00","2015-08-22T19:55:00",10.949999999895226,657,"P","--",381.621735,"--","--","--","--","--","--","--","--","--","SI",381.621735]
[null,null,29,291403,3617,"BELEN - TINOGASTA",132,72,334.57247999999998,"2015-08-23T06:47:00","2015-08-29T13:03:00",150.26666666666279,9016,"P","--",15082.86197088,"--","--","--","--","--","--","--","--","--","SI",15082.86197088]
[null,null,30,291404,3579,"ANDALGALA - BELEN",132,80.300003051757813,373.14126618103029,"2015-08-23T08:04:00","2015-08-29T12:37:00",148.54999999998836,8913,"P","--",16629.040527357614,"--","--","--","--","--","--","--","--","--","SI",16629.040527357614]
[null,null,31,291405,4902,"ANDALGALA - SAUJIL",132,76,353.15984000000003,"2015-08-23T08:27:00","2015-08-29T12:19:00",147.86666666669771,8872,"P","--",15666.523662240003,"--","--","--","--","--","--","--","--","--","SI",15666.523662240003]
[null,null,32,291407,4691,"VILLA QUINTEROS - ANDALGALA",132,102,473.97768000000002,"2015-08-23T09:11:00","2015-08-23T10:44:00",1.5499999999883585,93,"P","--",220.39962120000004,"--","--","--","--","--","--","--","--","--","SI",220.39962120000004]
[null,null,33,291785,272,"AGUILARES - ESCABA",132,27,125.46468,"2015-08-28T14:01:00","2015-08-28T14:09:00",0.13333333341870457,8,"F","--","--","--",3763.9404,"--","--","--","--","--","--","--","SI",3763.9404]
[null,null,34,291786,4691,"VILLA QUINTEROS - ANDALGALA",132,102,473.97768000000002,"2015-08-29T10:39:00","2015-08-29T11:41:00",1.03333333338378,62,"P","--",146.45910312000001,"--","--","--","--","--","--","--","--","--","SI",146.45910312000001]
[null,null,35,291795,309,"TUCUMAN OESTE - TUCUMAN NORTE",132,7,116.17100000000001,"2015-08-29T15:37:00","2015-08-29T22:32:00",6.9166666666860692,415,"F","--","--","--",3485.13,10455.39,1366.1709600000002,"--","--","--","--","--","SI",15306.69096]
[null,null,36,291817,272,"AGUILARES - ESCABA",132,27,125.46468,"2015-08-30T16:02:00","2015-08-30T18:02:00",1.9999999998835847,120,"F","--","--","--",3763.9404,7527.8807999999999,"--","--","--","--","--","--","SI",11291.8212]
[null,null,37,291818,4570,"INDEPENDENCIA TUC. - EL BRACHO 2",132,17.100000381469727,116.17100000000001,"2015-08-30T17:55:00","2015-08-30T19:37:00",1.6999999999534339,102,"F","--","--","--",3485.13,5924.7210000000005,"--","--","--","--","--","--","SI",9409.8510000000006]
[null,null,38,291819,286,"INDEPENDENCIA TUC. - EL BRACHO 1",132,17.100000381469727,116.17100000000001,"2015-08-31T15:48:00","2015-08-31T17:16:00",1.4666666667326353,88,"F","--","--","--",3485.13,5123.1410999999998,"--","--","--","--","--","--","SI",8608.2710999999999]
[null,null,39,291820,4570,"INDEPENDENCIA TUC. - EL BRACHO 2",132,17.100000381469727,116.17100000000001,"2015-08-31T15:48:00","2015-08-31T17:16:00",{"$f":"IF(F38=\"\",\"\",(K38-J38)*24)","v":1.4666666667326353},{"$f":"IF(F38=\"\",\"\",ROUND((K38-J38)*24*60,0))","v":88},"F",{"$f":"IF(F38=\"\",\"\",\"--\")","v":"--"},{"$f":"IF(N38=\"P\",ROUND(M38/60,2)*I38*$L$16*0.01,\"--\")","v":"--"},{"$f":"IF(N38=\"RP\",I38*O38*ROUND(L38/60,2)*0.01*M38/100,\"--\")","v":"--"},{"$f":"IF(N38=\"F\",I38*$L$16,\"--\")","v":3485.13},{"$f":"IF(AND(M38>10,N38=\"F\"),I38*$L$16*IF(M38>180,3,ROUND((M38)/60,2)),\"--\")","v":5123.1410999999998},{"$f":"IF(AND(M38>180,N38=\"F\"),(ROUND(M38/60,2)-3)*I38*$L$16*0.1,\"--\")","v":"--"},{"$f":"IF(N38=\"R\",I38*$L$16*O38/100,\"--\")","v":"--"},{"$f":"IF(AND(M38>10,N38=\"R\"),I38*$L$16*O38/100*IF(M38>180,3,ROUND(M38/60,2)),\"--\")","v":"--"},{"$f":"IF(AND(M38>180,N38=\"R\"),(ROUND(M38/60,2)-3)*I38*$L$16*0.1*O38/100,\"--\")","v":"--"},{"$f":"IF(N38=\"RF\",ROUND(M38/60,2)*I38*$L$16*0.1,\"--\")","v":"--"},{"$f":"IF(N38=\"RR\",ROUND(M38/60,2)*I38*$L$16*0.1*O38/100,\"--\")","v":"--"},"SI",{"$f":"IF(F38=\"\",\"\",SUM(P38:Y38)*IF(Z38=\"SI\",1,2))","v":8608.2710999999999}]
[null,null,null,null,null,null,null,null,116.17100000000001,null,null,{"$f":"IF(F39=\"\",\"\",(K39-J39)*24)","v":""},{"$f":"IF(F39=\"\",\"\",ROUND((K39-J39)*24*60,0))","v":""},null,{"$f":"IF(F39=\"\",\"\",\"--\")","v":""},{"$f":"IF(N39=\"P\",ROUND(M39/60,2)*I39*$L$16*0.01,\"--\")","v":"--"},{"$f":"IF(N39=\"RP\",I39*O39*ROUND(L39/60,2)*0.01*M39/100,\"--\")","v":"--"},{"$f":"IF(N39=\"F\",I39*$L$16,\"--\")","v":"--"},{"$f":"IF(AND(M39>10,N39=\"F\"),I39*$L$16*IF(M39>180,3,ROUND((M39)/60,2)),\"--\")","v":"--"},{"$f":"IF(AND(M39>180,N39=\"F\"),(ROUND(M39/60,2)-3)*I39*$L$16*0.1,\"--\")","v":"--"},{"$f":"IF(N39=\"R\",I39*$L$16*O39/100,\"--\")","v":"--"},{"$f":"IF(AND(M39>10,N39=\"R\"),I39*$L$16*O39/100*IF(M39>180,3,ROUND(M39/60,2)),\"--\")","v":"--"},{"$f":"IF(AND(M39>180,N39=\"R\"),(ROUND(M39/60,2)-3)*I39*$L$16*0.1*O39/100,\"--\")","v":"--"},{"$f":"IF(N39=\"RF\",ROUND(M39/60,2)*I39*$L$16*0.1,\"--\")","v":"--"},{"$f":"IF(N39=\"RR\",ROUND(M39/60,2)*I39*$L$16*0.1*O39/100,\"--\")","v":"--"},{"$f":"IF(F39=\"\",\"\",\"SI\")","v":""},{"$f":"IF(F39=\"\",\"\",SUM(P39:Y39)*IF(Z39=\"SI\",1,2))","v":""}]
[null,null,null,null,null,null,null,null,116.17100000000001,null,null,{"$f":"IF(F40=\"\",\"\",(K40-J40)*24)","v":""},{"$f":"IF(F40=\"\",\"\",ROUND((K40-J40)*24*60,0))","v":""},null,{"$f":"IF(F40=\"\",\"\",\"--\")","v":""},{"$f":"IF(N40=\"P\",ROUND(M40/60,2)*I40*$L$16*0.01,\"--\")","v":"--"},{"$f":"IF(N40=\"RP\",I40*O40*ROUND(L40/60,2)*0.01*M40/100,\"--\")","v":"--"},{"$f":"IF(N40=\"F\",I40*$L$16,\"--\")","v":"--"},{"$f":"IF(AND(M40>10,N40=\"F\"),I40*$L$16*IF(M40>180,3,ROUND((M40)/60,2)),\"--\")","v":"--"},{"$f":"IF(AND(M40>180,N40=\"F\"),(ROUND(M40/60,2)-3)*I40*$L$16*0.1,\"--\")","v":"--"},{"$f":"IF(N40=\"R\",I40*$L$16*O40/100,\"--\")","v":"--"},{"$f":"IF(AND(M40>10,N40=\"R\"),I40*$L$16*O40/100*IF(M40>180,3,ROUND(M40/60,2)),\"--\")","v":"--"},{"$f":"IF(AND(M40>180,N40=\"R\"),(ROUND(M40/60,2)-3)*I40*$L$16*0.1*O40/100,\"--\")","v":"--"},{"$f":"IF(N40=\"RF\",ROUND(M40/60,2)*I40*$L$16*0.1,\"--\")","v":"--"},{"$f":"IF(N40=\"RR\",ROUND(M40/60,2)*I40*$L$16*0.1*O40/100,\"--\")","v":"--"},{"$f":"IF(F40=\"\",\"\",\"SI\")","v":""},{"$f":"IF(F40=\"\",\"\",SUM(P40:Y40)*IF(Z40=\"SI\",1,2))","v":""}]
[]
[null,null,"(²)","P - PROGRAMADA  ;  F - FORZADA",null,null,null,null,null,null,null,null,null,null,null,{"$f":"SUM(P19:P41)","v":51025.628646130564},0,29135.686800000003,35534.385479999997,1366.1709600000002,0,0,0,0,0,null,{"$f":"ROUND(SUM(AA19:AA41),2)","v":337954.27}]

{"sheet":"T-08 (1)","index":3,"n_rows":47,"n_cols":29,"rows_kept":47,"cut":false,"hidden":false,"merged":[]}
[]
[null,{"$f":"+'TOT-0815'!B2","v":"ANEXO V   al Memorandum   D.T.E.E. N°  526  / 2016"}]
[]
[" ENTE NACIONAL REGULADOR "]
["       DE LA ELECTRICIDAD"]
[]
[]
[null,null,null,null,null,"SISTEMA DE TRANSPORTE DE ENERGÍA ELÉCTRICA POR DISTRIBUCIÓN TRONCAL - TRANSNOA S.A."]
[]
[null,null,null,null,null,"2.- CONEXIÓN"]
[]
[null,null,null,null,null,"2.1.- Transformación"]
[]
[null,null,null,null,null,"2.1.1.- Equipamiento propio"]
[]
[null,{"$f":"'TOT-0815'!B14","v":"Desde el 01 al 31 de agosto de 2015"}]
[]
[null,null,null,null,null,"Por Transformador por MVA    $ =",null,null,1.617]
[null,null,null,null,null,"Coeficiente de penalización por salida forzada   =",null,null,{"$f":"30*'TOT-0815'!B13","v":30},null,{"$f":"IF(I19=30,\" \",IF(I19=60,\"  Coeficiente duplicado por tasa de falla >4 Sal. x año/100 km.\",\"REVISAR COEFICIENTE\"))","v":" "}]
[null,null,3,4,5,6,7,8,9,10,11,12,13,14,15,16,17,18,19,20,21,22,23,24,25,26,27,28,29]
[null,null,"N°","INDISP","ID EQUIPO","ESTACIÓN\nTRANSFORMADORA","EQUIPO","POT.\n[MVA]","U\n[kV]","$/h","Salida","Entrada","Hs\nIndisp.","Mtos.\nIndisp.","Tipo \nSal.(²)","AUT.","C.R.\n%","E.N.S.","K (P;ENS)","PENALIZ.\nPROGRAM.","REDUCC.\nPROGRAM.","PENALIZAC. FORZADA\nPor Salida       hs. Restantes",null,"REDUCC. FORZADA\nPor Salida       hs. Restantes",null,"RESTANTE\nFORZADA","REDUCC.\nRESTANTE","Informó\nen Térm.","TOTAL\nPENALIZAC."]
[]
[]
[]
[null,null,41,289244,3581,"ANDALGALA","TRAFO 2",15,"132/33/13,2",{"$f":"H25*$I$18","v":24.254999999999999},"2015-08-01","2015-08-20T12:18:00",{"$f":"IF(F25=\"\",\"\",(L25-K25)*24)","v":468.29999999993015},{"$f":"IF(F25=\"\",\"\",ROUND((L25-K25)*24*60,0))","v":28098},"P",{"$f":"IF(F25=\"\",\"\",IF(OR(O25=\"P\",O25=\"RP\"),\"--\",\"NO\"))","v":"--"},"0,000","NO",{"$f":"$I$19*IF(R25=\"SI\",1,0.1)*IF(OR(O25=\"P\",O25=\"RP\"),0.1,1)","v":0.30000000000000004},{"$f":"IF(O25=\"P\",J25*S25*ROUND(N25/60,2),\"--\")","v":3407.5849500000004},{"$f":"IF(O25=\"RP\",J25*S25*Q25/100*ROUND(N25/60,2),\"--\")","v":"--"},{"$f":"IF(AND(O25=\"F\",P25=\"NO\"),J25*S25,\"--\")","v":"--"},{"$f":"IF(O25=\"F\",J25*S25*ROUND(N25/60,2),\"--\")","v":"--"},{"$f":"IF(AND(O25=\"R\",P25=\"NO\"),J25*S25*Q25/100,\"--\")","v":"--"},{"$f":"IF(O25=\"R\",J25*S25*ROUND(N25/60,2)*Q25/100,\"--\")","v":"--"},{"$f":"IF(O25=\"RF\",J25*S25*ROUND(N25/60,2),\"--\")","v":"--"},{"$f":"IF(O25=\"RR\",J25*S25*ROUND(N25/60,2)*Q25/100,\"--\")","v":"--"},"SI",{"$f":"IF(F25=\"\",\"\",SUM(T25:AA25)*IF(AB25=\"SI\",1,2))","v":3407.5849500000004}]
[null,null,42,291113,5584,"FERNANDEZ","TRAFO 1",15,"132/33/13,2",{"$f":"H26*$I$18","v":24.254999999999999},"2015-08-01","2015-08-27T14:41:00",{"$f":"IF(F26=\"\",\"\",(L26-K26)*24)","v":638.68333333334886},{"$f":"IF(F26=\"\",\"\",ROUND((L26-K26)*24*60,0))","v":38321},"P",{"$f":"IF(F26=\"\",\"\",IF(OR(O26=\"P\",O26=\"RP\"),\"--\",\"NO\"))","v":"--"},"0,000","NO",{"$f":"$I$19*IF(R26=\"SI\",1,0.1)*IF(OR(O26=\"P\",O26=\"RP\"),0.1,1)","v":0.30000000000000004},{"$f":"IF(O26=\"P\",J26*S26*ROUND(N26/60,2),\"--\")","v":4647.35502},{"$f":"IF(O26=\"RP\",J26*S26*Q26/100*ROUND(N26/60,2),\"--\")","v":"--"},{"$f":"IF(AND(O26=\"F\",P26=\"NO\"),J26*S26,\"--\")","v":"--"},{"$f":"IF(O26=\"F\",J26*S26*ROUND(N26/60,2),\"--\")","v":"--"},{"$f":"IF(AND(O26=\"R\",P26=\"NO\"),J26*S26*Q26/100,\"--\")","v":"--"},{"$f":"IF(O26=\"R\",J26*S26*ROUND(N26/60,2)*Q26/100,\"--\")","v":"--"},{"$f":"IF(O26=\"RF\",J26*S26*ROUND(N26/60,2),\"--\")","v":"--"},{"$f":"IF(O26=\"RR\",J26*S26*ROUND(N26/60,2)*Q26/100,\"--\")","v":"--"},"SI",{"$f":"IF(F26=\"\",\"\",SUM(T26:AA26)*IF(AB26=\"SI\",1,2))","v":4647.35502}]
[null,null,43,290635,542,"ESTATICA SUR ","TRAFO 1",30,"132/13,2",{"$f":"H27*$I$18","v":48.51},"2015-08-01","2015-08-31T14:16:00",{"$f":"IF(F27=\"\",\"\",(L27-K27)*24)","v":734.26666666672099},{"$f":"IF(F27=\"\",\"\",ROUND((L27-K27)*24*60,0))","v":44056},"F",{"$f":"IF(F27=\"\",\"\",IF(OR(O27=\"P\",O27=\"RP\"),\"--\",\"NO\"))","v":"NO"},"0,000","NO",{"$f":"$I$19*IF(R27=\"SI\",1,0.1)*IF(OR(O27=\"P\",O27=\"RP\"),0.1,1)","v":3},{"$f":"IF(O27=\"P\",J27*S27*ROUND(N27/60,2),\"--\")","v":"--"},{"$f":"IF(O27=\"RP\",J27*S27*Q27/100*ROUND(N27/60,2),\"--\")","v":"--"},{"$f":"IF(AND(O27=\"F\",P27=\"NO\"),J27*S27,\"--\")","v":145.53},{"$f":"IF(O27=\"F\",J27*S27*ROUND(N27/60,2),\"--\")","v":106858.3131},{"$f":"IF(AND(O27=\"R\",P27=\"NO\"),J27*S27*Q27/100,\"--\")","v":"--"},{"$f":"IF(O27=\"R\",J27*S27*ROUND(N27/60,2)*Q27/100,\"--\")","v":"--"},{"$f":"IF(O27=\"RF\",J27*S27*ROUND(N27/60,2),\"--\")","v":"--"},{"$f":"IF(O27=\"RR\",J27*S27*ROUND(N27/60,2)*Q27/100,\"--\")","v":"--"},"SI",{"$f":"IF(F27=\"\",\"\",SUM(T27:AA27)*IF(AB27=\"SI\",1,2))","v":107003.8431}]
[null,null,44,290649,5567,"ESTATICA","TRAFO 3",30,"132/13,2",{"$f":"H28*$I$18","v":48.51},"2015-08-01T11:38:00","2015-08-01T18:15:00",{"$f":"IF(F28=\"\",\"\",(L28-K28)*24)","v":6.6166666665812954},{"$f":"IF(F28=\"\",\"\",ROUND((L28-K28)*24*60,0))","v":397},"P",{"$f":"IF(F28=\"\",\"\",IF(OR(O28=\"P\",O28=\"RP\"),\"--\",\"NO\"))","v":"--"},"0,000","NO",{"$f":"$I$19*IF(R28=\"SI\",1,0.1)*IF(OR(O28=\"P\",O28=\"RP\"),0.1,1)","v":0.30000000000000004},{"$f":"IF(O28=\"P\",J28*S28*ROUND(N28/60,2),\"--\")","v":96.340860000000006},{"$f":"IF(O28=\"RP\",J28*S28*Q28/100*ROUND(N28/60,2),\"--\")","v":"--"},{"$f":"IF(AND(O28=\"F\",P28=\"NO\"),J28*S28,\"--\")","v":"--"},{"$f":"IF(O28=\"F\",J28*S28*ROUND(N28/60,2),\"--\")","v":"--"},{"$f":"IF(AND(O28=\"R\",P28=\"NO\"),J28*S28*Q28/100,\"--\")","v":"--"},{"$f":"IF(O28=\"R\",J28*S28*ROUND(N28/60,2)*Q28/100,\"--\")","v":"--"},{"$f":"IF(O28=\"RF\",J28*S28*ROUND(N28/60,2),\"--\")","v":"--"},{"$f":"IF(O28=\"RR\",J28*S28*ROUND(N28/60,2)*Q28/100,\"--\")","v":"--"},"SI",{"$f":"IF(F28=\"\",\"\",SUM(T28:AA28)*IF(AB28=\"SI\",1,2))","v":96.340860000000006}]
[null,null,45,290650,544,"ESTATICA SUR ","TRAFO 2",30,"132/13,2",{"$f":"H29*$I$18","v":48.51},"2015-08-01T11:40:00","2015-08-01T17:25:00",{"$f":"IF(F29=\"\",\"\",(L29-K29)*24)","v":5.7500000000582077},{"$f":"IF(F29=\"\",\"\",ROUND((L29-K29)*24*60,0))","v":345},"P",{"$f":"IF(F29=\"\",\"\",IF(OR(O29=\"P\",O29=\"RP\"),\"--\",\"NO\"))","v":"--"},"0,000","NO",{"$f":"$I$19*IF(R29=\"SI\",1,0.1)*IF(OR(O29=\"P\",O29=\"RP\"),0.1,1)","v":0.30000000000000004},{"$f":"IF(O29=\"P\",J29*S29*ROUND(N29/60,2),\"--\")","v":83.679749999999999},{"$f":"IF(O29=\"RP\",J29*S29*Q29/100*ROUND(N29/60,2),\"--\")","v":"--"},{"$f":"IF(AND(O29=\"F\",P29=\"NO\"),J29*S29,\"--\")","v":"--"},{"$f":"IF(O29=\"F\",J29*S29*ROUND(N29/60,2),\"--\")","v":"--"},{"$f":"IF(AND(O29=\"R\",P29=\"NO\"),J29*S29*Q29/100,\"--\")","v":"--"},{"$f":"IF(O29=\"R\",J29*S29*ROUND(N29/60,2)*Q29/100,\"--\")","v":"--"},{"$f":"IF(O29=\"RF\",J29*S29*ROUND(N29/60,2),\"--\")","v":"--"},{"$f":"IF(O29=\"RR\",J29*S29*ROUND(N29/60,2)*Q29/100,\"--\")","v":"--"},"SI",{"$f":"IF(F29=\"\",\"\",SUM(T29:AA29)*IF(AB29=\"SI\",1,2))","v":83.679749999999999}]
[null,null,46,290652,2638,"JUJUY ESTE","TRAFO 2",15,"132/33/13,2",{"$f":"H30*$I$18","v":24.254999999999999},"2015-08-02T07:47:00","2015-08-02T11:28:00",{"$f":"IF(F30=\"\",\"\",(L30-K30)*24)","v":3.6833333332906477},{"$f":"IF(F30=\"\",\"\",ROUND((L30-K30)*24*60,0))","v":221},"P",{"$f":"IF(F30=\"\",\"\",IF(OR(O30=\"P\",O30=\"RP\"),\"--\",\"NO\"))","v":"--"},"0,000","NO",{"$f":"$I$19*IF(R30=\"SI\",1,0.1)*IF(OR(O30=\"P\",O30=\"RP\"),0.1,1)","v":0.30000000000000004},{"$f":"IF(O30=\"P\",J30*S30*ROUND(N30/60,2),\"--\")","v":26.777520000000003},{"$f":"IF(O30=\"RP\",J30*S30*Q30/100*ROUND(N30/60,2),\"--\")","v":"--"},{"$f":"IF(AND(O30=\"F\",P30=\"NO\"),J30*S30,\"--\")","v":"--"},{"$f":"IF(O30=\"F\",J30*S30*ROUND(N30/60,2),\"--\")","v":"--"},{"$f":"IF(AND(O30=\"R\",P30=\"NO\"),J30*S30*Q30/100,\"--\")","v":"--"},{"$f":"IF(O30=\"R\",J30*S30*ROUND(N30/60,2)*Q30/100,\"--\")","v":"--"},{"$f":"IF(O30=\"RF\",J30*S30*ROUND(N30/60,2),\"--\")","v":"--"},{"$f":"IF(O30=\"RR\",J30*S30*ROUND(N30/60,2)*Q30/100,\"--\")","v":"--"},"SI",{"$f":"IF(F30=\"\",\"\",SUM(T30:AA30)*IF(AB30=\"SI\",1,2))","v":26.777520000000003}]
[null,null,47,290653,2804,"CEVIL POZO","TRAFO 1",30,"132/33/13,2",48.51,"2015-08-02T08:04:00","2015-08-02T14:04:00",6,360,"P","--","0,000","NO",0.30000000000000004,87.318000000000012,"--","--","--","--","--","--","--","SI",87.318000000000012]
[null,null,48,290654,5406,"CEVIL POZO","TRAFO 3",30,"132/33/13,2",48.51,"2015-08-02T08:04:00","2015-08-02T14:04:00",6,360,"P","--","0,000","NO",0.30000000000000004,87.318000000000012,"--","--","--","--","--","--","--","SI",87.318000000000012]
[null,null,49,290655,3125,"CEVIL POZO","TRAFO 2",30,"132/33/13,2",48.51,"2015-08-02T08:05:00","2015-08-02T14:04:00",5.9833333332790062,359,"P","--","0,000","NO",0.30000000000000004,87.02694000000001,"--","--","--","--","--","--","--","SI",87.02694000000001]
[null,null,50,290656,3226,"AVELLANEDA","TRAFO 1",30,"132/13,2",48.51,"2015-08-02T08:10:00","2015-08-02T14:15:00",6.0833333332557231,365,"P","--","0,000","NO",0.30000000000000004,88.482240000000004,"--","--","--","--","--","--","--","SI",88.482240000000004]
[null,null,51,290657,3233,"AVELLANEDA","TRAFO 2",30,"132/13,2",48.51,"2015-08-02T08:11:00","2015-08-02T14:16:00",6.0833333334303461,365,"P","--","0,000","NO",0.30000000000000004,88.482240000000004,"--","--","--","--","--","--","--","SI",88.482240000000004]
[null,null,52,290663,3836,"HUACRA ","TRAFO 1",15,"132/33/13,2",24.254999999999999,"2015-08-02T18:59:00","2015-08-02T19:40:00",0.68333333329064772,41,"R","NO",40,"SI",30,"--","--","--","--",291.06,197.92080000000001,"--","--","SI",488.98080000000004]
[null,null,53,291013,544,"ESTATICA","TRAFO 2",30,"132/13,2",48.51,"2015-08-03T00:19:00","2015-08-03T00:55:00",0.6000000000349246,36,"F","NO","0,000","SI",30,"--","--",1455.3,873.18,"--","--","--","--","SI",2328.48]
[null,null,54,291025,5063,"QUIMILI","TRAFO 2",15,"132/33/13,2",24.254999999999999,"2015-08-05T13:40:00","2015-08-05T14:28:00",0.79999999998835847,48,"F","NO","0,000","SI",30,"--","--",727.65,582.12,"--","--","--","--","SI",1309.77]
[null,null,55,291064,3694,"SANTIAGO CENTRO ","TRAFO 1",30,"132/33/13,2",48.51,"2015-08-06T12:46:00","2015-08-06T12:52:00",9.9999999976716936E-2,6,"R","NO",60,"SI",30,"--","--","--","--",873.18,87.317999999999998,"--","--","SI",960.49799999999993]
[null,null,56,291065,3105,"SANTIAGO CENTRO ","TRAFO 2",30,"132/33/13,2",48.51,"2015-08-06T12:46:00","2015-08-06T12:52:00",9.9999999976716936E-2,6,"R","NO",60,"SI",30,"--","--","--","--",873.18,87.317999999999998,"--","--","SI",960.49799999999993]
[null,null,57,291075,4956,"LA PAZ","TRAFO 1",10,"132/33/13,2",16.170000000000002,"2015-08-08T13:58:00","2015-08-08T14:38:00",0.66666666674427688,40,"R","NO",60,"SI",30,"--","--","--","--",291.06,195.01020000000005,"--","--","SI",486.07020000000006]
[null,null,58,291078,4228,"SUNCHO CORRAL","TRP2",15,"132/33/13,2",24.254999999999999,"2015-08-09T17:01:00","2015-08-09T18:16:00",1.2500000000582077,75,"F","NO","0,000","SI",30,"--","--",727.65,909.5625,"--","--","--","--","SI",1637.2125000000001]
[null,null,178,"291078b",4228,"SUNCHO CORRAL","TRP2",15,"132/33/13,2",24.254999999999999,"2015-08-09T18:17:00","2015-08-10T23:59:00",{"$f":"IF(F43=\"\",\"\",(L43-K43)*24)","v":29.699999999895226},{"$f":"IF(F43=\"\",\"\",ROUND((L43-K43)*24*60,0))","v":1782},"F","NO","0,000","NO",3,{"$f":"IF(O43=\"P\",J43*S43*ROUND(N43/60,2),\"--\")","v":"--"},{"$f":"IF(O43=\"RP\",J43*S43*Q43/100*ROUND(N43/60,2),\"--\")","v":"--"},{"$f":"IF(AND(O43=\"F\",P43=\"NO\"),J43*S43,\"--\")","v":72.765000000000001},{"$f":"IF(O43=\"F\",J43*S43*ROUND(N43/60,2),\"--\")","v":2161.1205},{"$f":"IF(AND(O43=\"R\",P43=\"NO\"),J43*S43*Q43/100,\"--\")","v":"--"},{"$f":"IF(O43=\"R\",J43*S43*ROUND(N43/60,2)*Q43/100,\"--\")","v":"--"},{"$f":"IF(O43=\"RF\",J43*S43*ROUND(N43/60,2),\"--\")","v":"--"},{"$f":"IF(O43=\"RR\",J43*S43*ROUND(N43/60,2)*Q43/100,\"--\")","v":"--"},"SI",{"$f":"IF(F43=\"\",\"\",SUM(T43:AA43)*IF(AB43=\"SI\",1,2))","v":2233.8854999999999}]
[null,null,179,"291078c",4228,"SUNCHO CORRAL","TRP2",15,"132/33/13,2",24.254999999999999,"2015-08-11","2015-08-31T23:59:59",{"$f":"IF(F44=\"\",\"\",(L44-K44)*24)","v":503.99972222215729},{"$f":"IF(F44=\"\",\"\",ROUND((L44-K44)*24*60,0))","v":30240},"P","--","0,000","NO",0.30000000000000004,{"$f":"IF(O44=\"P\",J44*S44*ROUND(N44/60,2),\"--\")","v":3667.3560000000002},{"$f":"IF(O44=\"RP\",J44*S44*Q44/100*ROUND(N44/60,2),\"--\")","v":"--"},{"$f":"IF(AND(O44=\"F\",P44=\"NO\"),J44*S44,\"--\")","v":"--"},{"$f":"IF(O44=\"F\",J44*S44*ROUND(N44/60,2),\"--\")","v":"--"},{"$f":"IF(AND(O44=\"R\",P44=\"NO\"),J44*S44*Q44/100,\"--\")","v":"--"},{"$f":"IF(O44=\"R\",J44*S44*ROUND(N44/60,2)*Q44/100,\"--\")","v":"--"},{"$f":"IF(O44=\"RF\",J44*S44*ROUND(N44/60,2),\"--\")","v":"--"},{"$f":"IF(O44=\"RR\",J44*S44*ROUND(N44/60,2)*Q44/100,\"--\")","v":"--"},"SI",{"$f":"IF(F44=\"\",\"\",SUM(T44:AA44)*IF(AB44=\"SI\",1,2))","v":3667.3560000000002}]
[null,null,59,291141,540,"C.H. RIO HONDO ","TRAFO 1",10,"132/33/13,2",16.170000000000002,"2015-08-11T09:40:00","2015-08-11T16:09:00",6.4833333333372138,389,"P","--","0,000","NO",0.30000000000000004,31.434480000000008,"--","--","--","--","--","--","--","SI",31.434480000000008]
[]
[null,null,"(²)","P - PROGRAMADA  ;  F - FORZADA  ; R - REDUCCIÓN FORZADA  ; RR - REDUCCIÓN RESTANTE",null,null,null,null,null,null,null,null,null,null,null,null,null,null,null,{"$f":"SUM(T22:T46)","v":12399.155999999997},0,3128.895,111384.29609999999,2328.48,567.56700000000001,0,0,null,{"$f":"ROUND(SUM(AC22:AC46),2)","v":129808.39}]

{"sheet":"T-08 (2)","index":4,"n_rows":46,"n_cols":29,"rows_kept":46,"cut":false,"hidden":false,"merged":[]}
[]
[null,{"$f":"+'TOT-0815'!B2","v":"ANEXO V   al Memorandum   D.T.E.E. N°  526  / 2016"}]
[]
[" ENTE NACIONAL REGULADOR "]
["       DE LA ELECTRICIDAD"]
[]
[]
[null,null,null,null,null,"SISTEMA DE TRANSPORTE DE ENERGÍA ELÉCTRICA POR DISTRIBUCIÓN TRONCAL - TRANSNOA S.A."]
[]
[null,null,null,null,null,"2.- CONEXIÓN"]
[]
[null,null,null,null,null,"2.1.- Transformación"]
[]
[null,null,null,null,null,"2.1.1.- Equipamiento propio"]
[]
[null,{"$f":"'TOT-0815'!B14","v":"Desde el 01 al 31 de agosto de 2015"}]
[]
[null,null,null,null,null,"Por Transformador por MVA    $ =",null,null,1.617,null,0.61060000000000003,"Res. SE 1/03"]
[null,null,null,null,null,"Coeficiente de penalización por salida forzada   =",null,null,{"$f":"30*'TOT-0815'!B13","v":30},null,{"$f":"IF(I19=30,\" \",IF(I19=60,\"  Coeficiente duplicado por tasa de falla >4 Sal. x año/100 km.\",\"REVISAR COEFICIENTE\"))","v":" "}]
[null,null,3,4,5,6,7,8,9,10,11,12,13,14,15,16,17,18,19,20,21,22,23,24,25,26,27,28,29]
[null,null,"N°","INDISP","ID EQUIPO","ESTACIÓN\nTRANSFORMADORA","EQUIPO","POT.\n[MVA]","U\n[kV]","$/h","Salida","Entrada","Hs\nIndisp.","Mtos.\nIndisp.","Tipo \nSal.(²)","AUT.","C.R.\n%","E.N.S.","K (P;ENS)","PENALIZ.\nPROGRAM.","REDUCC.\nPROGRAM.","PENALIZAC. FORZADA\nPor Salida       hs. Restantes",null,"REDUCC. FORZADA\nPor Salida       hs. Restantes",null,"RESTANTE\nFORZADA","REDUCC.\nRESTANTE","Informó\nen Térm.","TOTAL\nPENALIZAC."]
[null,null,null,null,null,null,null,null,null,null,null,null,null,null,null,null,null,null,null,null,null,null,null,null,null,null,null,null,{"$f":"'T-08 (1)'!AC47","v":129808.39}]
[]
[null,null,60,291150,5232,"RIO HONDO","TRAFO 2",15,"132/33/13,2",{"$f":"H24*$I$18","v":24.254999999999999},"2015-08-12T08:24:00","2015-08-12T14:14:00",{"$f":"IF(F24=\"\",\"\",(L24-K24)*24)","v":5.8333333333139308},{"$f":"IF(F24=\"\",\"\",ROUND((L24-K24)*24*60,0))","v":350},"P",{"$f":"IF(F24=\"\",\"\",IF(OR(O24=\"P\",O24=\"RP\"),\"--\",\"NO\"))","v":"--"},"0,000","NO",{"$f":"$I$19*IF(R24=\"SI\",1,0.1)*IF(OR(O24=\"P\",O24=\"RP\"),0.1,1)","v":0.30000000000000004},{"$f":"IF(O24=\"P\",J24*S24*ROUND(N24/60,2),\"--\")","v":42.421995000000003},{"$f":"IF(O24=\"RP\",J24*S24*Q24/100*ROUND(N24/60,2),\"--\")","v":"--"},{"$f":"IF(AND(O24=\"F\",P24=\"NO\"),J24*S24,\"--\")","v":"--"},{"$f":"IF(O24=\"F\",J24*S24*ROUND(N24/60,2),\"--\")","v":"--"},{"$f":"IF(AND(O24=\"R\",P24=\"NO\"),J24*S24*Q24/100,\"--\")","v":"--"},{"$f":"IF(O24=\"R\",J24*S24*ROUND(N24/60,2)*Q24/100,\"--\")","v":"--"},{"$f":"IF(O24=\"RF\",J24*S24*ROUND(N24/60,2),\"--\")","v":"--"},{"$f":"IF(O24=\"RR\",J24*S24*ROUND(N24/60,2)*Q24/100,\"--\")","v":"--"},"SI",{"$f":"IF(F24=\"\",\"\",SUM(T24:AA24)*IF(AB24=\"SI\",1,2))","v":42.421995000000003}]
[null,null,61,291151,2668,"JUJUY ESTE","TRAFO 1",15,"132/33/13,2",{"$f":"H25*$I$18","v":24.254999999999999},"2015-08-12T09:11:00","2015-08-12T13:07:00",3.9333333332324401,236,"R","NO",60,"NO",3,"--","--","--","--",43.658999999999999,171.57987,"--","--","SI",215.23886999999999]
[null,null,62,291152,5062,"QUIMILI","TRAFO 1",15,"132/33/13,2",{"$f":"H26*$I$18","v":24.254999999999999},"2015-08-12T15:40:00","2015-08-12T16:30:00",0.83333333325572312,50,"R","NO",40,"NO",3,"--","--","--","--",29.105999999999998,24.157979999999998,"--","--","SI",53.263979999999997]
[null,null,63,291153,5232,"RIO HONDO","TRAFO 2",15,"132/33/13,2",{"$f":"H27*$I$18","v":24.254999999999999},"2015-08-13T08:09:00","2015-08-13T16:02:00",7.8833333333604969,473,"P","--","0,000","NO",0.30000000000000004,57.338820000000005,"--","--","--","--","--","--","--","SI",57.338820000000005]
[null,null,64,291154,3946,"CATAMARCA II","TRAFO 1",30,"132/33/13,2",{"$f":"H28*$I$18","v":48.51},"2015-08-13T12:07:00","2015-08-13T12:26:00",0.31666666665114462,19,"F","NO","0,000","SI",30,"--","--",1455.3,465.69599999999997,"--","--","--","--","SI",1920.9959999999999]
[null,null,65,291155,4517,"CATAMARCA II(Res SE 1/03)","TRAFO 2",30,"132/33/13,2",{"$f":"H29*$K$18","v":18.318000000000001},"2015-08-13T12:07:00","2015-08-13T12:26:00",0.31666666665114462,19,"F","NO","0,000","SI",30,"--","--",549.54000000000008,175.85280000000003,"--","--","--","--","SI",725.39280000000008]
[null,null,66,291158,4989,"FRIAS","TRAFO 2",30,"132/33/13,2",{"$f":"H30*$I$18","v":48.51},"2015-08-16T07:17:00","2015-08-16T09:29:00",{"$f":"IF(F30=\"\",\"\",(L30-K30)*24)","v":2.2000000000116415},{"$f":"IF(F30=\"\",\"\",ROUND((L30-K30)*24*60,0))","v":132},"P",{"$f":"IF(F30=\"\",\"\",IF(OR(O30=\"P\",O30=\"RP\"),\"--\",\"NO\"))","v":"--"},"0,000","SI",{"$f":"$I$19*IF(R30=\"SI\",1,0.1)*IF(OR(O30=\"P\",O30=\"RP\"),0.1,1)","v":3},{"$f":"IF(O30=\"P\",J30*S30*ROUND(N30/60,2),\"--\")","v":320.16600000000005},{"$f":"IF(O30=\"RP\",J30*S30*Q30/100*ROUND(N30/60,2),\"--\")","v":"--"},{"$f":"IF(AND(O30=\"F\",P30=\"NO\"),J30*S30,\"--\")","v":"--"},{"$f":"IF(O30=\"F\",J30*S30*ROUND(N30/60,2),\"--\")","v":"--"},{"$f":"IF(AND(O30=\"R\",P30=\"NO\"),J30*S30*Q30/100,\"--\")","v":"--"},{"$f":"IF(O30=\"R\",J30*S30*ROUND(N30/60,2)*Q30/100,\"--\")","v":"--"},{"$f":"IF(O30=\"RF\",J30*S30*ROUND(N30/60,2),\"--\")","v":"--"},{"$f":"IF(O30=\"RR\",J30*S30*ROUND(N30/60,2)*Q30/100,\"--\")","v":"--"},"SI",{"$f":"IF(F30=\"\",\"\",SUM(T30:AA30)*IF(AB30=\"SI\",1,2))","v":320.16600000000005}]
[null,null,67,291159,5229,"FRIAS","TRAFO 1",30,"132/33/13,2",48.51,"2015-08-16T07:18:00","2015-08-16T10:03:00",2.7499999998835847,165,"P","--","0,000","SI",3,400.20749999999998,"--","--","--","--","--","--","--","SI",400.20749999999998]
[null,null,68,291377,4062,"JUJUY SUR ","TRAFO 2",30,"132/33/13,2",48.51,"2015-08-17T08:19:00","2015-08-17T12:53:00",4.5666666667093523,274,"P","--","0,000","NO",0.30000000000000004,66.507210000000015,"--","--","--","--","--","--","--","SI",66.507210000000015]
[null,null,69,291383,4062,"JUJUY SUR ","TRAFO 2",30,"132/33/13,2",48.51,"2015-08-17T13:55:00","2015-08-17T14:10:00",0.25000000011641532,15,"F","NO","0,000","SI",30,"--","--",1455.3,363.82499999999999,"--","--","--","--","SI",1819.125]
[null,null,180,"291383b",4062,"JUJUY SUR ","TRAFO 2",30,"132/33/13,2",48.51,"2015-08-17T14:10:00","2015-08-17T16:42:00",{"$f":"IF(F34=\"\",\"\",(L34-K34)*24)","v":2.533333333209157},{"$f":"IF(F34=\"\",\"\",ROUND((L34-K34)*24*60,0))","v":152},"F","NO","0,000","NO",3,{"$f":"IF(O34=\"P\",J34*S34*ROUND(N34/60,2),\"--\")","v":"--"},{"$f":"IF(O34=\"RP\",J34*S34*Q34/100*ROUND(N34/60,2),\"--\")","v":"--"},{"$f":"IF(AND(O34=\"F\",P34=\"NO\"),J34*S34,\"--\")","v":145.53},{"$f":"IF(O34=\"F\",J34*S34*ROUND(N34/60,2),\"--\")","v":368.1909},{"$f":"IF(AND(O34=\"R\",P34=\"NO\"),J34*S34*Q34/100,\"--\")","v":"--"},{"$f":"IF(O34=\"R\",J34*S34*ROUND(N34/60,2)*Q34/100,\"--\")","v":"--"},{"$f":"IF(O34=\"RF\",J34*S34*ROUND(N34/60,2),\"--\")","v":"--"},{"$f":"IF(O34=\"RR\",J34*S34*ROUND(N34/60,2)*Q34/100,\"--\")","v":"--"},"SI",{"$f":"IF(F34=\"\",\"\",SUM(T34:AA34)*IF(AB34=\"SI\",1,2))","v":513.72090000000003}]
[null,null,70,291384,554,"JUJUY SUR ","TRAFO 1",15,"132/33/13,2",24.254999999999999,"2015-08-17T13:55:00","2015-08-17T14:08:00",0.21666666667442769,13,"F","NO","0,000","SI",30,"--","--",727.65,160.083,"--","--","--","--","SI",887.73299999999995]
[null,null,71,291394,5063,"QUIMILI","TRAFO 2",15,"132/33/13,2",24.254999999999999,"2015-08-19T11:09:00","2015-08-19T16:47:00",5.6333333333604969,338,"P","--","0,000","NO",0.30000000000000004,40.966695000000001,"--","--","--","--","--","--","--","SI",40.966695000000001]
[null,null,72,291396,5063,"QUIMILI","TRAFO 2",15,"132/33/13,2",24.254999999999999,"2015-08-20T10:26:00","2015-08-20T16:38:00",6.2000000001280569,372,"P","--","0,000","NO",0.30000000000000004,45.114300000000007,"--","--","--","--","--","--","--","SI",45.114300000000007]
[null,null,73,291398,5063,"QUIMILI","TRAFO 2",15,"132/33/13,2",24.254999999999999,"2015-08-21T10:43:00","2015-08-21T18:26:00",7.7166666666744277,463,"P","--","0,000","NO",0.30000000000000004,56.174579999999999,"--","--","--","--","--","--","--","SI",56.174579999999999]
[null,null,74,291399,5567,"ESTATICA","TRAFO 3",30,"132/13,2",48.51,"2015-08-22T08:53:00","2015-08-22T20:18:00",11.416666666686069,685,"P","--","0,000","NO",0.30000000000000004,166.19526000000002,"--","--","--","--","--","--","--","SI",166.19526000000002]
[null,null,75,291400,544,"ESTATICA","TRAFO 2",30,"132/13,2",48.51,"2015-08-22T08:54:00","2015-08-22T19:57:00",11.050000000046566,663,"P","--","0,000","NO",0.30000000000000004,160.81065000000001,"--","--","--","--","--","--","--","SI",160.81065000000001]
[null,null,76,291406,580,"TARTAGAL","TRAFO 1",30,"132/33/13,2",48.51,"2015-08-23T09:06:00","2015-08-23T13:11:00",4.0833333333721384,245,"P","--","0,000","NO",0.30000000000000004,59.376240000000003,"--","--","--","--","--","--","--","SI",59.376240000000003]
[null,null,77,291778,5062,"QUIMILI","TRAFO 1",15,"132/33/13,2",24.254999999999999,"2015-08-25T10:24:00","2015-08-25T16:57:00",6.5500000000465661,393,"P","--","0,000","NO",0.30000000000000004,47.661075000000004,"--","--","--","--","--","--","--","SI",47.661075000000004]
[null,null,78,291779,5063,"QUIMILI","TRAFO 2",15,"132/33/13,2",24.254999999999999,"2015-08-26T08:07:00","2015-08-26T17:36:00",9.4833333333372138,569,"P","--","0,000","NO",0.30000000000000004,68.981220000000008,"--","--","--","--","--","--","--","SI",68.981220000000008]
[null,null,79,291784,4962,"TUCUMAN NORTE","TRAFO 3",30,"132/33/13,2",48.51,"2015-08-28T13:54:00","2015-08-28T14:47:00",0.88333333324408159,53,"R","NO",40,"SI",30,"--","--","--","--",582.12,512.26559999999995,"--","--","SI",1094.3856000000001]
[]
[null,null,"(²)","P - PROGRAMADA  ;  F - FORZADA  ; R - REDUCCIÓN FORZADA",null,null,null,null,null,null,null,null,null,null,null,null,null,null,null,{"$f":"SUM(T22:T45)","v":1531.9215450000002},0,4333.3200000000006,1533.6477000000002,654.88499999999999,708.00344999999993,0,0,null,{"$f":"ROUND(SUM(AC22:AC45),2)","v":138570.17000000001}]

{"sheet":"T-08 (3)","index":5,"n_rows":46,"n_cols":29,"rows_kept":46,"cut":false,"hidden":false,"merged":[]}
[]
[null,{"$f":"+'TOT-0815'!B2","v":"ANEXO V   al Memorandum   D.T.E.E. N°  526  / 2016"}]
[]
[" ENTE NACIONAL REGULADOR "]
["       DE LA ELECTRICIDAD"]
[]
[]
[null,null,null,null,null,"SISTEMA DE TRANSPORTE DE ENERGÍA ELÉCTRICA POR DISTRIBUCIÓN TRONCAL - TRANSNOA S.A."]
[]
[null,null,null,null,null,"2.- CONEXIÓN"]
[]
[null,null,null,null,null,"2.1.- Transformación"]
[]
[null,null,null,null,null,"2.1.1.- Equipamiento propio"]
[]
[null,{"$f":"'TOT-0815'!B14","v":"Desde el 01 al 31 de agosto de 2015"}]
[]
[null,null,null,null,null,"Por Transformador por MVA    $ =",null,null,1.617]
[null,null,null,null,null,"Coeficiente de penalización por salida forzada   =",null,null,{"$f":"30*'TOT-0815'!B13","v":30},null,{"$f":"IF(I19=30,\" \",IF(I19=60,\"  Coeficiente duplicado por tasa de falla >4 Sal. x año/100 km.\",\"REVISAR COEFICIENTE\"))","v":" "}]
[null,null,3,4,5,6,7,8,9,10,11,12,13,14,15,16,17,18,19,20,21,22,23,24,25,26,27,28,29]
[null,null,"N°","INDISP","ID EQUIPO","ESTACIÓN\nTRANSFORMADORA","EQUIPO","POT.\n[MVA]","U\n[kV]","$/h","Salida","Entrada","Hs\nIndisp.","Mtos.\nIndisp.","Tipo \nSal.(²)","AUT.","C.R.\n%","E.N.S.","K (P;ENS)","PENALIZ.\nPROGRAM.","REDUCC.\nPROGRAM.","PENALIZAC. FORZADA\nPor Salida       hs. Restantes",null,"REDUCC. FORZADA\nPor Salida       hs. Restantes",null,"RESTANTE\nFORZADA","REDUCC.\nRESTANTE","Informó\nen Térm.","TOTAL\nPENALIZAC."]
[null,null,null,null,null,null,null,null,null,null,null,null,null,null,null,null,null,null,null,null,null,null,null,null,null,null,null,null,{"$f":"'T-08 (2)'!AC46","v":138570.17000000001}]
[]
[null,null,80,291787,3580,"ANDALGALA","TRAFO 1",15,"132/33/13,2",{"$f":"H24*$I$18","v":24.254999999999999},"2015-08-29T12:03:00","2015-08-31T23:59:00",{"$f":"IF(F24=\"\",\"\",(L24-K24)*24)","v":59.933333333290648},{"$f":"IF(F24=\"\",\"\",ROUND((L24-K24)*24*60,0))","v":3596},"P",{"$f":"IF(F24=\"\",\"\",IF(OR(O24=\"P\",O24=\"RP\"),\"--\",\"NO\"))","v":"--"},"0,000","NO",{"$f":"$I$19*IF(R24=\"SI\",1,0.1)*IF(OR(O24=\"P\",O24=\"RP\"),0.1,1)","v":0.30000000000000004},{"$f":"IF(O24=\"P\",J24*S24*ROUND(N24/60,2),\"--\")","v":436.080645},{"$f":"IF(O24=\"RP\",J24*S24*Q24/100*ROUND(N24/60,2),\"--\")","v":"--"},{"$f":"IF(AND(O24=\"F\",P24=\"NO\"),J24*S24,\"--\")","v":"--"},{"$f":"IF(O24=\"F\",J24*S24*ROUND(N24/60,2),\"--\")","v":"--"},{"$f":"IF(AND(O24=\"R\",P24=\"NO\"),J24*S24*Q24/100,\"--\")","v":"--"},{"$f":"IF(O24=\"R\",J24*S24*ROUND(N24/60,2)*Q24/100,\"--\")","v":"--"},{"$f":"IF(O24=\"RF\",J24*S24*ROUND(N24/60,2),\"--\")","v":"--"},{"$f":"IF(O24=\"RR\",J24*S24*ROUND(N24/60,2)*Q24/100,\"--\")","v":"--"},"SI",{"$f":"IF(F24=\"\",\"\",SUM(T24:AA24)*IF(AB24=\"SI\",1,2))","v":436.080645}]
[null,null,81,291788,3585,"BELEN","TRAFO 1",7.5,"132/33/13,2",{"$f":"H25*$I$18","v":12.1275},"2015-08-29T12:47:00","2015-08-30T18:57:00",{"$f":"IF(F25=\"\",\"\",(L25-K25)*24)","v":30.166666666686069},{"$f":"IF(F25=\"\",\"\",ROUND((L25-K25)*24*60,0))","v":1810},"F",{"$f":"IF(F25=\"\",\"\",IF(OR(O25=\"P\",O25=\"RP\"),\"--\",\"NO\"))","v":"NO"},"0,000","NO",{"$f":"$I$19*IF(R25=\"SI\",1,0.1)*IF(OR(O25=\"P\",O25=\"RP\"),0.1,1)","v":3},{"$f":"IF(O25=\"P\",J25*S25*ROUND(N25/60,2),\"--\")","v":"--"},{"$f":"IF(O25=\"RP\",J25*S25*Q25/100*ROUND(N25/60,2),\"--\")","v":"--"},{"$f":"IF(AND(O25=\"F\",P25=\"NO\"),J25*S25,\"--\")","v":36.3825},{"$f":"IF(O25=\"F\",J25*S25*ROUND(N25/60,2),\"--\")","v":1097.6600250000001},{"$f":"IF(AND(O25=\"R\",P25=\"NO\"),J25*S25*Q25/100,\"--\")","v":"--"},{"$f":"IF(O25=\"R\",J25*S25*ROUND(N25/60,2)*Q25/100,\"--\")","v":"--"},{"$f":"IF(O25=\"RF\",J25*S25*ROUND(N25/60,2),\"--\")","v":"--"},{"$f":"IF(O25=\"RR\",J25*S25*ROUND(N25/60,2)*Q25/100,\"--\")","v":"--"},"SI",{"$f":"IF(F25=\"\",\"\",SUM(T25:AA25)*IF(AB25=\"SI\",1,2))","v":1134.0425250000001}]
[null,null,82,291814,3573,"TRANCAS","TRAFO",15,"132/33/13,2",{"$f":"H26*$I$18","v":24.254999999999999},"2015-08-30T08:44:00","2015-08-30T09:10:00",{"$f":"IF(F26=\"\",\"\",(L26-K26)*24)","v":0.43333333334885538},{"$f":"IF(F26=\"\",\"\",ROUND((L26-K26)*24*60,0))","v":26},"R",{"$f":"IF(F26=\"\",\"\",IF(OR(O26=\"P\",O26=\"RP\"),\"--\",\"NO\"))","v":"NO"},40,"SI",{"$f":"$I$19*IF(R26=\"SI\",1,0.1)*IF(OR(O26=\"P\",O26=\"RP\"),0.1,1)","v":30},{"$f":"IF(O26=\"P\",J26*S26*ROUND(N26/60,2),\"--\")","v":"--"},{"$f":"IF(O26=\"RP\",J26*S26*Q26/100*ROUND(N26/60,2),\"--\")","v":"--"},{"$f":"IF(AND(O26=\"F\",P26=\"NO\"),J26*S26,\"--\")","v":"--"},{"$f":"IF(O26=\"F\",J26*S26*ROUND(N26/60,2),\"--\")","v":"--"},{"$f":"IF(AND(O26=\"R\",P26=\"NO\"),J26*S26*Q26/100,\"--\")","v":291.06},{"$f":"IF(O26=\"R\",J26*S26*ROUND(N26/60,2)*Q26/100,\"--\")","v":125.1558},{"$f":"IF(O26=\"RF\",J26*S26*ROUND(N26/60,2),\"--\")","v":"--"},{"$f":"IF(O26=\"RR\",J26*S26*ROUND(N26/60,2)*Q26/100,\"--\")","v":"--"},"SI",{"$f":"IF(F26=\"\",\"\",SUM(T26:AA26)*IF(AB26=\"SI\",1,2))","v":416.2158}]
[null,null,null,null,null,null,null,null,null,{"$f":"H27*$I$18","v":0},null,null,{"$f":"IF(F27=\"\",\"\",(L27-K27)*24)","v":""},{"$f":"IF(F27=\"\",\"\",ROUND((L27-K27)*24*60,0))","v":""},null,{"$f":"IF(F27=\"\",\"\",IF(OR(O27=\"P\",O27=\"RP\"),\"--\",\"NO\"))","v":""},{"$f":"IF(F27=\"\",\"\",\"--\")","v":""},null,{"$f":"$I$19*IF(R27=\"SI\",1,0.1)*IF(OR(O27=\"P\",O27=\"RP\"),0.1,1)","v":3},{"$f":"IF(O27=\"P\",J27*S27*ROUND(N27/60,2),\"--\")","v":"--"},{"$f":"IF(O27=\"RP\",J27*S27*Q27/100*ROUND(N27/60,2),\"--\")","v":"--"},{"$f":"IF(AND(O27=\"F\",P27=\"NO\"),J27*S27,\"--\")","v":"--"},{"$f":"IF(O27=\"F\",J27*S27*ROUND(N27/60,2),\"--\")","v":"--"},{"$f":"IF(AND(O27=\"R\",P27=\"NO\"),J27*S27*Q27/100,\"--\")","v":"--"},{"$f":"IF(O27=\"R\",J27*S27*ROUND(N27/60,2)*Q27/100,\"--\")","v":"--"},{"$f":"IF(O27=\"RF\",J27*S27*ROUND(N27/60,2),\"--\")","v":"--"},{"$f":"IF(O27=\"RR\",J27*S27*ROUND(N27/60,2)*Q27/100,\"--\")","v":"--"},null,{"$f":"IF(F27=\"\",\"\",SUM(T27:AA27)*IF(AB27=\"SI\",1,2))","v":""}]
[null,null,null,null,null,null,null,null,null,0,null,null,"","",null,"","",null,3,"--","--","--","--","--","--","--","--",null,""]
[null,null,null,null,null,null,null,null,null,0,null,null,"","",null,"","",null,{"$f":"$I$19*IF(R29=\"SI\",1,0.1)*IF(OR(O29=\"P\",O29=\"RP\"),0.1,1)","v":3},{"$f":"IF(O29=\"P\",J29*S29*ROUND(N29/60,2),\"--\")","v":"--"},{"$f":"IF(O29=\"RP\",J29*S29*Q29/100*ROUND(N29/60,2),\"--\")","v":"--"},{"$f":"IF(AND(O29=\"F\",P29=\"NO\"),J29*S29,\"--\")","v":"--"},{"$f":"IF(O29=\"F\",J29*S29*ROUND(N29/60,2),\"--\")","v":"--"},{"$f":"IF(AND(O29=\"R\",P29=\"NO\"),J29*S29*Q29/100,\"--\")","v":"--"},{"$f":"IF(O29=\"R\",J29*S29*ROUND(N29/60,2)*Q29/100,\"--\")","v":"--"},{"$f":"IF(O29=\"RF\",J29*S29*ROUND(N29/60,2),\"--\")","v":"--"},{"$f":"IF(O29=\"RR\",J29*S29*ROUND(N29/60,2)*Q29/100,\"--\")","v":"--"},null,""]
[null,null,null,null,null,null,null,null,null,0,null,null,"","",null,"","",null,3,"--","--","--","--","--","--","--","--",null,""]
[null,null,null,null,null,null,null,null,null,0,null,null,"","",null,"","",null,3,"--","--","--","--","--","--","--","--",null,""]
[null,null,null,null,null,null,null,null,null,0,null,null,"","",null,"","",null,3,"--","--","--","--","--","--","--","--",null,""]
[null,null,null,null,null,null,null,null,null,0,null,null,"","",null,"","",null,3,"--","--","--","--","--","--","--","--",null,""]
[null,null,null,null,null,null,null,null,null,0,null,null,"","",null,"","",null,3,"--","--","--","--","--","--","--","--",null,""]
[null,null,null,null,null,null,null,null,null,0,null,null,"","",null,"","",null,3,"--","--","--","--","--","--","--","--",null,""]
[null,null,null,null,null,null,null,null,null,0,null,null,"","",null,"","",null,3,"--","--","--","--","--","--","--","--",null,""]
[null,null,null,null,null,null,null,null,null,0,null,null,"","",null,"","",null,3,"--","--","--","--","--","--","--","--",null,""]
[null,null,null,null,null,null,null,null,null,0,null,null,"","",null,"","",null,3,"--","--","--","--","--","--","--","--",null,""]
[null,null,null,null,null,null,null,null,null,0,null,null,"","",null,"","",null,3,"--","--","--","--","--","--","--","--",null,""]
[null,null,null,null,null,null,null,null,null,0,null,null,"","",null,"","",null,3,"--","--","--","--","--","--","--","--",null,""]
[null,null,null,null,null,null,null,null,null,0,null,null,"","",null,"","",null,3,"--","--","--","--","--","--","--","--",null,""]
[null,null,null,null,null,null,null,null,null,0,null,null,{"$f":"IF(F42=\"\",\"\",(L42-K42)*24)","v":""},{"$f":"IF(F42=\"\",\"\",ROUND((L42-K42)*24*60,0))","v":""},null,"",{"$f":"IF(F42=\"\",\"\",\"--\")","v":""},null,{"$f":"$I$19*IF(R42=\"SI\",1,0.1)*IF(OR(O42=\"P\",O42=\"RP\"),0.1,1)","v":3},{"$f":"IF(O42=\"P\",J42*S42*ROUND(N42/60,2),\"--\")","v":"--"},{"$f":"IF(O42=\"RP\",J42*S42*Q42/100*ROUND(N42/60,2),\"--\")","v":"--"},{"$f":"IF(AND(O42=\"F\",P42=\"NO\"),J42*S42,\"--\")","v":"--"},{"$f":"IF(O42=\"F\",J42*S42*ROUND(N42/60,2),\"--\")","v":"--"},{"$f":"IF(AND(O42=\"R\",P42=\"NO\"),J42*S42*Q42/100,\"--\")","v":"--"},{"$f":"IF(O42=\"R\",J42*S42*ROUND(N42/60,2)*Q42/100,\"--\")","v":"--"},{"$f":"IF(O42=\"RF\",J42*S42*ROUND(N42/60,2),\"--\")","v":"--"},{"$f":"IF(O42=\"RR\",J42*S42*ROUND(N42/60,2)*Q42/100,\"--\")","v":"--"},{"$f":"IF(F42=\"\",\"\",\"SI\")","v":""},{"$f":"IF(F42=\"\",\"\",SUM(T42:AA42)*IF(AB42=\"SI\",1,2))","v":""}]
[null,null,null,null,null,null,null,null,null,0,null,null,{"$f":"IF(F43=\"\",\"\",(L43-K43)*24)","v":""},{"$f":"IF(F43=\"\",\"\",ROUND((L43-K43)*24*60,0))","v":""},null,"",{"$f":"IF(F43=\"\",\"\",\"--\")","v":""},null,{"$f":"$I$19*IF(R43=\"SI\",1,0.1)*IF(OR(O43=\"P\",O43=\"RP\"),0.1,1)","v":3},{"$f":"IF(O43=\"P\",J43*S43*ROUND(N43/60,2),\"--\")","v":"--"},{"$f":"IF(O43=\"RP\",J43*S43*Q43/100*ROUND(N43/60,2),\"--\")","v":"--"},{"$f":"IF(AND(O43=\"F\",P43=\"NO\"),J43*S43,\"--\")","v":"--"},{"$f":"IF(O43=\"F\",J43*S43*ROUND(N43/60,2),\"--\")","v":"--"},{"$f":"IF(AND(O43=\"R\",P43=\"NO\"),J43*S43*Q43/100,\"--\")","v":"--"},{"$f":"IF(O43=\"R\",J43*S43*ROUND(N43/60,2)*Q43/100,\"--\")","v":"--"},{"$f":"IF(O43=\"RF\",J43*S43*ROUND(N43/60,2),\"--\")","v":"--"},{"$f":"IF(O43=\"RR\",J43*S43*ROUND(N43/60,2)*Q43/100,\"--\")","v":"--"},{"$f":"IF(F43=\"\",\"\",\"SI\")","v":""},{"$f":"IF(F43=\"\",\"\",SUM(T43:AA43)*IF(AB43=\"SI\",1,2))","v":""}]
[null,null,null,null,null,null,null,null,null,0,null,null,{"$f":"IF(F44=\"\",\"\",(L44-K44)*24)","v":""},{"$f":"IF(F44=\"\",\"\",ROUND((L44-K44)*24*60,0))","v":""},null,"",{"$f":"IF(F44=\"\",\"\",\"--\")","v":""},null,{"$f":"$I$19*IF(R44=\"SI\",1,0.1)*IF(OR(O44=\"P\",O44=\"RP\"),0.1,1)","v":3},{"$f":"IF(O44=\"P\",J44*S44*ROUND(N44/60,2),\"--\")","v":"--"},{"$f":"IF(O44=\"RP\",J44*S44*Q44/100*ROUND(N44/60,2),\"--\")","v":"--"},{"$f":"IF(AND(O44=\"F\",P44=\"NO\"),J44*S44,\"--\")","v":"--"},{"$f":"IF(O44=\"F\",J44*S44*ROUND(N44/60,2),\"--\")","v":"--"},{"$f":"IF(AND(O44=\"R\",P44=\"NO\"),J44*S44*Q44/100,\"--\")","v":"--"},{"$f":"IF(O44=\"R\",J44*S44*ROUND(N44/60,2)*Q44/100,\"--\")","v":"--"},{"$f":"IF(O44=\"RF\",J44*S44*ROUND(N44/60,2),\"--\")","v":"--"},{"$f":"IF(O44=\"RR\",J44*S44*ROUND(N44/60,2)*Q44/100,\"--\")","v":"--"},{"$f":"IF(F44=\"\",\"\",\"SI\")","v":""},{"$f":"IF(F44=\"\",\"\",SUM(T44:AA44)*IF(AB44=\"SI\",1,2))","v":""}]
[]
[null,null,"(²)","P - PROGRAMADA  ;  F - FORZADA  ; R - REDUCCIÓN FORZADA",null,null,null,null,null,null,null,null,null,null,null,null,null,null,null,{"$f":"SUM(T22:T45)","v":436.080645},0,36.3825,1097.6600250000001,291.06,125.1558,0,0,null,{"$f":"ROUND(SUM(AC22:AC45),2)","v":140556.51}]

{"sheet":"CAUSAS-VST-08 (1)","index":6,"n_rows":41,"n_cols":7,"rows_kept":41,"cut":false,"hidden":false,"merged":[]}
[]
[null,{"$f":"'TOT-0815'!B2","v":"ANEXO V   al Memorandum   D.T.E.E. N°  526  / 2016"}]
[]
["ENTE NACIONAL REGULADOR "]
["        DE LA ELECTRICIDAD"]
[]
[]
[null,null,null,null,null,"SISTEMA DE TRANSPORTE DE ENERGÍA ELÉCTRICA POR DISTRIBUCIÓN TRONCAL - TRANSNEA S.A."]
[]
[]
[null,null,null,null,null,null,"Indisponibilidades Descartadas por Causa \"Vinculado y Sin Tensión\""]
[]
[]
[null,{"$f":"'TOT-0815'!B14","v":"Desde el 01 al 31 de agosto de 2015"}]
[]
[]
[null,null,"Id","ID EQUIPO","INDISP","AGENTE","CAUSA"]
[]
[null,null,83,372,290664,"TRANSNOA","VINCULADO Y SIN TENSION : Falla de aislación en el interruptor lado 33 kV de Trafo Nº 1 (palomas en las instalaciones)"]
[null,null,84,373,290665,"TRANSNOA","VINCULADO Y SIN TENSION : Falla de aislación en el interruptor lado 33 kV de Trafo Nº 1 (palomas en las instalaciones)"]
[null,null,85,2679,291014,"TRANSNOA","VINCULADO Y SIN TENSION : Pedido de la distribuidora para ingreso de grúa que lleva al nuevo Trafo Nº 1"]
[null,null,86,349,291015,"TRANSNOA","VINCULADO Y SIN TENSION : Pedido de la distribuidora para ingreso de grúa que lleva al nuevo Trafo Nº 1"]
[null,null,87,350,291016,"TRANSNOA","VINCULADO Y SIN TENSION : Pedido de la distribuidora para ingreso de grúa que lleva al nuevo Trafo Nº 1"]
[null,null,88,351,291017,"TRANSNOA","VINCULADO Y SIN TENSION : Pedido de la distribuidora para ingreso de grúa que lleva al nuevo Trafo Nº 1"]
[null,null,89,352,291018,"TRANSNOA","VINCULADO Y SIN TENSION : Pedido de la distribuidora para ingreso de grúa que lleva al nuevo Trafo Nº 1"]
[null,null,90,3026,291019,"TRANSNOA","VINCULADO Y SIN TENSION : Pedido de la distribuidora para ingreso de grúa que lleva al nuevo Trafo Nº 1"]
[null,null,91,354,291020,"TRANSNOA","VINCULADO Y SIN TENSION : Pedido de la distribuidora para ingreso de grúa que lleva al nuevo Trafo Nº 1"]
[null,null,92,359,291021,"TRANSNOA","VINCULADO Y SIN TENSION : Pedido de la distribuidora para ingreso de grúa que lleva al nuevo Trafo Nº 1"]
[null,null,93,356,291022,"TRANSNOA","VINCULADO Y SIN TENSION : Pedido de la distribuidora para ingreso de grúa que lleva al nuevo Trafo Nº 1"]
[null,null,94,5225,291026,"TRANSNOA","VINCULADO Y SIN TENSION : Aves (palomas) en aislador pasatapa lado 33 kV de Trafo Nº 2"]
[null,null,95,5224,291027,"TRANSNOA","VINCULADO Y SIN TENSION : Aves (palomas) en aislador pasatapa lado 33 kV de Trafo Nº 2"]
[null,null,96,3582,291031,"TRANSNOA","VINCULADO Y SIN TENSION :Falla de aislación en LAT 132 kv Villa Quinteros - Andalgalá por causales de fuerza mayor: fuerte viento Zonda en el área"]
[null,null,97,3584,291032,"TRANSNOA","VINCULADO Y SIN TENSION :Falla de aislación en LAT 132 kv Villa Quinteros - Andalgalá por causales de fuerza mayor: fuerte viento Zonda en el área"]
[null,null,98,3735,291033,"TRANSNOA","VINCULADO Y SIN TENSION :Falla de aislación en LAT 132 kv Villa Quinteros - Andalgalá por causales de fuerza mayor: fuerte viento Zonda en el área"]
[null,null,99,3814,291034,"TRANSNOA","VINCULADO Y SIN TENSION :Falla de aislación en LAT 132 kv Villa Quinteros - Andalgalá por causales de fuerza mayor: fuerte viento Zonda en el área"]
[null,null,100,3586,291035,"TRANSNOA","VINCULADO Y SIN TENSION :Falla de aislación en LAT 132 kv Villa Quinteros - Andalgalá por causales de fuerza mayor: fuerte viento Zonda en el área"]
[null,null,101,3587,291036,"TRANSNOA","VINCULADO Y SIN TENSION :Falla de aislación en LAT 132 kv Villa Quinteros - Andalgalá por causales de fuerza mayor: fuerte viento Zonda en el área"]
[null,null,102,3588,291037,"TRANSNOA","VINCULADO Y SIN TENSION :Falla de aislación en LAT 132 kv Villa Quinteros - Andalgalá por causales de fuerza mayor: fuerte viento Zonda en el área"]
[null,null,103,3679,291038,"TRANSNOA","VINCULADO Y SIN TENSION :Falla de aislación en LAT 132 kv Villa Quinteros - Andalgalá por causales de fuerza mayor: fuerte viento Zonda en el área"]
[null,null,104,3672,291039,"TRANSNOA","VINCULADO Y SIN TENSION :Falla de aislación en LAT 132 kv Villa Quinteros - Andalgalá por causales de fuerza mayor: fuerte viento Zonda en el área"]
[null,null,105,3682,291040,"TRANSNOA","VINCULADO Y SIN TENSION :Falla de aislación en LAT 132 kv Villa Quinteros - Andalgalá por causales de fuerza mayor: fuerte viento Zonda en el área"]

{"sheet":"CAUSAS-VST-08 (2)","index":7,"n_rows":42,"n_cols":7,"rows_kept":42,"cut":false,"hidden":false,"merged":[]}
[]
[null,{"$f":"'TOT-0815'!B2","v":"ANEXO V   al Memorandum   D.T.E.E. N°  526  / 2016"}]
[]
["ENTE NACIONAL REGULADOR "]
["        DE LA ELECTRICIDAD"]
[]
[]
[null,null,null,null,null,"SISTEMA DE TRANSPORTE DE ENERGÍA ELÉCTRICA POR DISTRIBUCIÓN TRONCAL - TRANSNEA S.A."]
[]
[]
[null,null,null,null,null,null,"Indisponibilidades Descartadas por Causa \"Vinculado y Sin Tensión\""]
[]
[]
[null,{"$f":"'TOT-0815'!B14","v":"Desde el 01 al 31 de agosto de 2015"}]
[]
[]
[null,null,"Id","ID EQUIPO","INDISP","AGENTE","CAUSA"]
[]
[null,null,106,3683,291041,"TRANSNOA","VINCULADO Y SIN TENSION :Falla de aislación en LAT 132 kv Villa Quinteros - Andalgalá por causales de fuerza mayor: fuerte viento Zonda en el área"]
[null,null,107,3620,291042,"TRANSNOA","VINCULADO Y SIN TENSION :Falla de aislación en LAT 132 kv Villa Quinteros - Andalgalá por causales de fuerza mayor: fuerte viento Zonda en el área"]
[null,null,108,4905,291043,"TRANSNOA","VINCULADO Y SIN TENSION :Falla de aislación en LAT 132 kv Villa Quinteros - Andalgalá por causales de fuerza mayor: fuerte viento Zonda en el área"]
[null,null,109,3580,291044,"TRANSNOA","VINCULADO Y SIN TENSION :Falla de aislación en LAT 132 kv Villa Quinteros - Andalgalá por causales de fuerza mayor: fuerte viento Zonda en el área"]
[null,null,110,4904,291045,"TRANSNOA","VINCULADO Y SIN TENSION :Falla de aislación en LAT 132 kv Villa Quinteros - Andalgalá por causales de fuerza mayor: fuerte viento Zonda en el área"]
[null,null,111,4690,291046,"TRANSNOA","VINCULADO Y SIN TENSION :Falla de aislación en LAT 132 kv Villa Quinteros - Andalgalá por causales de fuerza mayor: fuerte viento Zonda en el área"]
[null,null,112,4689,291054,"TRANSNOA","VINCULADO Y SIN TENSION :Falla de aislación en LAT 132 kv Villa Quinteros - Andalgalá por causales de fuerza mayor: fuerte viento Zonda en el área"]
[null,null,113,4903,291055,"TRANSNOA","VINCULADO Y SIN TENSION :Falla de aislación en LAT 132 kv Villa Quinteros - Andalgalá por causales de fuerza mayor: fuerte viento Zonda en el área"]
[null,null,114,3585,291056,"TRANSNOA","VINCULADO Y SIN TENSION :Falla de aislación en LAT 132 kv Villa Quinteros - Andalgalá por causales de fuerza mayor: fuerte viento Zonda en el área"]
[null,null,115,3819,291057,"TRANSNOA","VINCULADO Y SIN TENSION :Falla de aislación en LAT 132 kv Villa Quinteros - Andalgalá por causales de fuerza mayor: fuerte viento Zonda en el área"]
[null,null,116,3618,291059,"TRANSNOA","VINCULADO Y SIN TENSION :Falla de aislación en LAT 132 kv Villa Quinteros - Andalgalá por causales de fuerza mayor: fuerte viento Zonda en el área"]
[null,null,117,3579,291060,"TRANSNOA","VINCULADO Y SIN TENSION :Falla de aislación en LAT 132 kv Villa Quinteros - Andalgalá por causales de fuerza mayor: fuerte viento Zonda en el área"]
[null,null,118,4902,291061,"TRANSNOA","VINCULADO Y SIN TENSION :Falla de aislación en LAT 132 kv Villa Quinteros - Andalgalá por causales de fuerza mayor: fuerte viento Zonda en el área"]
[null,null,119,3619,291062,"TRANSNOA","VINCULADO Y SIN TENSION :Falla de aislación en LAT 132 kv Villa Quinteros - Andalgalá por causales de fuerza mayor: fuerte viento Zonda en el área"]
[null,null,120,3617,291063,"TRANSNOA","VINCULADO Y SIN TENSION :Falla de aislación en LAT 132 kv Villa Quinteros - Andalgalá por causales de fuerza mayor: fuerte viento Zonda en el área"]
[null,null,121,494,291066,"TRANSNOA","VINCULADO Y SIN TENSION : Error humano por personal de mantenimiento."]
[null,null,122,486,291067,"TRANSNOA","VINCULADO Y SIN TENSION : Error humano por personal de mantenimiento."]
[null,null,123,487,291068,"TRANSNOA","VINCULADO Y SIN TENSION : Error humano por personal de mantenimiento."]
[null,null,124,488,291069,"TRANSNOA","VINCULADO Y SIN TENSION : Error humano por personal de mantenimiento."]
[null,null,125,489,291070,"TRANSNOA","VINCULADO Y SIN TENSION : Error humano por personal de mantenimiento."]
[null,null,126,490,291071,"TRANSNOA","VINCULADO Y SIN TENSION : Error humano por personal de mantenimiento."]
[null,null,127,491,291072,"TRANSNOA","VINCULADO Y SIN TENSION : Error humano por personal de mantenimiento."]
[null,null,128,492,291073,"TRANSNOA","VINCULADO Y SIN TENSION : Error humano por personal de mantenimiento."]
[null,null,129,4952,291076,"TRANSNOA","VINCULADO Y SIN TENSION : Actuación respaldo máxima corriente por no actuación reconectador de la distribuidora ante falla de aislación en 13.2 kV"]

{"sheet":"CAUSAS-VST-08 (3)","index":8,"n_rows":42,"n_cols":7,"rows_kept":42,"cut":false,"hidden":false,"merged":[]}
[]
[null,{"$f":"'TOT-0815'!B2","v":"ANEXO V   al Memorandum   D.T.E.E. N°  526  / 2016"}]
[]
["ENTE NACIONAL REGULADOR "]
["        DE LA ELECTRICIDAD"]
[]
[]
[null,null,null,null,null,"SISTEMA DE TRANSPORTE DE ENERGÍA ELÉCTRICA POR DISTRIBUCIÓN TRONCAL - TRANSNEA S.A."]
[]
[]
[null,null,null,null,null,null,"Indisponibilidades Descartadas por Causa \"Vinculado y Sin Tensión\""]
[]
[]
[null,{"$f":"'TOT-0815'!B14","v":"Desde el 01 al 31 de agosto de 2015"}]
[]
[]
[null,null,"Id","ID EQUIPO","INDISP","AGENTE","CAUSA"]
[]
[null,null,130,4953,291077,"TRANSNOA","VINCULADO Y SIN TENSION : Actuación respaldo máxima corriente por no actuación reconectador de la distribuidora ante falla de aislación en 13.2 kV"]
[null,null,131,5216,291079,"TRANSNOA","VINCULADO Y SIN TENSION : Aún se investigan."]
[null,null,132,4815,291142,"TRANSNOA","VINCULADO Y SIN TENSION : Falla de aislación en LAT 132 kV Cobos – Rosario de la Frontera y no actuación del interruptor de ET Rosario de la Frontera"]
[null,null,133,4817,291143,"TRANSNOA","VINCULADO Y SIN TENSION : Falla de aislación en LAT 132 kV Cobos – Rosario de la Frontera y no actuación del interruptor de ET Rosario de la Frontera"]
[null,null,134,4816,291144,"TRANSNOA","VINCULADO Y SIN TENSION : Falla de aislación en LAT 132 kV Cobos – Rosario de la Frontera y no actuación del interruptor de ET Rosario de la Frontera"]
[null,null,135,4813,291145,"TRANSNOA","VINCULADO Y SIN TENSION : Falla de aislación en LAT 132 kV Cobos – Rosario de la Frontera y no actuación del interruptor de ET Rosario de la Frontera"]
[null,null,136,4814,291146,"TRANSNOA","VINCULADO Y SIN TENSION : Falla de aislación en LAT 132 kV Cobos – Rosario de la Frontera y no actuación del interruptor de ET Rosario de la Frontera"]
[null,null,137,4812,291149,"TRANSNOA","VINCULADO Y SIN TENSION : Falla de aislación en LAT 132 kV Cobos – Rosario de la Frontera y no actuación del interruptor de ET Rosario de la Frontera"]
[null,null,138,394,291378,"TRANSNOA","VINCULADO Y SIN TENSION : Falta de sin tensión continua las instalaciones por error humano."]
[null,null,139,391,291379,"TRANSNOA","VINCULADO Y SIN TENSION : Falta de sin tensión continua las instalaciones por error humano."]
[null,null,140,390,291380,"TRANSNOA","VINCULADO Y SIN TENSION : Falta de sin tensión continua las instalaciones por error humano."]
[null,null,141,392,291381,"TRANSNOA","VINCULADO Y SIN TENSION : Falta de sin tensión continua las instalaciones por error humano."]
[null,null,142,393,291382,"TRANSNOA","VINCULADO Y SIN TENSION : Falta de sin tensión continua las instalaciones por error humano."]
[null,null,143,389,291385,"TRANSNOA","VINCULADO Y SIN TENSION : Falta de sin tensión continua las instalaciones por error humano."]
[null,null,144,395,291386,"TRANSNOA","VINCULADO Y SIN TENSION : Falta de sin tensión continua las instalaciones por error humano."]
[null,null,145,396,291387,"TRANSNOA","VINCULADO Y SIN TENSION : Falta de sin tensión continua las instalaciones por error humano."]
[null,null,146,387,291388,"TRANSNOA","VINCULADO Y SIN TENSION : Falta de sin tensión continua las instalaciones por error humano."]
[null,null,147,388,291389,"TRANSNOA","VINCULADO Y SIN TENSION : Falta de sin tensión continua las instalaciones por error humano."]
[null,null,148,517,291780,"TRANSNOA","VINCULADO Y SIN TENSION : EDET informa falla en el interruptor 33 KV salida Trancas."]
[null,null,149,519,291781,"TRANSNOA","VINCULADO Y SIN TENSION : EDET informa falla en el interruptor 33 KV salida Trancas."]
[null,null,150,518,291782,"TRANSNOA","VINCULADO Y SIN TENSION : EDET informa falla en el interruptor 33 KV salida Trancas."]
[null,null,151,696,291783,"TRANSNOA","VINCULADO Y SIN TENSION : EDET informa falla en el interruptor 33 KV salida Trancas."]
[null,null,152,519,291789,"TRANSNOA","VINCULADO Y SIN TENSION  Falla aislación en LAT 132 kV Cobos–Rosario de la Frontera y no actuación del interrup. ET Rosario de la Frontera salida 132 kV Cobos."]
[null,null,153,518,291790,"TRANSNOA","VINCULADO Y SIN TENSION  Falla aislación en LAT 132 kV Cobos–Rosario de la Frontera y no actuación del interrup. ET Rosario de la Frontera salida 132 kV Cobos."]

{"sheet":"CAUSAS-VST-08 (4)","index":9,"n_rows":42,"n_cols":7,"rows_kept":42,"cut":false,"hidden":false,"merged":[]}
[]
[null,{"$f":"'TOT-0815'!B2","v":"ANEXO V   al Memorandum   D.T.E.E. N°  526  / 2016"}]
[]
["ENTE NACIONAL REGULADOR "]
["        DE LA ELECTRICIDAD"]
[]
[]
[null,null,null,null,null,"SISTEMA DE TRANSPORTE DE ENERGÍA ELÉCTRICA POR DISTRIBUCIÓN TRONCAL - TRANSNEA S.A."]
[]
[]
[null,null,null,null,null,null,"Indisponibilidades Descartadas por Causa \"Vinculado y Sin Tensión\""]
[]
[]
[null,{"$f":"'TOT-0815'!B14","v":"Desde el 01 al 31 de agosto de 2015"}]
[]
[]
[null,null,"Id","ID EQUIPO","INDISP","AGENTE","CAUSA"]
[]
[null,null,154,696,291791,"TRANSNOA","VINCULADO Y SIN TENSION  Falla aislación en LAT 132 kV Cobos–Rosario de la Frontera y no actuación del interrup. ET Rosario de la Frontera salida 132 kV Cobos."]
[null,null,155,2736,291792,"TRANSNOA","VINCULADO Y SIN TENSION :  Rotura de cadena de aisladores en Piquete Nº 10 en LAT 132 kV Tucumán Norte – Tucumán Oeste."]
[null,null,156,2733,291793,"TRANSNOA","VINCULADO Y SIN TENSION :  Rotura de cadena de aisladores en Piquete Nº 10 en LAT 132 kV Tucumán Norte – Tucumán Oeste."]
[null,null,157,2735,291794,"TRANSNOA","VINCULADO Y SIN TENSION :  Rotura de cadena de aisladores en Piquete Nº 10 en LAT 132 kV Tucumán Norte – Tucumán Oeste."]
[null,null,158,2744,291796,"TRANSNOA","VINCULADO Y SIN TENSION :  Rotura de cadena de aisladores en Piquete Nº 10 en LAT 132 kV Tucumán Norte – Tucumán Oeste."]
[null,null,159,5298,291797,"TRANSNOA","VINCULADO Y SIN TENSION :  Rotura de cadena de aisladores en Piquete Nº 10 en LAT 132 kV Tucumán Norte – Tucumán Oeste."]
[null,null,160,1844,291798,"TRANSNOA","VINCULADO Y SIN TENSION :  Rotura de cadena de aisladores en Piquete Nº 10 en LAT 132 kV Tucumán Norte – Tucumán Oeste."]
[null,null,161,3835,291799,"TRANSNOA","VINCULADO Y SIN TENSION :  Rotura de cadena de aisladores en Piquete Nº 10 en LAT 132 kV Tucumán Norte – Tucumán Oeste."]
[null,null,162,4274,291800,"TRANSNOA","VINCULADO Y SIN TENSION :  Rotura de cadena de aisladores en Piquete Nº 10 en LAT 132 kV Tucumán Norte – Tucumán Oeste."]
[null,null,163,4962,291801,"TRANSNOA","VINCULADO Y SIN TENSION :  Rotura de cadena de aisladores en Piquete Nº 10 en LAT 132 kV Tucumán Norte – Tucumán Oeste."]
[null,null,164,2745,291802,"TRANSNOA","VINCULADO Y SIN TENSION :  Rotura de cadena de aisladores en Piquete Nº 10 en LAT 132 kV Tucumán Norte – Tucumán Oeste."]
[null,null,165,2743,291803,"TRANSNOA","VINCULADO Y SIN TENSION :  Rotura de cadena de aisladores en Piquete Nº 10 en LAT 132 kV Tucumán Norte – Tucumán Oeste."]
[null,null,166,2732,291804,"TRANSNOA","VINCULADO Y SIN TENSION :  Rotura de cadena de aisladores en Piquete Nº 10 en LAT 132 kV Tucumán Norte – Tucumán Oeste."]
[null,null,167,2734,291805,"TRANSNOA","VINCULADO Y SIN TENSION :  Rotura de cadena de aisladores en Piquete Nº 10 en LAT 132 kV Tucumán Norte – Tucumán Oeste."]
[null,null,168,4987,291806,"TRANSNOA","VINCULADO Y SIN TENSION :  Rotura de cadena de aisladores en Piquete Nº 10 en LAT 132 kV Tucumán Norte – Tucumán Oeste."]
[null,null,169,4850,291807,"TRANSNOA","VINCULADO Y SIN TENSION :  Rotura de cadena de aisladores en Piquete Nº 10 en LAT 132 kV Tucumán Norte – Tucumán Oeste."]
[null,null,170,4857,291808,"TRANSNOA","VINCULADO Y SIN TENSION :  Rotura de cadena de aisladores en Piquete Nº 10 en LAT 132 kV Tucumán Norte – Tucumán Oeste."]
[null,null,171,5265,291809,"TRANSNOA","VINCULADO Y SIN TENSION :  Rotura de cadena de aisladores en Piquete Nº 10 en LAT 132 kV Tucumán Norte – Tucumán Oeste."]
[null,null,172,5297,291810,"TRANSNOA","VINCULADO Y SIN TENSION :  Rotura de cadena de aisladores en Piquete Nº 10 en LAT 132 kV Tucumán Norte – Tucumán Oeste."]
[null,null,173,2731,291811,"TRANSNOA","VINCULADO Y SIN TENSION :  Rotura de cadena de aisladores en Piquete Nº 10 en LAT 132 kV Tucumán Norte – Tucumán Oeste."]
[null,null,174,2742,291812,"TRANSNOA","VINCULADO Y SIN TENSION :  Rotura de cadena de aisladores en Piquete Nº 10 en LAT 132 kV Tucumán Norte – Tucumán Oeste."]
[null,null,175,5266,291813,"TRANSNOA","VINCULADO Y SIN TENSION :  Rotura de cadena de aisladores en Piquete Nº 10 en LAT 132 kV Tucumán Norte – Tucumán Oeste."]
[null,null,176,3685,291815,"TRANSNOA","VINCULADO Y SIN TENSION :   Palomas que tomaron contacto con aisladores pasatapas de 33 KV del TRP Nº1"]
[null,null,177,3574,291816,"TRANSNOA","VINCULADO Y SIN TENSION :   Palomas que tomaron contacto con aisladores pasatapas de 33 KV del TRP Nº1"]

{"sheet":"Tasa de Falla","index":10,"n_rows":146,"n_cols":19,"rows_kept":146,"cut":false,"hidden":false,"merged":[[2,0,2,2],[3,0,3,2],[145,11,145,12]]}
[]
[null,{"$f":"'TOT-0815'!B2","v":"ANEXO V   al Memorandum   D.T.E.E. N°  526  / 2016"}]
["ENTE NACIONAL REGULADOR "]
["DE LA ELECTRICIDAD"]
[]
[null,"SISTEMA DE TRANSPORTE DE ENERGÍA ELÉCTRICA POR DISTRIBUCIÓN TRONCAL "]
[]
[null,"TRANSNOA S.A."]
[]
[null,"INDISPONIBILIDADES FORZADAS DE LÍNEAS - TASA DE FALLA"]
[]
[]
[null,"y",null,"Correspondiente al mes agosto de 2015"]
[]
[null,null,"N°","LÍNEAS","U\n[kV]","Long.\n[km]","2014-08-01","2014-09-01","2014-10-01","2014-11-01","2014-12-01","2015-01-01","2015-02-01","2015-03-01","2015-04-01","2015-05-01","2015-06-01","2015-07-01","2015-08-01"]
[]
[null,null,{"$f":"'[1]Tasa de Falla'!C17","v":1},{"$f":"'[1]Tasa de Falla'!D17","v":"AGUA BLANCA - VILLA QUINTEROS"},{"$f":"'[1]Tasa de Falla'!E17","v":132},{"$f":"'[1]Tasa de Falla'!F17","v":23.8},{"$f":"IF('[1]Tasa de Falla'!IO17=0,\"\",'[1]Tasa de Falla'!IO17)","v":""},{"$f":"IF('[1]Tasa de Falla'!IP17=0,\"\",'[1]Tasa de Falla'!IP17)","v":""},{"$f":"IF('[1]Tasa de Falla'!IQ17=0,\"\",'[1]Tasa de Falla'!IQ17)","v":""},{"$f":"IF('[1]Tasa de Falla'!IR17=0,\"\",'[1]Tasa de Falla'!IR17)","v":""},{"$f":"IF('[1]Tasa de Falla'!IS17=0,\"\",'[1]Tasa de Falla'!IS17)","v":""},{"$f":"IF('[1]Tasa de Falla'!IT17=0,\"\",'[1]Tasa de Falla'!IT17)","v":""},{"$f":"IF('[1]Tasa de Falla'!IU17=0,\"\",'[1]Tasa de Falla'!IU17)","v":""},{"$f":"IF('[1]Tasa de Falla'!IV17=0,\"\",'[1]Tasa de Falla'!IV17)","v":""},{"$f":"IF('[1]Tasa de Falla'!IW17=0,\"\",'[1]Tasa de Falla'!IW17)","v":""},{"$f":"IF('[1]Tasa de Falla'!IX17=0,\"\",'[1]Tasa de Falla'!IX17)","v":""},{"$f":"IF('[1]Tasa de Falla'!IY17=0,\"\",'[1]Tasa de Falla'!IY17)","v":""},{"$f":"IF('[1]Tasa de Falla'!IZ17=0,\"\",'[1]Tasa de Falla'!IZ17)","v":""}]
[null,null,{"$f":"'[1]Tasa de Falla'!C18","v":2},{"$f":"'[1]Tasa de Falla'!D18","v":"AGUILARES - ESCABA"},{"$f":"'[1]Tasa de Falla'!E18","v":132},{"$f":"'[1]Tasa de Falla'!F18","v":27},{"$f":"IF('[1]Tasa de Falla'!IO18=0,\"\",'[1]Tasa de Falla'!IO18)","v":""},{"$f":"IF('[1]Tasa de Falla'!IP18=0,\"\",'[1]Tasa de Falla'!IP18)","v":1},{"$f":"IF('[1]Tasa de Falla'!IQ18=0,\"\",'[1]Tasa de Falla'!IQ18)","v":""},{"$f":"IF('[1]Tasa de Falla'!IR18=0,\"\",'[1]Tasa de Falla'!IR18)","v":""},{"$f":"IF('[1]Tasa de Falla'!IS18=0,\"\",'[1]Tasa de Falla'!IS18)","v":""},{"$f":"IF('[1]Tasa de Falla'!IT18=0,\"\",'[1]Tasa de Falla'!IT18)","v":""},{"$f":"IF('[1]Tasa de Falla'!IU18=0,\"\",'[1]Tasa de Falla'!IU18)","v":""},{"$f":"IF('[1]Tasa de Falla'!IV18=0,\"\",'[1]Tasa de Falla'!IV18)","v":""},{"$f":"IF('[1]Tasa de Falla'!IW18=0,\"\",'[1]Tasa de Falla'!IW18)","v":""},{"$f":"IF('[1]Tasa de Falla'!IX18=0,\"\",'[1]Tasa de Falla'!IX18)","v":""},{"$f":"IF('[1]Tasa de Falla'!IY18=0,\"\",'[1]Tasa de Falla'!IY18)","v":""},{"$f":"IF('[1]Tasa de Falla'!IZ18=0,\"\",'[1]Tasa de Falla'!IZ18)","v":""}]
[null,null,{"$f":"'[1]Tasa de Falla'!C19","v":3},{"$f":"'[1]Tasa de Falla'!D19","v":"CABRA CORRAL - SALTA SUR"},{"$f":"'[1]Tasa de Falla'!E19","v":132},{"$f":"'[1]Tasa de Falla'!F19","v":62},{"$f":"IF('[1]Tasa de Falla'!IO19=0,\"\",'[1]Tasa de Falla'!IO19)","v":"XXXX"},{"$f":"IF('[1]Tasa de Falla'!IP19=0,\"\",'[1]Tasa de Falla'!IP19)","v":"XXXX"},{"$f":"IF('[1]Tasa de Falla'!IQ19=0,\"\",'[1]Tasa de Falla'!IQ19)","v":"XXXX"},{"$f":"IF('[1]Tasa de Falla'!IR19=0,\"\",'[1]Tasa de Falla'!IR19)","v":"XXXX"},{"$f":"IF('[1]Tasa de Falla'!IS19=0,\"\",'[1]Tasa de Falla'!IS19)","v":"XXXX"},{"$f":"IF('[1]Tasa de Falla'!IT19=0,\"\",'[1]Tasa de Falla'!IT19)","v":"XXXX"},{"$f":"IF('[1]Tasa de Falla'!IU19=0,\"\",'[1]Tasa de Falla'!IU19)","v":"XXXX"},{"$f":"IF('[1]Tasa de Falla'!IV19=0,\"\",'[1]Tasa de Falla'!IV19)","v":"XXXX"},{"$f":"IF('[1]Tasa de Falla'!IW19=0,\"\",'[1]Tasa de Falla'!IW19)","v":"XXXX"},{"$f":"IF('[1]Tasa de Falla'!IX19=0,\"\",'[1]Tasa de Falla'!IX19)","v":"XXXX"},{"$f":"IF('[1]Tasa de Falla'!IY19=0,\"\",'[1]Tasa de Falla'!IY19)","v":"XXXX"},{"$f":"IF('[1]Tasa de Falla'!IZ19=0,\"\",'[1]Tasa de Falla'!IZ19)","v":"XXXX"}]
[null,null,{"$f":"'[1]Tasa de Falla'!C20","v":4},{"$f":"'[1]Tasa de Falla'!D20","v":"CEVIL POZO - TUCUMAN NORTE"},{"$f":"'[1]Tasa de Falla'!E20","v":132},{"$f":"'[1]Tasa de Falla'!F20","v":14.5},{"$f":"IF('[1]Tasa de Falla'!IO20=0,\"\",'[1]Tasa de Falla'!IO20)","v":""},{"$f":"IF('[1]Tasa de Falla'!IP20=0,\"\",'[1]Tasa de Falla'!IP20)","v":""},{"$f":"IF('[1]Tasa de Falla'!IQ20=0,\"\",'[1]Tasa de Falla'!IQ20)","v":""},{"$f":"IF('[1]Tasa de Falla'!IR20=0,\"\",'[1]Tasa de Falla'!IR20)","v":""},{"$f":"IF('[1]Tasa de Falla'!IS20=0,\"\",'[1]Tasa de Falla'!IS20)","v":""},{"$f":"IF('[1]Tasa de Falla'!IT20=0,\"\",'[1]Tasa de Falla'!IT20)","v":""},{"$f":"IF('[1]Tasa de Falla'!IU20=0,\"\",'[1]Tasa de Falla'!IU20)","v":""},{"$f":"IF('[1]Tasa de Falla'!IV20=0,\"\",'[1]Tasa de Falla'!IV20)","v":""},{"$f":"IF('[1]Tasa de Falla'!IW20=0,\"\",'[1]Tasa de Falla'!IW20)","v":""},{"$f":"IF('[1]Tasa de Falla'!IX20=0,\"\",'[1]Tasa de Falla'!IX20)","v":""},{"$f":"IF('[1]Tasa de Falla'!IY20=0,\"\",'[1]Tasa de Falla'!IY20)","v":""},{"$f":"IF('[1]Tasa de Falla'!IZ20=0,\"\",'[1]Tasa de Falla'!IZ20)","v":""}]
[null,null,{"$f":"'[1]Tasa de Falla'!C21","v":5},{"$f":"'[1]Tasa de Falla'!D21","v":"CAMPO SANTO - MINETTI"},{"$f":"'[1]Tasa de Falla'!E21","v":132},{"$f":"'[1]Tasa de Falla'!F21","v":29.9},{"$f":"IF('[1]Tasa de Falla'!IO21=0,\"\",'[1]Tasa de Falla'!IO21)","v":"XXXX"},{"$f":"IF('[1]Tasa de Falla'!IP21=0,\"\",'[1]Tasa de Falla'!IP21)","v":"XXXX"},{"$f":"IF('[1]Tasa de Falla'!IQ21=0,\"\",'[1]Tasa de Falla'!IQ21)","v":"XXXX"},{"$f":"IF('[1]Tasa de Falla'!IR21=0,\"\",'[1]Tasa de Falla'!IR21)","v":"XXXX"},{"$f":"IF('[1]Tasa de Falla'!IS21=0,\"\",'[1]Tasa de Falla'!IS21)","v":"XXXX"},{"$f":"IF('[1]Tasa de Falla'!IT21=0,\"\",'[1]Tasa de Falla'!IT21)","v":"XXXX"},{"$f":"IF('[1]Tasa de Falla'!IU21=0,\"\",'[1]Tasa de Falla'!IU21)","v":"XXXX"},{"$f":"IF('[1]Tasa de Falla'!IV21=0,\"\",'[1]Tasa de Falla'!IV21)","v":"XXXX"},{"$f":"IF('[1]Tasa de Falla'!IW21=0,\"\",'[1]Tasa de Falla'!IW21)","v":"XXXX"},{"$f":"IF('[1]Tasa de Falla'!IX21=0,\"\",'[1]Tasa de Falla'!IX21)","v":"XXXX"},{"$f":"IF('[1]Tasa de Falla'!IY21=0,\"\",'[1]Tasa de Falla'!IY21)","v":"XXXX"},{"$f":"IF('[1]Tasa de Falla'!IZ21=0,\"\",'[1]Tasa de Falla'!IZ21)","v":"XXXX"}]
[null,null,{"$f":"'[1]Tasa de Falla'!C22","v":6},{"$f":"'[1]Tasa de Falla'!D22","v":"ESCABA - HUACRA"},{"$f":"'[1]Tasa de Falla'!E22","v":132},{"$f":"'[1]Tasa de Falla'!F22","v":49.9},{"$f":"IF('[1]Tasa de Falla'!IO22=0,\"\",'[1]Tasa de Falla'!IO22)","v":"XXXX"},{"$f":"IF('[1]Tasa de Falla'!IP22=0,\"\",'[1]Tasa de Falla'!IP22)","v":"XXXX"},{"$f":"IF('[1]Tasa de Falla'!IQ22=0,\"\",'[1]Tasa de Falla'!IQ22)","v":"XXXX"},{"$f":"IF('[1]Tasa de Falla'!IR22=0,\"\",'[1]Tasa de Falla'!IR22)","v":"XXXX"},{"$f":"IF('[1]Tasa de Falla'!IS22=0,\"\",'[1]Tasa de Falla'!IS22)","v":"XXXX"},{"$f":"IF('[1]Tasa de Falla'!IT22=0,\"\",'[1]Tasa de Falla'!IT22)","v":"XXXX"},{"$f":"IF('[1]Tasa de Falla'!IU22=0,\"\",'[1]Tasa de Falla'!IU22)","v":"XXXX"},{"$f":"IF('[1]Tasa de Falla'!IV22=0,\"\",'[1]Tasa de Falla'!IV22)","v":"XXXX"},{"$f":"IF('[1]Tasa de Falla'!IW22=0,\"\",'[1]Tasa de Falla'!IW22)","v":"XXXX"},{"$f":"IF('[1]Tasa de Falla'!IX22=0,\"\",'[1]Tasa de Falla'!IX22)","v":"XXXX"},{"$f":"IF('[1]Tasa de Falla'!IY22=0,\"\",'[1]Tasa de Falla'!IY22)","v":"XXXX"},{"$f":"IF('[1]Tasa de Falla'!IZ22=0,\"\",'[1]Tasa de Falla'!IZ22)","v":"XXXX"}]
[null,null,{"$f":"'[1]Tasa de Falla'!C23","v":7},{"$f":"'[1]Tasa de Falla'!D23","v":"ESTATICA SUR - EL BRACHO"},{"$f":"'[1]Tasa de Falla'!E23","v":132},{"$f":"'[1]Tasa de Falla'!F23","v":19.600000000000001},{"$f":"IF('[1]Tasa de Falla'!IO23=0,\"\",'[1]Tasa de Falla'!IO23)","v":""},{"$f":"IF('[1]Tasa de Falla'!IP23=0,\"\",'[1]Tasa de Falla'!IP23)","v":""},{"$f":"IF('[1]Tasa de Falla'!IQ23=0,\"\",'[1]Tasa de Falla'!IQ23)","v":""},{"$f":"IF('[1]Tasa de Falla'!IR23=0,\"\",'[1]Tasa de Falla'!IR23)","v":""},{"$f":"IF('[1]Tasa de Falla'!IS23=0,\"\",'[1]Tasa de Falla'!IS23)","v":""},{"$f":"IF('[1]Tasa de Falla'!IT23=0,\"\",'[1]Tasa de Falla'!IT23)","v":""},{"$f":"IF('[1]Tasa de Falla'!IU23=0,\"\",'[1]Tasa de Falla'!IU23)","v":""},{"$f":"IF('[1]Tasa de Falla'!IV23=0,\"\",'[1]Tasa de Falla'!IV23)","v":"XXXX"},{"$f":"IF('[1]Tasa de Falla'!IW23=0,\"\",'[1]Tasa de Falla'!IW23)","v":"XXXX"},{"$f":"IF('[1]Tasa de Falla'!IX23=0,\"\",'[1]Tasa de Falla'!IX23)","v":"XXXX"},{"$f":"IF('[1]Tasa de Falla'!IY23=0,\"\",'[1]Tasa de Falla'!IY23)","v":"XXXX"},{"$f":"IF('[1]Tasa de Falla'!IZ23=0,\"\",'[1]Tasa de Falla'!IZ23)","v":"XXXX"}]
[null,null,{"$f":"'[1]Tasa de Falla'!C24","v":8},{"$f":"'[1]Tasa de Falla'!D24","v":"ESTATICA SUR - INDEPENDENCIA 1 (O.F.)"},{"$f":"'[1]Tasa de Falla'!E24","v":132},{"$f":"'[1]Tasa de Falla'!F24","v":2.6},{"$f":"IF('[1]Tasa de Falla'!IO24=0,\"\",'[1]Tasa de Falla'!IO24)","v":""},{"$f":"IF('[1]Tasa de Falla'!IP24=0,\"\",'[1]Tasa de Falla'!IP24)","v":""},{"$f":"IF('[1]Tasa de Falla'!IQ24=0,\"\",'[1]Tasa de Falla'!IQ24)","v":""},{"$f":"IF('[1]Tasa de Falla'!IR24=0,\"\",'[1]Tasa de Falla'!IR24)","v":""},{"$f":"IF('[1]Tasa de Falla'!IS24=0,\"\",'[1]Tasa de Falla'!IS24)","v":""},{"$f":"IF('[1]Tasa de Falla'!IT24=0,\"\",'[1]Tasa de Falla'!IT24)","v":""},{"$f":"IF('[1]Tasa de Falla'!IU24=0,\"\",'[1]Tasa de Falla'!IU24)","v":""},{"$f":"IF('[1]Tasa de Falla'!IV24=0,\"\",'[1]Tasa de Falla'!IV24)","v":""},{"$f":"IF('[1]Tasa de Falla'!IW24=0,\"\",'[1]Tasa de Falla'!IW24)","v":""},{"$f":"IF('[1]Tasa de Falla'!IX24=0,\"\",'[1]Tasa de Falla'!IX24)","v":""},{"$f":"IF('[1]Tasa de Falla'!IY24=0,\"\",'[1]Tasa de Falla'!IY24)","v":""},{"$f":"IF('[1]Tasa de Falla'!IZ24=0,\"\",'[1]Tasa de Falla'!IZ24)","v":1}]
[null,null,{"$f":"'[1]Tasa de Falla'!C25","v":9},{"$f":"'[1]Tasa de Falla'!D25","v":"ESTATICA SUR - SARMIENTO \"TRANSNOA S.A.\""},{"$f":"'[1]Tasa de Falla'!E25","v":132},{"$f":"'[1]Tasa de Falla'!F25","v":4.4000000000000004},{"$f":"IF('[1]Tasa de Falla'!IO25=0,\"\",'[1]Tasa de Falla'!IO25)","v":""},{"$f":"IF('[1]Tasa de Falla'!IP25=0,\"\",'[1]Tasa de Falla'!IP25)","v":""},{"$f":"IF('[1]Tasa de Falla'!IQ25=0,\"\",'[1]Tasa de Falla'!IQ25)","v":""},{"$f":"IF('[1]Tasa de Falla'!IR25=0,\"\",'[1]Tasa de Falla'!IR25)","v":""},{"$f":"IF('[1]Tasa de Falla'!IS25=0,\"\",'[1]Tasa de Falla'!IS25)","v":""},{"$f":"IF('[1]Tasa de Falla'!IT25=0,\"\",'[1]Tasa de Falla'!IT25)","v":""},{"$f":"IF('[1]Tasa de Falla'!IU25=0,\"\",'[1]Tasa de Falla'!IU25)","v":""},{"$f":"IF('[1]Tasa de Falla'!IV25=0,\"\",'[1]Tasa de Falla'!IV25)","v":""},{"$f":"IF('[1]Tasa de Falla'!IW25=0,\"\",'[1]Tasa de Falla'!IW25)","v":""},{"$f":"IF('[1]Tasa de Falla'!IX25=0,\"\",'[1]Tasa de Falla'!IX25)","v":""},{"$f":"IF('[1]Tasa de Falla'!IY25=0,\"\",'[1]Tasa de Falla'!IY25)","v":""},{"$f":"IF('[1]Tasa de Falla'!IZ25=0,\"\",'[1]Tasa de Falla'!IZ25)","v":""}]
[null,null,{"$f":"'[1]Tasa de Falla'!C26","v":10},{"$f":"'[1]Tasa de Falla'!D26","v":"GÜEMES - EL BRACHO"},{"$f":"'[1]Tasa de Falla'!E26","v":132},{"$f":"'[1]Tasa de Falla'!F26","v":308},{"$f":"IF('[1]Tasa de Falla'!IO26=0,\"\",'[1]Tasa de Falla'!IO26)","v":"XXXX"},{"$f":"IF('[1]Tasa de Falla'!IP26=0,\"\",'[1]Tasa de Falla'!IP26)","v":"XXXX"},{"$f":"IF('[1]Tasa de Falla'!IQ26=0,\"\",'[1]Tasa de Falla'!IQ26)","v":"XXXX"},{"$f":"IF('[1]Tasa de Falla'!IR26=0,\"\",'[1]Tasa de Falla'!IR26)","v":"XXXX"},{"$f":"IF('[1]Tasa de Falla'!IS26=0,\"\",'[1]Tasa de Falla'!IS26)","v":"XXXX"},{"$f":"IF('[1]Tasa de Falla'!IT26=0,\"\",'[1]Tasa de Falla'!IT26)","v":"XXXX"},{"$f":"IF('[1]Tasa de Falla'!IU26=0,\"\",'[1]Tasa de Falla'!IU26)","v":"XXXX"},{"$f":"IF('[1]Tasa de Falla'!IV26=0,\"\",'[1]Tasa de Falla'!IV26)","v":"XXXX"},{"$f":"IF('[1]Tasa de Falla'!IW26=0,\"\",'[1]Tasa de Falla'!IW26)","v":"XXXX"},{"$f":"IF('[1]Tasa de Falla'!IX26=0,\"\",'[1]Tasa de Falla'!IX26)","v":"XXXX"},{"$f":"IF('[1]Tasa de Falla'!IY26=0,\"\",'[1]Tasa de Falla'!IY26)","v":"XXXX"},{"$f":"IF('[1]Tasa de Falla'!IZ26=0,\"\",'[1]Tasa de Falla'!IZ26)","v":"XXXX"}]
[null,null,{"$f":"'[1]Tasa de Falla'!C27","v":11},{"$f":"'[1]Tasa de Falla'!D27","v":"CAMPO SANTO - GÜEMES"},{"$f":"'[1]Tasa de Falla'!E27","v":132},{"$f":"'[1]Tasa de Falla'!F27","v":6.2},{"$f":"IF('[1]Tasa de Falla'!IO27=0,\"\",'[1]Tasa de Falla'!IO27)","v":"XXXX"},{"$f":"IF('[1]Tasa de Falla'!IP27=0,\"\",'[1]Tasa de Falla'!IP27)","v":"XXXX"},{"$f":"IF('[1]Tasa de Falla'!IQ27=0,\"\",'[1]Tasa de Falla'!IQ27)","v":"XXXX"},{"$f":"IF('[1]Tasa de Falla'!IR27=0,\"\",'[1]Tasa de Falla'!IR27)","v":"XXXX"},{"$f":"IF('[1]Tasa de Falla'!IS27=0,\"\",'[1]Tasa de Falla'!IS27)","v":"XXXX"},{"$f":"IF('[1]Tasa de Falla'!IT27=0,\"\",'[1]Tasa de Falla'!IT27)","v":"XXXX"},{"$f":"IF('[1]Tasa de Falla'!IU27=0,\"\",'[1]Tasa de Falla'!IU27)","v":"XXXX"},{"$f":"IF('[1]Tasa de Falla'!IV27=0,\"\",'[1]Tasa de Falla'!IV27)","v":"XXXX"},{"$f":"IF('[1]Tasa de Falla'!IW27=0,\"\",'[1]Tasa de Falla'!IW27)","v":"XXXX"},{"$f":"IF('[1]Tasa de Falla'!IX27=0,\"\",'[1]Tasa de Falla'!IX27)","v":"XXXX"},{"$f":"IF('[1]Tasa de Falla'!IY27=0,\"\",'[1]Tasa de Falla'!IY27)","v":"XXXX"},{"$f":"IF('[1]Tasa de Falla'!IZ27=0,\"\",'[1]Tasa de Falla'!IZ27)","v":"XXXX"}]
[null,null,{"$f":"'[1]Tasa de Falla'!C28","v":12},{"$f":"'[1]Tasa de Falla'!D28","v":"GÜEMES - SAN JUANCITO"},{"$f":"'[1]Tasa de Falla'!E28","v":132},{"$f":"'[1]Tasa de Falla'!F28","v":36.24},{"$f":"IF('[1]Tasa de Falla'!IO28=0,\"\",'[1]Tasa de Falla'!IO28)","v":""},{"$f":"IF('[1]Tasa de Falla'!IP28=0,\"\",'[1]Tasa de Falla'!IP28)","v":""},{"$f":"IF('[1]Tasa de Falla'!IQ28=0,\"\",'[1]Tasa de Falla'!IQ28)","v":""},{"$f":"IF('[1]Tasa de Falla'!IR28=0,\"\",'[1]Tasa de Falla'!IR28)","v":""},{"$f":"IF('[1]Tasa de Falla'!IS28=0,\"\",'[1]Tasa de Falla'!IS28)","v":""},{"$f":"IF('[1]Tasa de Falla'!IT28=0,\"\",'[1]Tasa de Falla'!IT28)","v":""},{"$f":"IF('[1]Tasa de Falla'!IU28=0,\"\",'[1]Tasa de Falla'!IU28)","v":""},{"$f":"IF('[1]Tasa de Falla'!IV28=0,\"\",'[1]Tasa de Falla'!IV28)","v":""},{"$f":"IF('[1]Tasa de Falla'!IW28=0,\"\",'[1]Tasa de Falla'!IW28)","v":3},{"$f":"IF('[1]Tasa de Falla'!IX28=0,\"\",'[1]Tasa de Falla'!IX28)","v":1},{"$f":"IF('[1]Tasa de Falla'!IY28=0,\"\",'[1]Tasa de Falla'!IY28)","v":""},{"$f":"IF('[1]Tasa de Falla'!IZ28=0,\"\",'[1]Tasa de Falla'!IZ28)","v":""}]
[null,null,{"$f":"'[1]Tasa de Falla'!C29","v":13},{"$f":"'[1]Tasa de Falla'!D29","v":"CATAMARCA - HUACRA"},{"$f":"'[1]Tasa de Falla'!E29","v":132},{"$f":"'[1]Tasa de Falla'!F29","v":67.3},{"$f":"IF('[1]Tasa de Falla'!IO29=0,\"\",'[1]Tasa de Falla'!IO29)","v":""},{"$f":"IF('[1]Tasa de Falla'!IP29=0,\"\",'[1]Tasa de Falla'!IP29)","v":""},{"$f":"IF('[1]Tasa de Falla'!IQ29=0,\"\",'[1]Tasa de Falla'!IQ29)","v":""},{"$f":"IF('[1]Tasa de Falla'!IR29=0,\"\",'[1]Tasa de Falla'!IR29)","v":""},{"$f":"IF('[1]Tasa de Falla'!IS29=0,\"\",'[1]Tasa de Falla'!IS29)","v":""},{"$f":"IF('[1]Tasa de Falla'!IT29=0,\"\",'[1]Tasa de Falla'!IT29)","v":""},{"$f":"IF('[1]Tasa de Falla'!IU29=0,\"\",'[1]Tasa de Falla'!IU29)","v":""},{"$f":"IF('[1]Tasa de Falla'!IV29=0,\"\",'[1]Tasa de Falla'!IV29)","v":""},{"$f":"IF('[1]Tasa de Falla'!IW29=0,\"\",'[1]Tasa de Falla'!IW29)","v":1},{"$f":"IF('[1]Tasa de Falla'!IX29=0,\"\",'[1]Tasa de Falla'!IX29)","v":""},{"$f":"IF('[1]Tasa de Falla'!IY29=0,\"\",'[1]Tasa de Falla'!IY29)","v":""},{"$f":"IF('[1]Tasa de Falla'!IZ29=0,\"\",'[1]Tasa de Falla'!IZ29)","v":""}]
[null,null,{"$f":"'[1]Tasa de Falla'!C30","v":14},{"$f":"'[1]Tasa de Falla'!D30","v":"HUACRA - LA CALERA"},{"$f":"'[1]Tasa de Falla'!E30","v":132},{"$f":"'[1]Tasa de Falla'!F30","v":91.2},{"$f":"IF('[1]Tasa de Falla'!IO30=0,\"\",'[1]Tasa de Falla'!IO30)","v":""},{"$f":"IF('[1]Tasa de Falla'!IP30=0,\"\",'[1]Tasa de Falla'!IP30)","v":""},{"$f":"IF('[1]Tasa de Falla'!IQ30=0,\"\",'[1]Tasa de Falla'!IQ30)","v":""},{"$f":"IF('[1]Tasa de Falla'!IR30=0,\"\",'[1]Tasa de Falla'!IR30)","v":""},{"$f":"IF('[1]Tasa de Falla'!IS30=0,\"\",'[1]Tasa de Falla'!IS30)","v":""},{"$f":"IF('[1]Tasa de Falla'!IT30=0,\"\",'[1]Tasa de Falla'!IT30)","v":""},{"$f":"IF('[1]Tasa de Falla'!IU30=0,\"\",'[1]Tasa de Falla'!IU30)","v":""},{"$f":"IF('[1]Tasa de Falla'!IV30=0,\"\",'[1]Tasa de Falla'!IV30)","v":""},{"$f":"IF('[1]Tasa de Falla'!IW30=0,\"\",'[1]Tasa de Falla'!IW30)","v":""},{"$f":"IF('[1]Tasa de Falla'!IX30=0,\"\",'[1]Tasa de Falla'!IX30)","v":1},{"$f":"IF('[1]Tasa de Falla'!IY30=0,\"\",'[1]Tasa de Falla'!IY30)","v":""},{"$f":"IF('[1]Tasa de Falla'!IZ30=0,\"\",'[1]Tasa de Falla'!IZ30)","v":""}]
[null,null,{"$f":"'[1]Tasa de Falla'!C31","v":15},{"$f":"'[1]Tasa de Falla'!D31","v":"AGUA BLANCA - INDEPENDENCIA"},{"$f":"'[1]Tasa de Falla'!E31","v":132},{"$f":"'[1]Tasa de Falla'!F31","v":34.14},{"$f":"IF('[1]Tasa de Falla'!IO31=0,\"\",'[1]Tasa de Falla'!IO31)","v":""},{"$f":"IF('[1]Tasa de Falla'!IP31=0,\"\",'[1]Tasa de Falla'!IP31)","v":""},{"$f":"IF('[1]Tasa de Falla'!IQ31=0,\"\",'[1]Tasa de Falla'!IQ31)","v":1},{"$f":"IF('[1]Tasa de Falla'!IR31=0,\"\",'[1]Tasa de Falla'!IR31)","v":""},{"$f":"IF('[1]Tasa de Falla'!IS31=0,\"\",'[1]Tasa de Falla'!IS31)","v":""},{"$f":"IF('[1]Tasa de Falla'!IT31=0,\"\",'[1]Tasa de Falla'!IT31)","v":1},{"$f":"IF('[1]Tasa de Falla'!IU31=0,\"\",'[1]Tasa de Falla'!IU31)","v":""},{"$f":"IF('[1]Tasa de Falla'!IV31=0,\"\",'[1]Tasa de Falla'!IV31)","v":""},{"$f":"IF('[1]Tasa de Falla'!IW31=0,\"\",'[1]Tasa de Falla'!IW31)","v":""},{"$f":"IF('[1]Tasa de Falla'!IX31=0,\"\",'[1]Tasa de Falla'!IX31)","v":""},{"$f":"IF('[1]Tasa de Falla'!IY31=0,\"\",'[1]Tasa de Falla'!IY31)","v":""},{"$f":"IF('[1]Tasa de Falla'!IZ31=0,\"\",'[1]Tasa de Falla'!IZ31)","v":""}]
[null,null,{"$f":"'[1]Tasa de Falla'!C32","v":16},{"$f":"'[1]Tasa de Falla'!D32","v":"INDEPENDENCIA - EL BRACHO 1"},{"$f":"'[1]Tasa de Falla'!E32","v":132},{"$f":"'[1]Tasa de Falla'!F32","v":17.100000000000001},{"$f":"IF('[1]Tasa de Falla'!IO32=0,\"\",'[1]Tasa de Falla'!IO32)","v":""},{"$f":"IF('[1]Tasa de Falla'!IP32=0,\"\",'[1]Tasa de Falla'!IP32)","v":""},{"$f":"IF('[1]Tasa de Falla'!IQ32=0,\"\",'[1]Tasa de Falla'!IQ32)","v":""},{"$f":"IF('[1]Tasa de Falla'!IR32=0,\"\",'[1]Tasa de Falla'!IR32)","v":""},{"$f":"IF('[1]Tasa de Falla'!IS32=0,\"\",'[1]Tasa de Falla'!IS32)","v":""},{"$f":"IF('[1]Tasa de Falla'!IT32=0,\"\",'[1]Tasa de Falla'!IT32)","v":1},{"$f":"IF('[1]Tasa de Falla'!IU32=0,\"\",'[1]Tasa de Falla'!IU32)","v":""},{"$f":"IF('[1]Tasa de Falla'!IV32=0,\"\",'[1]Tasa de Falla'!IV32)","v":""},{"$f":"IF('[1]Tasa de Falla'!IW32=0,\"\",'[1]Tasa de Falla'!IW32)","v":""},{"$f":"IF('[1]Tasa de Falla'!IX32=0,\"\",'[1]Tasa de Falla'!IX32)","v":""},{"$f":"IF('[1]Tasa de Falla'!IY32=0,\"\",'[1]Tasa de Falla'!IY32)","v":""},{"$f":"IF('[1]Tasa de Falla'!IZ32=0,\"\",'[1]Tasa de Falla'!IZ32)","v":""}]
[null,null,{"$f":"'[1]Tasa de Falla'!C33","v":17},{"$f":"'[1]Tasa de Falla'!D33","v":"INDEPENDENCIA - LULES - PAPEL TUCUMAN"},{"$f":"'[1]Tasa de Falla'!E33","v":132},{"$f":"'[1]Tasa de Falla'!F33","v":19.3},{"$f":"IF('[1]Tasa de Falla'!IO33=0,\"\",'[1]Tasa de Falla'!IO33)","v":""},{"$f":"IF('[1]Tasa de Falla'!IP33=0,\"\",'[1]Tasa de Falla'!IP33)","v":""},{"$f":"IF('[1]Tasa de Falla'!IQ33=0,\"\",'[1]Tasa de Falla'!IQ33)","v":""},{"$f":"IF('[1]Tasa de Falla'!IR33=0,\"\",'[1]Tasa de Falla'!IR33)","v":""},{"$f":"IF('[1]Tasa de Falla'!IS33=0,\"\",'[1]Tasa de Falla'!IS33)","v":""},{"$f":"IF('[1]Tasa de Falla'!IT33=0,\"\",'[1]Tasa de Falla'!IT33)","v":""},{"$f":"IF('[1]Tasa de Falla'!IU33=0,\"\",'[1]Tasa de Falla'!IU33)","v":""},{"$f":"IF('[1]Tasa de Falla'!IV33=0,\"\",'[1]Tasa de Falla'!IV33)","v":""},{"$f":"IF('[1]Tasa de Falla'!IW33=0,\"\",'[1]Tasa de Falla'!IW33)","v":""},{"$f":"IF('[1]Tasa de Falla'!IX33=0,\"\",'[1]Tasa de Falla'!IX33)","v":""},{"$f":"IF('[1]Tasa de Falla'!IY33=0,\"\",'[1]Tasa de Falla'!IY33)","v":""},{"$f":"IF('[1]Tasa de Falla'!IZ33=0,\"\",'[1]Tasa de Falla'!IZ33)","v":""}]
[null,null,{"$f":"'[1]Tasa de Falla'!C34","v":18},{"$f":"'[1]Tasa de Falla'!D34","v":"FRIAS - LA CALERA NOA."},{"$f":"'[1]Tasa de Falla'!E34","v":132},{"$f":"'[1]Tasa de Falla'!F34","v":27.3},{"$f":"IF('[1]Tasa de Falla'!IO34=0,\"\",'[1]Tasa de Falla'!IO34)","v":""},{"$f":"IF('[1]Tasa de Falla'!IP34=0,\"\",'[1]Tasa de Falla'!IP34)","v":""},{"$f":"IF('[1]Tasa de Falla'!IQ34=0,\"\",'[1]Tasa de Falla'!IQ34)","v":""},{"$f":"IF('[1]Tasa de Falla'!IR34=0,\"\",'[1]Tasa de Falla'!IR34)","v":""},{"$f":"IF('[1]Tasa de Falla'!IS34=0,\"\",'[1]Tasa de Falla'!IS34)","v":1},{"$f":"IF('[1]Tasa de Falla'!IT34=0,\"\",'[1]Tasa de Falla'!IT34)","v":""},{"$f":"IF('[1]Tasa de Falla'!IU34=0,\"\",'[1]Tasa de Falla'!IU34)","v":""},{"$f":"IF('[1]Tasa de Falla'!IV34=0,\"\",'[1]Tasa de Falla'!IV34)","v":""},{"$f":"IF('[1]Tasa de Falla'!IW34=0,\"\",'[1]Tasa de Falla'!IW34)","v":""},{"$f":"IF('[1]Tasa de Falla'!IX34=0,\"\",'[1]Tasa de Falla'!IX34)","v":""},{"$f":"IF('[1]Tasa de Falla'!IY34=0,\"\",'[1]Tasa de Falla'!IY34)","v":""},{"$f":"IF('[1]Tasa de Falla'!IZ34=0,\"\",'[1]Tasa de Falla'!IZ34)","v":""}]
[null,null,{"$f":"'[1]Tasa de Falla'!C35","v":19},{"$f":"'[1]Tasa de Falla'!D35","v":"LA BANDA - SANTIAGO CENTRO"},{"$f":"'[1]Tasa de Falla'!E35","v":132},{"$f":"'[1]Tasa de Falla'!F35","v":10.91},{"$f":"IF('[1]Tasa de Falla'!IO35=0,\"\",'[1]Tasa de Falla'!IO35)","v":""},{"$f":"IF('[1]Tasa de Falla'!IP35=0,\"\",'[1]Tasa de Falla'!IP35)","v":""},{"$f":"IF('[1]Tasa de Falla'!IQ35=0,\"\",'[1]Tasa de Falla'!IQ35)","v":""},{"$f":"IF('[1]Tasa de Falla'!IR35=0,\"\",'[1]Tasa de Falla'!IR35)","v":""},{"$f":"IF('[1]Tasa de Falla'!IS35=0,\"\",'[1]Tasa de Falla'!IS35)","v":""},{"$f":"IF('[1]Tasa de Falla'!IT35=0,\"\",'[1]Tasa de Falla'!IT35)","v":""},{"$f":"IF('[1]Tasa de Falla'!IU35=0,\"\",'[1]Tasa de Falla'!IU35)","v":""},{"$f":"IF('[1]Tasa de Falla'!IV35=0,\"\",'[1]Tasa de Falla'!IV35)","v":1},{"$f":"IF('[1]Tasa de Falla'!IW35=0,\"\",'[1]Tasa de Falla'!IW35)","v":""},{"$f":"IF('[1]Tasa de Falla'!IX35=0,\"\",'[1]Tasa de Falla'!IX35)","v":""},{"$f":"IF('[1]Tasa de Falla'!IY35=0,\"\",'[1]Tasa de Falla'!IY35)","v":""},{"$f":"IF('[1]Tasa de Falla'!IZ35=0,\"\",'[1]Tasa de Falla'!IZ35)","v":""}]
[null,null,{"$f":"'[1]Tasa de Falla'!C36","v":20},{"$f":"'[1]Tasa de Falla'!D36","v":"LIBERTADOR NOA. - PICHANAL"},{"$f":"'[1]Tasa de Falla'!E36","v":132},{"$f":"'[1]Tasa de Falla'!F36","v":76},{"$f":"IF('[1]Tasa de Falla'!IO36=0,\"\",'[1]Tasa de Falla'!IO36)","v":1},{"$f":"IF('[1]Tasa de Falla'!IP36=0,\"\",'[1]Tasa de Falla'!IP36)","v":""},{"$f":"IF('[1]Tasa de Falla'!IQ36=0,\"\",'[1]Tasa de Falla'!IQ36)","v":""},{"$f":"IF('[1]Tasa de Falla'!IR36=0,\"\",'[1]Tasa de Falla'!IR36)","v":2},{"$f":"IF('[1]Tasa de Falla'!IS36=0,\"\",'[1]Tasa de Falla'!IS36)","v":""},{"$f":"IF('[1]Tasa de Falla'!IT36=0,\"\",'[1]Tasa de Falla'!IT36)","v":1},{"$f":"IF('[1]Tasa de Falla'!IU36=0,\"\",'[1]Tasa de Falla'!IU36)","v":1},{"$f":"IF('[1]Tasa de Falla'!IV36=0,\"\",'[1]Tasa de Falla'!IV36)","v":4},{"$f":"IF('[1]Tasa de Falla'!IW36=0,\"\",'[1]Tasa de Falla'!IW36)","v":""},{"$f":"IF('[1]Tasa de Falla'!IX36=0,\"\",'[1]Tasa de Falla'!IX36)","v":""},{"$f":"IF('[1]Tasa de Falla'!IY36=0,\"\",'[1]Tasa de Falla'!IY36)","v":""},{"$f":"IF('[1]Tasa de Falla'!IZ36=0,\"\",'[1]Tasa de Falla'!IZ36)","v":""}]
[null,null,{"$f":"'[1]Tasa de Falla'!C37","v":21},{"$f":"'[1]Tasa de Falla'!D37","v":"GÜEMES - METAN"},{"$f":"'[1]Tasa de Falla'!E37","v":132},{"$f":"'[1]Tasa de Falla'!F37","v":97.13},{"$f":"IF('[1]Tasa de Falla'!IO37=0,\"\",'[1]Tasa de Falla'!IO37)","v":"XXXX"},{"$f":"IF('[1]Tasa de Falla'!IP37=0,\"\",'[1]Tasa de Falla'!IP37)","v":"XXXX"},{"$f":"IF('[1]Tasa de Falla'!IQ37=0,\"\",'[1]Tasa de Falla'!IQ37)","v":"XXXX"},{"$f":"IF('[1]Tasa de Falla'!IR37=0,\"\",'[1]Tasa de Falla'!IR37)","v":"XXXX"},{"$f":"IF('[1]Tasa de Falla'!IS37=0,\"\",'[1]Tasa de Falla'!IS37)","v":"XXXX"},{"$f":"IF('[1]Tasa de Falla'!IT37=0,\"\",'[1]Tasa de Falla'!IT37)","v":"XXXX"},{"$f":"IF('[1]Tasa de Falla'!IU37=0,\"\",'[1]Tasa de Falla'!IU37)","v":"XXXX"},{"$f":"IF('[1]Tasa de Falla'!IV37=0,\"\",'[1]Tasa de Falla'!IV37)","v":"XXXX"},{"$f":"IF('[1]Tasa de Falla'!IW37=0,\"\",'[1]Tasa de Falla'!IW37)","v":"XXXX"},{"$f":"IF('[1]Tasa de Falla'!IX37=0,\"\",'[1]Tasa de Falla'!IX37)","v":"XXXX"},{"$f":"IF('[1]Tasa de Falla'!IY37=0,\"\",'[1]Tasa de Falla'!IY37)","v":"XXXX"},{"$f":"IF('[1]Tasa de Falla'!IZ37=0,\"\",'[1]Tasa de Falla'!IZ37)","v":"XXXX"}]
[null,null,{"$f":"'[1]Tasa de Falla'!C38","v":22},{"$f":"'[1]Tasa de Falla'!D38","v":"MINETTI - SAN JUANCITO"},{"$f":"'[1]Tasa de Falla'!E38","v":132},{"$f":"'[1]Tasa de Falla'!F38","v":26},{"$f":"IF('[1]Tasa de Falla'!IO38=0,\"\",'[1]Tasa de Falla'!IO38)","v":""},{"$f":"IF('[1]Tasa de Falla'!IP38=0,\"\",'[1]Tasa de Falla'!IP38)","v":""},{"$f":"IF('[1]Tasa de Falla'!IQ38=0,\"\",'[1]Tasa de Falla'!IQ38)","v":""},{"$f":"IF('[1]Tasa de Falla'!IR38=0,\"\",'[1]Tasa de Falla'!IR38)","v":""},{"$f":"IF('[1]Tasa de Falla'!IS38=0,\"\",'[1]Tasa de Falla'!IS38)","v":""},{"$f":"IF('[1]Tasa de Falla'!IT38=0,\"\",'[1]Tasa de Falla'!IT38)","v":""},{"$f":"IF('[1]Tasa de Falla'!IU38=0,\"\",'[1]Tasa de Falla'!IU38)","v":""},{"$f":"IF('[1]Tasa de Falla'!IV38=0,\"\",'[1]Tasa de Falla'!IV38)","v":""},{"$f":"IF('[1]Tasa de Falla'!IW38=0,\"\",'[1]Tasa de Falla'!IW38)","v":""},{"$f":"IF('[1]Tasa de Falla'!IX38=0,\"\",'[1]Tasa de Falla'!IX38)","v":2},{"$f":"IF('[1]Tasa de Falla'!IY38=0,\"\",'[1]Tasa de Falla'!IY38)","v":""},{"$f":"IF('[1]Tasa de Falla'!IZ38=0,\"\",'[1]Tasa de Falla'!IZ38)","v":""}]
[null,null,{"$f":"'[1]Tasa de Falla'!C39","v":23},{"$f":"'[1]Tasa de Falla'!D39","v":"PALPALA - JUJUY SUR"},{"$f":"'[1]Tasa de Falla'!E39","v":132},{"$f":"'[1]Tasa de Falla'!F39","v":14},{"$f":"IF('[1]Tasa de Falla'!IO39=0,\"\",'[1]Tasa de Falla'!IO39)","v":"XXXX"},{"$f":"IF('[1]Tasa de Falla'!IP39=0,\"\",'[1]Tasa de Falla'!IP39)","v":"XXXX"},{"$f":"IF('[1]Tasa de Falla'!IQ39=0,\"\",'[1]Tasa de Falla'!IQ39)","v":"XXXX"},{"$f":"IF('[1]Tasa de Falla'!IR39=0,\"\",'[1]Tasa de Falla'!IR39)","v":"XXXX"},{"$f":"IF('[1]Tasa de Falla'!IS39=0,\"\",'[1]Tasa de Falla'!IS39)","v":"XXXX"},{"$f":"IF('[1]Tasa de Falla'!IT39=0,\"\",'[1]Tasa de Falla'!IT39)","v":"XXXX"},{"$f":"IF('[1]Tasa de Falla'!IU39=0,\"\",'[1]Tasa de Falla'!IU39)","v":"XXXX"},{"$f":"IF('[1]Tasa de Falla'!IV39=0,\"\",'[1]Tasa de Falla'!IV39)","v":"XXXX"},{"$f":"IF('[1]Tasa de Falla'!IW39=0,\"\",'[1]Tasa de Falla'!IW39)","v":"XXXX"},{"$f":"IF('[1]Tasa de Falla'!IX39=0,\"\",'[1]Tasa de Falla'!IX39)","v":"XXXX"},{"$f":"IF('[1]Tasa de Falla'!IY39=0,\"\",'[1]Tasa de Falla'!IY39)","v":"XXXX"},{"$f":"IF('[1]Tasa de Falla'!IZ39=0,\"\",'[1]Tasa de Falla'!IZ39)","v":"XXXX"}]
[null,null,{"$f":"'[1]Tasa de Falla'!C40","v":24},{"$f":"'[1]Tasa de Falla'!D40","v":"ORAN - PICHANAL"},{"$f":"'[1]Tasa de Falla'!E40","v":132},{"$f":"'[1]Tasa de Falla'!F40","v":17},{"$f":"IF('[1]Tasa de Falla'!IO40=0,\"\",'[1]Tasa de Falla'!IO40)","v":"XXXX"},{"$f":"IF('[1]Tasa de Falla'!IP40=0,\"\",'[1]Tasa de Falla'!IP40)","v":"XXXX"},{"$f":"IF('[1]Tasa de Falla'!IQ40=0,\"\",'[1]Tasa de Falla'!IQ40)","v":"XXXX"},{"$f":"IF('[1]Tasa de Falla'!IR40=0,\"\",'[1]Tasa de Falla'!IR40)","v":"XXXX"},{"$f":"IF('[1]Tasa de Falla'!IS40=0,\"\",'[1]Tasa de Falla'!IS40)","v":"XXXX"},{"$f":"IF('[1]Tasa de Falla'!IT40=0,\"\",'[1]Tasa de Falla'!IT40)","v":"XXXX"},{"$f":"IF('[1]Tasa de Falla'!IU40=0,\"\",'[1]Tasa de Falla'!IU40)","v":"XXXX"},{"$f":"IF('[1]Tasa de Falla'!IV40=0,\"\",'[1]Tasa de Falla'!IV40)","v":"XXXX"},{"$f":"IF('[1]Tasa de Falla'!IW40=0,\"\",'[1]Tasa de Falla'!IW40)","v":"XXXX"},{"$f":"IF('[1]Tasa de Falla'!IX40=0,\"\",'[1]Tasa de Falla'!IX40)","v":"XXXX"},{"$f":"IF('[1]Tasa de Falla'!IY40=0,\"\",'[1]Tasa de Falla'!IY40)","v":"XXXX"},{"$f":"IF('[1]Tasa de Falla'!IZ40=0,\"\",'[1]Tasa de Falla'!IZ40)","v":"XXXX"}]
[null,null,{"$f":"'[1]Tasa de Falla'!C41","v":25},{"$f":"'[1]Tasa de Falla'!D41","v":"PICHANAL - TARTAGAL"},{"$f":"'[1]Tasa de Falla'!E41","v":132},{"$f":"'[1]Tasa de Falla'!F41","v":105},{"$f":"IF('[1]Tasa de Falla'!IO41=0,\"\",'[1]Tasa de Falla'!IO41)","v":""},{"$f":"IF('[1]Tasa de Falla'!IP41=0,\"\",'[1]Tasa de Falla'!IP41)","v":""},{"$f":"IF('[1]Tasa de Falla'!IQ41=0,\"\",'[1]Tasa de Falla'!IQ41)","v":1},{"$f":"IF('[1]Tasa de Falla'!IR41=0,\"\",'[1]Tasa de Falla'!IR41)","v":1},{"$f":"IF('[1]Tasa de Falla'!IS41=0,\"\",'[1]Tasa de Falla'!IS41)","v":""},{"$f":"IF('[1]Tasa de Falla'!IT41=0,\"\",'[1]Tasa de Falla'!IT41)","v":""},{"$f":"IF('[1]Tasa de Falla'!IU41=0,\"\",'[1]Tasa de Falla'!IU41)","v":""},{"$f":"IF('[1]Tasa de Falla'!IV41=0,\"\",'[1]Tasa de Falla'!IV41)","v":"XXXX"},{"$f":"IF('[1]Tasa de Falla'!IW41=0,\"\",'[1]Tasa de Falla'!IW41)","v":"XXXX"},{"$f":"IF('[1]Tasa de Falla'!IX41=0,\"\",'[1]Tasa de Falla'!IX41)","v":"XXXX"},{"$f":"IF('[1]Tasa de Falla'!IY41=0,\"\",'[1]Tasa de Falla'!IY41)","v":"XXXX"},{"$f":"IF('[1]Tasa de Falla'!IZ41=0,\"\",'[1]Tasa de Falla'!IZ41)","v":"XXXX"}]
[null,null,{"$f":"'[1]Tasa de Falla'!C42","v":26},{"$f":"'[1]Tasa de Falla'!D42","v":"C.H. RIO HONDO - LA BANDA"},{"$f":"'[1]Tasa de Falla'!E42","v":132},{"$f":"'[1]Tasa de Falla'!F42","v":76.5},{"$f":"IF('[1]Tasa de Falla'!IO42=0,\"\",'[1]Tasa de Falla'!IO42)","v":1},{"$f":"IF('[1]Tasa de Falla'!IP42=0,\"\",'[1]Tasa de Falla'!IP42)","v":1},{"$f":"IF('[1]Tasa de Falla'!IQ42=0,\"\",'[1]Tasa de Falla'!IQ42)","v":""},{"$f":"IF('[1]Tasa de Falla'!IR42=0,\"\",'[1]Tasa de Falla'!IR42)","v":""},{"$f":"IF('[1]Tasa de Falla'!IS42=0,\"\",'[1]Tasa de Falla'!IS42)","v":""},{"$f":"IF('[1]Tasa de Falla'!IT42=0,\"\",'[1]Tasa de Falla'!IT42)","v":2},{"$f":"IF('[1]Tasa de Falla'!IU42=0,\"\",'[1]Tasa de Falla'!IU42)","v":""},{"$f":"IF('[1]Tasa de Falla'!IV42=0,\"\",'[1]Tasa de Falla'!IV42)","v":1},{"$f":"IF('[1]Tasa de Falla'!IW42=0,\"\",'[1]Tasa de Falla'!IW42)","v":""},{"$f":"IF('[1]Tasa de Falla'!IX42=0,\"\",'[1]Tasa de Falla'!IX42)","v":""},{"$f":"IF('[1]Tasa de Falla'!IY42=0,\"\",'[1]Tasa de Falla'!IY42)","v":""},{"$f":"IF('[1]Tasa de Falla'!IZ42=0,\"\",'[1]Tasa de Falla'!IZ42)","v":""}]
[null,null,{"$f":"'[1]Tasa de Falla'!C43","v":27},{"$f":"'[1]Tasa de Falla'!D43","v":"LA RIOJA - RECREO  2"},{"$f":"'[1]Tasa de Falla'!E43","v":132},{"$f":"'[1]Tasa de Falla'!F43","v":220},{"$f":"IF('[1]Tasa de Falla'!IO43=0,\"\",'[1]Tasa de Falla'!IO43)","v":"XXXX"},{"$f":"IF('[1]Tasa de Falla'!IP43=0,\"\",'[1]Tasa de Falla'!IP43)","v":"XXXX"},{"$f":"IF('[1]Tasa de Falla'!IQ43=0,\"\",'[1]Tasa de Falla'!IQ43)","v":"XXXX"},{"$f":"IF('[1]Tasa de Falla'!IR43=0,\"\",'[1]Tasa de Falla'!IR43)","v":"XXXX"},{"$f":"IF('[1]Tasa de Falla'!IS43=0,\"\",'[1]Tasa de Falla'!IS43)","v":"XXXX"},{"$f":"IF('[1]Tasa de Falla'!IT43=0,\"\",'[1]Tasa de Falla'!IT43)","v":"XXXX"},{"$f":"IF('[1]Tasa de Falla'!IU43=0,\"\",'[1]Tasa de Falla'!IU43)","v":"XXXX"},{"$f":"IF('[1]Tasa de Falla'!IV43=0,\"\",'[1]Tasa de Falla'!IV43)","v":"XXXX"},{"$f":"IF('[1]Tasa de Falla'!IW43=0,\"\",'[1]Tasa de Falla'!IW43)","v":"XXXX"},{"$f":"IF('[1]Tasa de Falla'!IX43=0,\"\",'[1]Tasa de Falla'!IX43)","v":"XXXX"},{"$f":"IF('[1]Tasa de Falla'!IY43=0,\"\",'[1]Tasa de Falla'!IY43)","v":"XXXX"},{"$f":"IF('[1]Tasa de Falla'!IZ43=0,\"\",'[1]Tasa de Falla'!IZ43)","v":"XXXX"}]
[null,null,{"$f":"'[1]Tasa de Falla'!C44","v":28},{"$f":"'[1]Tasa de Falla'!D44","v":"CAMPO SANTO - SALTA SUR"},{"$f":"'[1]Tasa de Falla'!E44","v":132},{"$f":"'[1]Tasa de Falla'!F44","v":40.92},{"$f":"IF('[1]Tasa de Falla'!IO44=0,\"\",'[1]Tasa de Falla'!IO44)","v":"XXXX"},{"$f":"IF('[1]Tasa de Falla'!IP44=0,\"\",'[1]Tasa de Falla'!IP44)","v":"XXXX"},{"$f":"IF('[1]Tasa de Falla'!IQ44=0,\"\",'[1]Tasa de Falla'!IQ44)","v":"XXXX"},{"$f":"IF('[1]Tasa de Falla'!IR44=0,\"\",'[1]Tasa de Falla'!IR44)","v":"XXXX"},{"$f":"IF('[1]Tasa de Falla'!IS44=0,\"\",'[1]Tasa de Falla'!IS44)","v":"XXXX"},{"$f":"IF('[1]Tasa de Falla'!IT44=0,\"\",'[1]Tasa de Falla'!IT44)","v":"XXXX"},{"$f":"IF('[1]Tasa de Falla'!IU44=0,\"\",'[1]Tasa de Falla'!IU44)","v":"XXXX"},{"$f":"IF('[1]Tasa de Falla'!IV44=0,\"\",'[1]Tasa de Falla'!IV44)","v":"XXXX"},{"$f":"IF('[1]Tasa de Falla'!IW44=0,\"\",'[1]Tasa de Falla'!IW44)","v":"XXXX"},{"$f":"IF('[1]Tasa de Falla'!IX44=0,\"\",'[1]Tasa de Falla'!IX44)","v":"XXXX"},{"$f":"IF('[1]Tasa de Falla'!IY44=0,\"\",'[1]Tasa de Falla'!IY44)","v":"XXXX"},{"$f":"IF('[1]Tasa de Falla'!IZ44=0,\"\",'[1]Tasa de Falla'!IZ44)","v":"XXXX"}]
[null,null,{"$f":"'[1]Tasa de Falla'!C45","v":29},{"$f":"'[1]Tasa de Falla'!D45","v":"PALPALA - SAN JUANCITO"},{"$f":"'[1]Tasa de Falla'!E45","v":132},{"$f":"'[1]Tasa de Falla'!F45","v":23.9},{"$f":"IF('[1]Tasa de Falla'!IO45=0,\"\",'[1]Tasa de Falla'!IO45)","v":""},{"$f":"IF('[1]Tasa de Falla'!IP45=0,\"\",'[1]Tasa de Falla'!IP45)","v":""},{"$f":"IF('[1]Tasa de Falla'!IQ45=0,\"\",'[1]Tasa de Falla'!IQ45)","v":""},{"$f":"IF('[1]Tasa de Falla'!IR45=0,\"\",'[1]Tasa de Falla'!IR45)","v":""},{"$f":"IF('[1]Tasa de Falla'!IS45=0,\"\",'[1]Tasa de Falla'!IS45)","v":""},{"$f":"IF('[1]Tasa de Falla'!IT45=0,\"\",'[1]Tasa de Falla'!IT45)","v":2},{"$f":"IF('[1]Tasa de Falla'!IU45=0,\"\",'[1]Tasa de Falla'!IU45)","v":""},{"$f":"IF('[1]Tasa de Falla'!IV45=0,\"\",'[1]Tasa de Falla'!IV45)","v":""},{"$f":"IF('[1]Tasa de Falla'!IW45=0,\"\",'[1]Tasa de Falla'!IW45)","v":2},{"$f":"IF('[1]Tasa de Falla'!IX45=0,\"\",'[1]Tasa de Falla'!IX45)","v":2},{"$f":"IF('[1]Tasa de Falla'!IY45=0,\"\",'[1]Tasa de Falla'!IY45)","v":""},{"$f":"IF('[1]Tasa de Falla'!IZ45=0,\"\",'[1]Tasa de Falla'!IZ45)","v":""}]
[null,null,{"$f":"'[1]Tasa de Falla'!C46","v":30},{"$f":"'[1]Tasa de Falla'!D46","v":"SAN JUANCITO - SAN PEDRO JUJUY"},{"$f":"'[1]Tasa de Falla'!E46","v":132},{"$f":"'[1]Tasa de Falla'!F46","v":27},{"$f":"IF('[1]Tasa de Falla'!IO46=0,\"\",'[1]Tasa de Falla'!IO46)","v":""},{"$f":"IF('[1]Tasa de Falla'!IP46=0,\"\",'[1]Tasa de Falla'!IP46)","v":""},{"$f":"IF('[1]Tasa de Falla'!IQ46=0,\"\",'[1]Tasa de Falla'!IQ46)","v":""},{"$f":"IF('[1]Tasa de Falla'!IR46=0,\"\",'[1]Tasa de Falla'!IR46)","v":""},{"$f":"IF('[1]Tasa de Falla'!IS46=0,\"\",'[1]Tasa de Falla'!IS46)","v":""},{"$f":"IF('[1]Tasa de Falla'!IT46=0,\"\",'[1]Tasa de Falla'!IT46)","v":""},{"$f":"IF('[1]Tasa de Falla'!IU46=0,\"\",'[1]Tasa de Falla'!IU46)","v":""},{"$f":"IF('[1]Tasa de Falla'!IV46=0,\"\",'[1]Tasa de Falla'!IV46)","v":""},{"$f":"IF('[1]Tasa de Falla'!IW46=0,\"\",'[1]Tasa de Falla'!IW46)","v":""},{"$f":"IF('[1]Tasa de Falla'!IX46=0,\"\",'[1]Tasa de Falla'!IX46)","v":""},{"$f":"IF('[1]Tasa de Falla'!IY46=0,\"\",'[1]Tasa de Falla'!IY46)","v":""},{"$f":"IF('[1]Tasa de Falla'!IZ46=0,\"\",'[1]Tasa de Falla'!IZ46)","v":""}]
[null,null,{"$f":"'[1]Tasa de Falla'!C47","v":31},{"$f":"'[1]Tasa de Falla'!D47","v":"SAN MARTIN - CATAMARCA"},{"$f":"'[1]Tasa de Falla'!E47","v":132},{"$f":"'[1]Tasa de Falla'!F47","v":88},{"$f":"IF('[1]Tasa de Falla'!IO47=0,\"\",'[1]Tasa de Falla'!IO47)","v":"XXXX"},{"$f":"IF('[1]Tasa de Falla'!IP47=0,\"\",'[1]Tasa de Falla'!IP47)","v":"XXXX"},{"$f":"IF('[1]Tasa de Falla'!IQ47=0,\"\",'[1]Tasa de Falla'!IQ47)","v":"XXXX"},{"$f":"IF('[1]Tasa de Falla'!IR47=0,\"\",'[1]Tasa de Falla'!IR47)","v":"XXXX"},{"$f":"IF('[1]Tasa de Falla'!IS47=0,\"\",'[1]Tasa de Falla'!IS47)","v":"XXXX"},{"$f":"IF('[1]Tasa de Falla'!IT47=0,\"\",'[1]Tasa de Falla'!IT47)","v":"XXXX"},{"$f":"IF('[1]Tasa de Falla'!IU47=0,\"\",'[1]Tasa de Falla'!IU47)","v":"XXXX"},{"$f":"IF('[1]Tasa de Falla'!IV47=0,\"\",'[1]Tasa de Falla'!IV47)","v":"XXXX"},{"$f":"IF('[1]Tasa de Falla'!IW47=0,\"\",'[1]Tasa de Falla'!IW47)","v":"XXXX"},{"$f":"IF('[1]Tasa de Falla'!IX47=0,\"\",'[1]Tasa de Falla'!IX47)","v":"XXXX"},{"$f":"IF('[1]Tasa de Falla'!IY47=0,\"\",'[1]Tasa de Falla'!IY47)","v":"XXXX"},{"$f":"IF('[1]Tasa de Falla'!IZ47=0,\"\",'[1]Tasa de Falla'!IZ47)","v":"XXXX"}]
[null,null,{"$f":"'[1]Tasa de Falla'!C48","v":32},{"$f":"'[1]Tasa de Falla'!D48","v":"SAN MARTIN - RECREO"},{"$f":"'[1]Tasa de Falla'!E48","v":132},{"$f":"'[1]Tasa de Falla'!F48","v":115},{"$f":"IF('[1]Tasa de Falla'!IO48=0,\"\",'[1]Tasa de Falla'!IO48)","v":"XXXX"},{"$f":"IF('[1]Tasa de Falla'!IP48=0,\"\",'[1]Tasa de Falla'!IP48)","v":"XXXX"},{"$f":"IF('[1]Tasa de Falla'!IQ48=0,\"\",'[1]Tasa de Falla'!IQ48)","v":"XXXX"},{"$f":"IF('[1]Tasa de Falla'!IR48=0,\"\",'[1]Tasa de Falla'!IR48)","v":"XXXX"},{"$f":"IF('[1]Tasa de Falla'!IS48=0,\"\",'[1]Tasa de Falla'!IS48)","v":"XXXX"},{"$f":"IF('[1]Tasa de Falla'!IT48=0,\"\",'[1]Tasa de Falla'!IT48)","v":"XXXX"},{"$f":"IF('[1]Tasa de Falla'!IU48=0,\"\",'[1]Tasa de Falla'!IU48)","v":"XXXX"},{"$f":"IF('[1]Tasa de Falla'!IV48=0,\"\",'[1]Tasa de Falla'!IV48)","v":"XXXX"},{"$f":"IF('[1]Tasa de Falla'!IW48=0,\"\",'[1]Tasa de Falla'!IW48)","v":"XXXX"},{"$f":"IF('[1]Tasa de Falla'!IX48=0,\"\",'[1]Tasa de Falla'!IX48)","v":"XXXX"},{"$f":"IF('[1]Tasa de Falla'!IY48=0,\"\",'[1]Tasa de Falla'!IY48)","v":"XXXX"},{"$f":"IF('[1]Tasa de Falla'!IZ48=0,\"\",'[1]Tasa de Falla'!IZ48)","v":"XXXX"}]
[null,null,{"$f":"'[1]Tasa de Falla'!C49","v":33},{"$f":"'[1]Tasa de Falla'!D49","v":"SAN MARTIN C. - LA RIOJA"},{"$f":"'[1]Tasa de Falla'!E49","v":132},{"$f":"'[1]Tasa de Falla'!F49","v":105},{"$f":"IF('[1]Tasa de Falla'!IO49=0,\"\",'[1]Tasa de Falla'!IO49)","v":"XXXX"},{"$f":"IF('[1]Tasa de Falla'!IP49=0,\"\",'[1]Tasa de Falla'!IP49)","v":"XXXX"},{"$f":"IF('[1]Tasa de Falla'!IQ49=0,\"\",'[1]Tasa de Falla'!IQ49)","v":"XXXX"},{"$f":"IF('[1]Tasa de Falla'!IR49=0,\"\",'[1]Tasa de Falla'!IR49)","v":"XXXX"},{"$f":"IF('[1]Tasa de Falla'!IS49=0,\"\",'[1]Tasa de Falla'!IS49)","v":"XXXX"},{"$f":"IF('[1]Tasa de Falla'!IT49=0,\"\",'[1]Tasa de Falla'!IT49)","v":"XXXX"},{"$f":"IF('[1]Tasa de Falla'!IU49=0,\"\",'[1]Tasa de Falla'!IU49)","v":"XXXX"},{"$f":"IF('[1]Tasa de Falla'!IV49=0,\"\",'[1]Tasa de Falla'!IV49)","v":"XXXX"},{"$f":"IF('[1]Tasa de Falla'!IW49=0,\"\",'[1]Tasa de Falla'!IW49)","v":"XXXX"},{"$f":"IF('[1]Tasa de Falla'!IX49=0,\"\",'[1]Tasa de Falla'!IX49)","v":"XXXX"},{"$f":"IF('[1]Tasa de Falla'!IY49=0,\"\",'[1]Tasa de Falla'!IY49)","v":"XXXX"},{"$f":"IF('[1]Tasa de Falla'!IZ49=0,\"\",'[1]Tasa de Falla'!IZ49)","v":"XXXX"}]
[null,null,{"$f":"'[1]Tasa de Falla'!C50","v":34},{"$f":"'[1]Tasa de Falla'!D50","v":"SAN PEDRO JUJUY - LIBERTADOR NOA."},{"$f":"'[1]Tasa de Falla'!E50","v":132},{"$f":"'[1]Tasa de Falla'!F50","v":49},{"$f":"IF('[1]Tasa de Falla'!IO50=0,\"\",'[1]Tasa de Falla'!IO50)","v":""},{"$f":"IF('[1]Tasa de Falla'!IP50=0,\"\",'[1]Tasa de Falla'!IP50)","v":""},{"$f":"IF('[1]Tasa de Falla'!IQ50=0,\"\",'[1]Tasa de Falla'!IQ50)","v":""},{"$f":"IF('[1]Tasa de Falla'!IR50=0,\"\",'[1]Tasa de Falla'!IR50)","v":1},{"$f":"IF('[1]Tasa de Falla'!IS50=0,\"\",'[1]Tasa de Falla'!IS50)","v":""},{"$f":"IF('[1]Tasa de Falla'!IT50=0,\"\",'[1]Tasa de Falla'!IT50)","v":""},{"$f":"IF('[1]Tasa de Falla'!IU50=0,\"\",'[1]Tasa de Falla'!IU50)","v":""},{"$f":"IF('[1]Tasa de Falla'!IV50=0,\"\",'[1]Tasa de Falla'!IV50)","v":""},{"$f":"IF('[1]Tasa de Falla'!IW50=0,\"\",'[1]Tasa de Falla'!IW50)","v":""},{"$f":"IF('[1]Tasa de Falla'!IX50=0,\"\",'[1]Tasa de Falla'!IX50)","v":""},{"$f":"IF('[1]Tasa de Falla'!IY50=0,\"\",'[1]Tasa de Falla'!IY50)","v":""},{"$f":"IF('[1]Tasa de Falla'!IZ50=0,\"\",'[1]Tasa de Falla'!IZ50)","v":""}]
[null,null,{"$f":"'[1]Tasa de Falla'!C51","v":35},{"$f":"'[1]Tasa de Falla'!D51","v":"TUCUMAN NORTE - EL BRACHO"},{"$f":"'[1]Tasa de Falla'!E51","v":132},{"$f":"'[1]Tasa de Falla'!F51","v":31.5},{"$f":"IF('[1]Tasa de Falla'!IO51=0,\"\",'[1]Tasa de Falla'!IO51)","v":""},{"$f":"IF('[1]Tasa de Falla'!IP51=0,\"\",'[1]Tasa de Falla'!IP51)","v":""},{"$f":"IF('[1]Tasa de Falla'!IQ51=0,\"\",'[1]Tasa de Falla'!IQ51)","v":""},{"$f":"IF('[1]Tasa de Falla'!IR51=0,\"\",'[1]Tasa de Falla'!IR51)","v":1},{"$f":"IF('[1]Tasa de Falla'!IS51=0,\"\",'[1]Tasa de Falla'!IS51)","v":""},{"$f":"IF('[1]Tasa de Falla'!IT51=0,\"\",'[1]Tasa de Falla'!IT51)","v":""},{"$f":"IF('[1]Tasa de Falla'!IU51=0,\"\",'[1]Tasa de Falla'!IU51)","v":""},{"$f":"IF('[1]Tasa de Falla'!IV51=0,\"\",'[1]Tasa de Falla'!IV51)","v":""},{"$f":"IF('[1]Tasa de Falla'!IW51=0,\"\",'[1]Tasa de Falla'!IW51)","v":""},{"$f":"IF('[1]Tasa de Falla'!IX51=0,\"\",'[1]Tasa de Falla'!IX51)","v":""},{"$f":"IF('[1]Tasa de Falla'!IY51=0,\"\",'[1]Tasa de Falla'!IY51)","v":""},{"$f":"IF('[1]Tasa de Falla'!IZ51=0,\"\",'[1]Tasa de Falla'!IZ51)","v":""}]
[null,null,{"$f":"'[1]Tasa de Falla'!C52","v":36},{"$f":"'[1]Tasa de Falla'!D52","v":"C.H. EL CADILLAL - TUCUMAN NORTE"},{"$f":"'[1]Tasa de Falla'!E52","v":132},{"$f":"'[1]Tasa de Falla'!F52","v":21.8},{"$f":"IF('[1]Tasa de Falla'!IO52=0,\"\",'[1]Tasa de Falla'!IO52)","v":""},{"$f":"IF('[1]Tasa de Falla'!IP52=0,\"\",'[1]Tasa de Falla'!IP52)","v":""},{"$f":"IF('[1]Tasa de Falla'!IQ52=0,\"\",'[1]Tasa de Falla'!IQ52)","v":""},{"$f":"IF('[1]Tasa de Falla'!IR52=0,\"\",'[1]Tasa de Falla'!IR52)","v":""},{"$f":"IF('[1]Tasa de Falla'!IS52=0,\"\",'[1]Tasa de Falla'!IS52)","v":""},{"$f":"IF('[1]Tasa de Falla'!IT52=0,\"\",'[1]Tasa de Falla'!IT52)","v":1},{"$f":"IF('[1]Tasa de Falla'!IU52=0,\"\",'[1]Tasa de Falla'!IU52)","v":2},{"$f":"IF('[1]Tasa de Falla'!IV52=0,\"\",'[1]Tasa de Falla'!IV52)","v":""},{"$f":"IF('[1]Tasa de Falla'!IW52=0,\"\",'[1]Tasa de Falla'!IW52)","v":1},{"$f":"IF('[1]Tasa de Falla'!IX52=0,\"\",'[1]Tasa de Falla'!IX52)","v":""},{"$f":"IF('[1]Tasa de Falla'!IY52=0,\"\",'[1]Tasa de Falla'!IY52)","v":""},{"$f":"IF('[1]Tasa de Falla'!IZ52=0,\"\",'[1]Tasa de Falla'!IZ52)","v":""}]
[null,null,{"$f":"'[1]Tasa de Falla'!C53","v":37},{"$f":"'[1]Tasa de Falla'!D53","v":"TUCUMAN NORTE - CABRA CORRAL"},{"$f":"'[1]Tasa de Falla'!E53","v":132},{"$f":"'[1]Tasa de Falla'!F53","v":190},{"$f":"IF('[1]Tasa de Falla'!IO53=0,\"\",'[1]Tasa de Falla'!IO53)","v":"XXXX"},{"$f":"IF('[1]Tasa de Falla'!IP53=0,\"\",'[1]Tasa de Falla'!IP53)","v":"XXXX"},{"$f":"IF('[1]Tasa de Falla'!IQ53=0,\"\",'[1]Tasa de Falla'!IQ53)","v":"XXXX"},{"$f":"IF('[1]Tasa de Falla'!IR53=0,\"\",'[1]Tasa de Falla'!IR53)","v":"XXXX"},{"$f":"IF('[1]Tasa de Falla'!IS53=0,\"\",'[1]Tasa de Falla'!IS53)","v":"XXXX"},{"$f":"IF('[1]Tasa de Falla'!IT53=0,\"\",'[1]Tasa de Falla'!IT53)","v":"XXXX"},{"$f":"IF('[1]Tasa de Falla'!IU53=0,\"\",'[1]Tasa de Falla'!IU53)","v":"XXXX"},{"$f":"IF('[1]Tasa de Falla'!IV53=0,\"\",'[1]Tasa de Falla'!IV53)","v":"XXXX"},{"$f":"IF('[1]Tasa de Falla'!IW53=0,\"\",'[1]Tasa de Falla'!IW53)","v":"XXXX"},{"$f":"IF('[1]Tasa de Falla'!IX53=0,\"\",'[1]Tasa de Falla'!IX53)","v":"XXXX"},{"$f":"IF('[1]Tasa de Falla'!IY53=0,\"\",'[1]Tasa de Falla'!IY53)","v":"XXXX"},{"$f":"IF('[1]Tasa de Falla'!IZ53=0,\"\",'[1]Tasa de Falla'!IZ53)","v":"XXXX"}]
[null,null,{"$f":"'[1]Tasa de Falla'!C54","v":38},{"$f":"'[1]Tasa de Falla'!D54","v":"METAN - TUCUMAN NORTE"},{"$f":"'[1]Tasa de Falla'!E54","v":132},{"$f":"'[1]Tasa de Falla'!F54","v":155.6},{"$f":"IF('[1]Tasa de Falla'!IO54=0,\"\",'[1]Tasa de Falla'!IO54)","v":""},{"$f":"IF('[1]Tasa de Falla'!IP54=0,\"\",'[1]Tasa de Falla'!IP54)","v":""},{"$f":"IF('[1]Tasa de Falla'!IQ54=0,\"\",'[1]Tasa de Falla'!IQ54)","v":""},{"$f":"IF('[1]Tasa de Falla'!IR54=0,\"\",'[1]Tasa de Falla'!IR54)","v":1},{"$f":"IF('[1]Tasa de Falla'!IS54=0,\"\",'[1]Tasa de Falla'!IS54)","v":1},{"$f":"IF('[1]Tasa de Falla'!IT54=0,\"\",'[1]Tasa de Falla'!IT54)","v":1},{"$f":"IF('[1]Tasa de Falla'!IU54=0,\"\",'[1]Tasa de Falla'!IU54)","v":""},{"$f":"IF('[1]Tasa de Falla'!IV54=0,\"\",'[1]Tasa de Falla'!IV54)","v":""},{"$f":"IF('[1]Tasa de Falla'!IW54=0,\"\",'[1]Tasa de Falla'!IW54)","v":""},{"$f":"IF('[1]Tasa de Falla'!IX54=0,\"\",'[1]Tasa de Falla'!IX54)","v":""},{"$f":"IF('[1]Tasa de Falla'!IY54=0,\"\",'[1]Tasa de Falla'!IY54)","v":""},{"$f":"IF('[1]Tasa de Falla'!IZ54=0,\"\",'[1]Tasa de Falla'!IZ54)","v":""}]
[null,null,{"$f":"'[1]Tasa de Falla'!C55","v":39},{"$f":"'[1]Tasa de Falla'!D55","v":"SARMIENTO - TUCUMAN NORTE (O.F.)"},{"$f":"'[1]Tasa de Falla'!E55","v":132},{"$f":"'[1]Tasa de Falla'!F55","v":3.3},{"$f":"IF('[1]Tasa de Falla'!IO55=0,\"\",'[1]Tasa de Falla'!IO55)","v":""},{"$f":"IF('[1]Tasa de Falla'!IP55=0,\"\",'[1]Tasa de Falla'!IP55)","v":""},{"$f":"IF('[1]Tasa de Falla'!IQ55=0,\"\",'[1]Tasa de Falla'!IQ55)","v":""},{"$f":"IF('[1]Tasa de Falla'!IR55=0,\"\",'[1]Tasa de Falla'!IR55)","v":""},{"$f":"IF('[1]Tasa de Falla'!IS55=0,\"\",'[1]Tasa de Falla'!IS55)","v":""},{"$f":"IF('[1]Tasa de Falla'!IT55=0,\"\",'[1]Tasa de Falla'!IT55)","v":""},{"$f":"IF('[1]Tasa de Falla'!IU55=0,\"\",'[1]Tasa de Falla'!IU55)","v":""},{"$f":"IF('[1]Tasa de Falla'!IV55=0,\"\",'[1]Tasa de Falla'!IV55)","v":""},{"$f":"IF('[1]Tasa de Falla'!IW55=0,\"\",'[1]Tasa de Falla'!IW55)","v":""},{"$f":"IF('[1]Tasa de Falla'!IX55=0,\"\",'[1]Tasa de Falla'!IX55)","v":""},{"$f":"IF('[1]Tasa de Falla'!IY55=0,\"\",'[1]Tasa de Falla'!IY55)","v":""},{"$f":"IF('[1]Tasa de Falla'!IZ55=0,\"\",'[1]Tasa de Falla'!IZ55)","v":""}]
[null,null,{"$f":"'[1]Tasa de Falla'!C56","v":40},{"$f":"'[1]Tasa de Falla'!D56","v":"TUCUMAN OESTE - TUCUMAN NORTE"},{"$f":"'[1]Tasa de Falla'!E56","v":132},{"$f":"'[1]Tasa de Falla'!F56","v":7},{"$f":"IF('[1]Tasa de Falla'!IO56=0,\"\",'[1]Tasa de Falla'!IO56)","v":1},{"$f":"IF('[1]Tasa de Falla'!IP56=0,\"\",'[1]Tasa de Falla'!IP56)","v":""},{"$f":"IF('[1]Tasa de Falla'!IQ56=0,\"\",'[1]Tasa de Falla'!IQ56)","v":""},{"$f":"IF('[1]Tasa de Falla'!IR56=0,\"\",'[1]Tasa de Falla'!IR56)","v":1},{"$f":"IF('[1]Tasa de Falla'!IS56=0,\"\",'[1]Tasa de Falla'!IS56)","v":""},{"$f":"IF('[1]Tasa de Falla'!IT56=0,\"\",'[1]Tasa de Falla'!IT56)","v":""},{"$f":"IF('[1]Tasa de Falla'!IU56=0,\"\",'[1]Tasa de Falla'!IU56)","v":""},{"$f":"IF('[1]Tasa de Falla'!IV56=0,\"\",'[1]Tasa de Falla'!IV56)","v":""},{"$f":"IF('[1]Tasa de Falla'!IW56=0,\"\",'[1]Tasa de Falla'!IW56)","v":""},{"$f":"IF('[1]Tasa de Falla'!IX56=0,\"\",'[1]Tasa de Falla'!IX56)","v":""},{"$f":"IF('[1]Tasa de Falla'!IY56=0,\"\",'[1]Tasa de Falla'!IY56)","v":""},{"$f":"IF('[1]Tasa de Falla'!IZ56=0,\"\",'[1]Tasa de Falla'!IZ56)","v":1}]
[null,null,{"$f":"'[1]Tasa de Falla'!C57","v":41},{"$f":"'[1]Tasa de Falla'!D57","v":"AGUILARES - VILLA QUINTEROS"},{"$f":"'[1]Tasa de Falla'!E57","v":132},{"$f":"'[1]Tasa de Falla'!F57","v":21},{"$f":"IF('[1]Tasa de Falla'!IO57=0,\"\",'[1]Tasa de Falla'!IO57)","v":""},{"$f":"IF('[1]Tasa de Falla'!IP57=0,\"\",'[1]Tasa de Falla'!IP57)","v":""},{"$f":"IF('[1]Tasa de Falla'!IQ57=0,\"\",'[1]Tasa de Falla'!IQ57)","v":""},{"$f":"IF('[1]Tasa de Falla'!IR57=0,\"\",'[1]Tasa de Falla'!IR57)","v":""},{"$f":"IF('[1]Tasa de Falla'!IS57=0,\"\",'[1]Tasa de Falla'!IS57)","v":""},{"$f":"IF('[1]Tasa de Falla'!IT57=0,\"\",'[1]Tasa de Falla'!IT57)","v":""},{"$f":"IF('[1]Tasa de Falla'!IU57=0,\"\",'[1]Tasa de Falla'!IU57)","v":""},{"$f":"IF('[1]Tasa de Falla'!IV57=0,\"\",'[1]Tasa de Falla'!IV57)","v":""},{"$f":"IF('[1]Tasa de Falla'!IW57=0,\"\",'[1]Tasa de Falla'!IW57)","v":1},{"$f":"IF('[1]Tasa de Falla'!IX57=0,\"\",'[1]Tasa de Falla'!IX57)","v":""},{"$f":"IF('[1]Tasa de Falla'!IY57=0,\"\",'[1]Tasa de Falla'!IY57)","v":""},{"$f":"IF('[1]Tasa de Falla'!IZ57=0,\"\",'[1]Tasa de Falla'!IZ57)","v":""}]
[null,null,{"$f":"'[1]Tasa de Falla'!C58","v":42},{"$f":"'[1]Tasa de Falla'!D58","v":"C.H. PUEBLO VIEJO - VILLA QUINTEROS "},{"$f":"'[1]Tasa de Falla'!E58","v":132},{"$f":"'[1]Tasa de Falla'!F58","v":24.5},{"$f":"IF('[1]Tasa de Falla'!IO58=0,\"\",'[1]Tasa de Falla'!IO58)","v":""},{"$f":"IF('[1]Tasa de Falla'!IP58=0,\"\",'[1]Tasa de Falla'!IP58)","v":""},{"$f":"IF('[1]Tasa de Falla'!IQ58=0,\"\",'[1]Tasa de Falla'!IQ58)","v":""},{"$f":"IF('[1]Tasa de Falla'!IR58=0,\"\",'[1]Tasa de Falla'!IR58)","v":3},{"$f":"IF('[1]Tasa de Falla'!IS58=0,\"\",'[1]Tasa de Falla'!IS58)","v":""},{"$f":"IF('[1]Tasa de Falla'!IT58=0,\"\",'[1]Tasa de Falla'!IT58)","v":""},{"$f":"IF('[1]Tasa de Falla'!IU58=0,\"\",'[1]Tasa de Falla'!IU58)","v":""},{"$f":"IF('[1]Tasa de Falla'!IV58=0,\"\",'[1]Tasa de Falla'!IV58)","v":1},{"$f":"IF('[1]Tasa de Falla'!IW58=0,\"\",'[1]Tasa de Falla'!IW58)","v":""},{"$f":"IF('[1]Tasa de Falla'!IX58=0,\"\",'[1]Tasa de Falla'!IX58)","v":""},{"$f":"IF('[1]Tasa de Falla'!IY58=0,\"\",'[1]Tasa de Falla'!IY58)","v":""},{"$f":"IF('[1]Tasa de Falla'!IZ58=0,\"\",'[1]Tasa de Falla'!IZ58)","v":""}]
[null,null,{"$f":"'[1]Tasa de Falla'!C59","v":43},{"$f":"'[1]Tasa de Falla'!D59","v":"C.H. RIO HONDO - VILLA QUINTEROS"},{"$f":"'[1]Tasa de Falla'!E59","v":132},{"$f":"'[1]Tasa de Falla'!F59","v":75.400000000000006},{"$f":"IF('[1]Tasa de Falla'!IO59=0,\"\",'[1]Tasa de Falla'!IO59)","v":""},{"$f":"IF('[1]Tasa de Falla'!IP59=0,\"\",'[1]Tasa de Falla'!IP59)","v":""},{"$f":"IF('[1]Tasa de Falla'!IQ59=0,\"\",'[1]Tasa de Falla'!IQ59)","v":""},{"$f":"IF('[1]Tasa de Falla'!IR59=0,\"\",'[1]Tasa de Falla'!IR59)","v":""},{"$f":"IF('[1]Tasa de Falla'!IS59=0,\"\",'[1]Tasa de Falla'!IS59)","v":""},{"$f":"IF('[1]Tasa de Falla'!IT59=0,\"\",'[1]Tasa de Falla'!IT59)","v":""},{"$f":"IF('[1]Tasa de Falla'!IU59=0,\"\",'[1]Tasa de Falla'!IU59)","v":""},{"$f":"IF('[1]Tasa de Falla'!IV59=0,\"\",'[1]Tasa de Falla'!IV59)","v":""},{"$f":"IF('[1]Tasa de Falla'!IW59=0,\"\",'[1]Tasa de Falla'!IW59)","v":""},{"$f":"IF('[1]Tasa de Falla'!IX59=0,\"\",'[1]Tasa de Falla'!IX59)","v":""},{"$f":"IF('[1]Tasa de Falla'!IY59=0,\"\",'[1]Tasa de Falla'!IY59)","v":""},{"$f":"IF('[1]Tasa de Falla'!IZ59=0,\"\",'[1]Tasa de Falla'!IZ59)","v":""}]
[null,null,{"$f":"'[1]Tasa de Falla'!C60","v":44},{"$f":"'[1]Tasa de Falla'!D60","v":"C.H. RIO HONDO - SANTIAGO CENTRO"},{"$f":"'[1]Tasa de Falla'!E60","v":132},{"$f":"'[1]Tasa de Falla'!F60","v":79},{"$f":"IF('[1]Tasa de Falla'!IO60=0,\"\",'[1]Tasa de Falla'!IO60)","v":"XXXX"},{"$f":"IF('[1]Tasa de Falla'!IP60=0,\"\",'[1]Tasa de Falla'!IP60)","v":"XXXX"},{"$f":"IF('[1]Tasa de Falla'!IQ60=0,\"\",'[1]Tasa de Falla'!IQ60)","v":"XXXX"},{"$f":"IF('[1]Tasa de Falla'!IR60=0,\"\",'[1]Tasa de Falla'!IR60)","v":"XXXX"},{"$f":"IF('[1]Tasa de Falla'!IS60=0,\"\",'[1]Tasa de Falla'!IS60)","v":"XXXX"},{"$f":"IF('[1]Tasa de Falla'!IT60=0,\"\",'[1]Tasa de Falla'!IT60)","v":"XXXX"},{"$f":"IF('[1]Tasa de Falla'!IU60=0,\"\",'[1]Tasa de Falla'!IU60)","v":"XXXX"},{"$f":"IF('[1]Tasa de Falla'!IV60=0,\"\",'[1]Tasa de Falla'!IV60)","v":"XXXX"},{"$f":"IF('[1]Tasa de Falla'!IW60=0,\"\",'[1]Tasa de Falla'!IW60)","v":"XXXX"},{"$f":"IF('[1]Tasa de Falla'!IX60=0,\"\",'[1]Tasa de Falla'!IX60)","v":"XXXX"},{"$f":"IF('[1]Tasa de Falla'!IY60=0,\"\",'[1]Tasa de Falla'!IY60)","v":"XXXX"},{"$f":"IF('[1]Tasa de Falla'!IZ60=0,\"\",'[1]Tasa de Falla'!IZ60)","v":"XXXX"}]
[null,null,{"$f":"'[1]Tasa de Falla'!C61","v":45},{"$f":"'[1]Tasa de Falla'!D61","v":"C.H. RIO HONDO - EL BRACHO"},{"$f":"'[1]Tasa de Falla'!E61","v":132},{"$f":"'[1]Tasa de Falla'!F61","v":80.66},{"$f":"IF('[1]Tasa de Falla'!IO61=0,\"\",'[1]Tasa de Falla'!IO61)","v":""},{"$f":"IF('[1]Tasa de Falla'!IP61=0,\"\",'[1]Tasa de Falla'!IP61)","v":""},{"$f":"IF('[1]Tasa de Falla'!IQ61=0,\"\",'[1]Tasa de Falla'!IQ61)","v":""},{"$f":"IF('[1]Tasa de Falla'!IR61=0,\"\",'[1]Tasa de Falla'!IR61)","v":""},{"$f":"IF('[1]Tasa de Falla'!IS61=0,\"\",'[1]Tasa de Falla'!IS61)","v":"XXXX"},{"$f":"IF('[1]Tasa de Falla'!IT61=0,\"\",'[1]Tasa de Falla'!IT61)","v":"XXXX"},{"$f":"IF('[1]Tasa de Falla'!IU61=0,\"\",'[1]Tasa de Falla'!IU61)","v":"XXXX"},{"$f":"IF('[1]Tasa de Falla'!IV61=0,\"\",'[1]Tasa de Falla'!IV61)","v":"XXXX"},{"$f":"IF('[1]Tasa de Falla'!IW61=0,\"\",'[1]Tasa de Falla'!IW61)","v":"XXXX"},{"$f":"IF('[1]Tasa de Falla'!IX61=0,\"\",'[1]Tasa de Falla'!IX61)","v":"XXXX"},{"$f":"IF('[1]Tasa de Falla'!IY61=0,\"\",'[1]Tasa de Falla'!IY61)","v":"XXXX"},{"$f":"IF('[1]Tasa de Falla'!IZ61=0,\"\",'[1]Tasa de Falla'!IZ61)","v":"XXXX"}]
[null,null,{"$f":"'[1]Tasa de Falla'!C62","v":46},{"$f":"'[1]Tasa de Falla'!D62","v":"SALTA SUR - SALTA NORTE"},{"$f":"'[1]Tasa de Falla'!E62","v":132},{"$f":"'[1]Tasa de Falla'!F62","v":10},{"$f":"IF('[1]Tasa de Falla'!IO62=0,\"\",'[1]Tasa de Falla'!IO62)","v":""},{"$f":"IF('[1]Tasa de Falla'!IP62=0,\"\",'[1]Tasa de Falla'!IP62)","v":""},{"$f":"IF('[1]Tasa de Falla'!IQ62=0,\"\",'[1]Tasa de Falla'!IQ62)","v":""},{"$f":"IF('[1]Tasa de Falla'!IR62=0,\"\",'[1]Tasa de Falla'!IR62)","v":""},{"$f":"IF('[1]Tasa de Falla'!IS62=0,\"\",'[1]Tasa de Falla'!IS62)","v":""},{"$f":"IF('[1]Tasa de Falla'!IT62=0,\"\",'[1]Tasa de Falla'!IT62)","v":""},{"$f":"IF('[1]Tasa de Falla'!IU62=0,\"\",'[1]Tasa de Falla'!IU62)","v":""},{"$f":"IF('[1]Tasa de Falla'!IV62=0,\"\",'[1]Tasa de Falla'!IV62)","v":""},{"$f":"IF('[1]Tasa de Falla'!IW62=0,\"\",'[1]Tasa de Falla'!IW62)","v":""},{"$f":"IF('[1]Tasa de Falla'!IX62=0,\"\",'[1]Tasa de Falla'!IX62)","v":""},{"$f":"IF('[1]Tasa de Falla'!IY62=0,\"\",'[1]Tasa de Falla'!IY62)","v":""},{"$f":"IF('[1]Tasa de Falla'!IZ62=0,\"\",'[1]Tasa de Falla'!IZ62)","v":""}]
[null,null,{"$f":"'[1]Tasa de Falla'!C63","v":47},{"$f":"'[1]Tasa de Falla'!D63","v":"PALPALA - JUJUY ESTE"},{"$f":"'[1]Tasa de Falla'!E63","v":132},{"$f":"'[1]Tasa de Falla'!F63","v":12.3},{"$f":"IF('[1]Tasa de Falla'!IO63=0,\"\",'[1]Tasa de Falla'!IO63)","v":""},{"$f":"IF('[1]Tasa de Falla'!IP63=0,\"\",'[1]Tasa de Falla'!IP63)","v":""},{"$f":"IF('[1]Tasa de Falla'!IQ63=0,\"\",'[1]Tasa de Falla'!IQ63)","v":""},{"$f":"IF('[1]Tasa de Falla'!IR63=0,\"\",'[1]Tasa de Falla'!IR63)","v":""},{"$f":"IF('[1]Tasa de Falla'!IS63=0,\"\",'[1]Tasa de Falla'!IS63)","v":""},{"$f":"IF('[1]Tasa de Falla'!IT63=0,\"\",'[1]Tasa de Falla'!IT63)","v":1},{"$f":"IF('[1]Tasa de Falla'!IU63=0,\"\",'[1]Tasa de Falla'!IU63)","v":""},{"$f":"IF('[1]Tasa de Falla'!IV63=0,\"\",'[1]Tasa de Falla'!IV63)","v":""},{"$f":"IF('[1]Tasa de Falla'!IW63=0,\"\",'[1]Tasa de Falla'!IW63)","v":1},{"$f":"IF('[1]Tasa de Falla'!IX63=0,\"\",'[1]Tasa de Falla'!IX63)","v":""},{"$f":"IF('[1]Tasa de Falla'!IY63=0,\"\",'[1]Tasa de Falla'!IY63)","v":""},{"$f":"IF('[1]Tasa de Falla'!IZ63=0,\"\",'[1]Tasa de Falla'!IZ63)","v":""}]
[null,null,{"$f":"'[1]Tasa de Falla'!C64","v":48},{"$f":"'[1]Tasa de Falla'!D64","v":"JUJUY ESTE - JUJUY SUR"},{"$f":"'[1]Tasa de Falla'!E64","v":132},{"$f":"'[1]Tasa de Falla'!F64","v":4.3},{"$f":"IF('[1]Tasa de Falla'!IO64=0,\"\",'[1]Tasa de Falla'!IO64)","v":""},{"$f":"IF('[1]Tasa de Falla'!IP64=0,\"\",'[1]Tasa de Falla'!IP64)","v":""},{"$f":"IF('[1]Tasa de Falla'!IQ64=0,\"\",'[1]Tasa de Falla'!IQ64)","v":""},{"$f":"IF('[1]Tasa de Falla'!IR64=0,\"\",'[1]Tasa de Falla'!IR64)","v":""},{"$f":"IF('[1]Tasa de Falla'!IS64=0,\"\",'[1]Tasa de Falla'!IS64)","v":""},{"$f":"IF('[1]Tasa de Falla'!IT64=0,\"\",'[1]Tasa de Falla'!IT64)","v":""},{"$f":"IF('[1]Tasa de Falla'!IU64=0,\"\",'[1]Tasa de Falla'!IU64)","v":""},{"$f":"IF('[1]Tasa de Falla'!IV64=0,\"\",'[1]Tasa de Falla'!IV64)","v":""},{"$f":"IF('[1]Tasa de Falla'!IW64=0,\"\",'[1]Tasa de Falla'!IW64)","v":""},{"$f":"IF('[1]Tasa de Falla'!IX64=0,\"\",'[1]Tasa de Falla'!IX64)","v":""},{"$f":"IF('[1]Tasa de Falla'!IY64=0,\"\",'[1]Tasa de Falla'!IY64)","v":""},{"$f":"IF('[1]Tasa de Falla'!IZ64=0,\"\",'[1]Tasa de Falla'!IZ64)","v":""}]
[null,null,{"$f":"'[1]Tasa de Falla'!C65","v":49},{"$f":"'[1]Tasa de Falla'!D65","v":"CEVIL POZO - GUEMES"},{"$f":"'[1]Tasa de Falla'!E65","v":132},{"$f":"'[1]Tasa de Falla'!F65","v":291},{"$f":"IF('[1]Tasa de Falla'!IO65=0,\"\",'[1]Tasa de Falla'!IO65)","v":"XXXX"},{"$f":"IF('[1]Tasa de Falla'!IP65=0,\"\",'[1]Tasa de Falla'!IP65)","v":"XXXX"},{"$f":"IF('[1]Tasa de Falla'!IQ65=0,\"\",'[1]Tasa de Falla'!IQ65)","v":"XXXX"},{"$f":"IF('[1]Tasa de Falla'!IR65=0,\"\",'[1]Tasa de Falla'!IR65)","v":"XXXX"},{"$f":"IF('[1]Tasa de Falla'!IS65=0,\"\",'[1]Tasa de Falla'!IS65)","v":"XXXX"},{"$f":"IF('[1]Tasa de Falla'!IT65=0,\"\",'[1]Tasa de Falla'!IT65)","v":"XXXX"},{"$f":"IF('[1]Tasa de Falla'!IU65=0,\"\",'[1]Tasa de Falla'!IU65)","v":"XXXX"},{"$f":"IF('[1]Tasa de Falla'!IV65=0,\"\",'[1]Tasa de Falla'!IV65)","v":"XXXX"},{"$f":"IF('[1]Tasa de Falla'!IW65=0,\"\",'[1]Tasa de Falla'!IW65)","v":"XXXX"},{"$f":"IF('[1]Tasa de Falla'!IX65=0,\"\",'[1]Tasa de Falla'!IX65)","v":"XXXX"},{"$f":"IF('[1]Tasa de Falla'!IY65=0,\"\",'[1]Tasa de Falla'!IY65)","v":"XXXX"},{"$f":"IF('[1]Tasa de Falla'!IZ65=0,\"\",'[1]Tasa de Falla'!IZ65)","v":"XXXX"}]
[null,null,{"$f":"'[1]Tasa de Falla'!C66","v":50},{"$f":"'[1]Tasa de Falla'!D66","v":"CEVIL POZO - EL BRACHO"},{"$f":"'[1]Tasa de Falla'!E66","v":132},{"$f":"'[1]Tasa de Falla'!F66","v":17},{"$f":"IF('[1]Tasa de Falla'!IO66=0,\"\",'[1]Tasa de Falla'!IO66)","v":""},{"$f":"IF('[1]Tasa de Falla'!IP66=0,\"\",'[1]Tasa de Falla'!IP66)","v":""},{"$f":"IF('[1]Tasa de Falla'!IQ66=0,\"\",'[1]Tasa de Falla'!IQ66)","v":""},{"$f":"IF('[1]Tasa de Falla'!IR66=0,\"\",'[1]Tasa de Falla'!IR66)","v":""},{"$f":"IF('[1]Tasa de Falla'!IS66=0,\"\",'[1]Tasa de Falla'!IS66)","v":""},{"$f":"IF('[1]Tasa de Falla'!IT66=0,\"\",'[1]Tasa de Falla'!IT66)","v":""},{"$f":"IF('[1]Tasa de Falla'!IU66=0,\"\",'[1]Tasa de Falla'!IU66)","v":""},{"$f":"IF('[1]Tasa de Falla'!IV66=0,\"\",'[1]Tasa de Falla'!IV66)","v":""},{"$f":"IF('[1]Tasa de Falla'!IW66=0,\"\",'[1]Tasa de Falla'!IW66)","v":""},{"$f":"IF('[1]Tasa de Falla'!IX66=0,\"\",'[1]Tasa de Falla'!IX66)","v":""},{"$f":"IF('[1]Tasa de Falla'!IY66=0,\"\",'[1]Tasa de Falla'!IY66)","v":""},{"$f":"IF('[1]Tasa de Falla'!IZ66=0,\"\",'[1]Tasa de Falla'!IZ66)","v":""}]
[null,null,{"$f":"'[1]Tasa de Falla'!C67","v":0},{"$f":"'[1]Tasa de Falla'!D67","v":0},{"$f":"'[1]Tasa de Falla'!E67","v":0},{"$f":"'[1]Tasa de Falla'!F67","v":0},{"$f":"IF('[1]Tasa de Falla'!IO67=0,\"\",'[1]Tasa de Falla'!IO67)","v":""},{"$f":"IF('[1]Tasa de Falla'!IP67=0,\"\",'[1]Tasa de Falla'!IP67)","v":""},{"$f":"IF('[1]Tasa de Falla'!IQ67=0,\"\",'[1]Tasa de Falla'!IQ67)","v":""},{"$f":"IF('[1]Tasa de Falla'!IR67=0,\"\",'[1]Tasa de Falla'!IR67)","v":""},{"$f":"IF('[1]Tasa de Falla'!IS67=0,\"\",'[1]Tasa de Falla'!IS67)","v":""},{"$f":"IF('[1]Tasa de Falla'!IT67=0,\"\",'[1]Tasa de Falla'!IT67)","v":""},{"$f":"IF('[1]Tasa de Falla'!IU67=0,\"\",'[1]Tasa de Falla'!IU67)","v":""},{"$f":"IF('[1]Tasa de Falla'!IV67=0,\"\",'[1]Tasa de Falla'!IV67)","v":""},{"$f":"IF('[1]Tasa de Falla'!IW67=0,\"\",'[1]Tasa de Falla'!IW67)","v":""},{"$f":"IF('[1]Tasa de Falla'!IX67=0,\"\",'[1]Tasa de Falla'!IX67)","v":""},{"$f":"IF('[1]Tasa de Falla'!IY67=0,\"\",'[1]Tasa de Falla'!IY67)","v":""},{"$f":"IF('[1]Tasa de Falla'!IZ67=0,\"\",'[1]Tasa de Falla'!IZ67)","v":""}]
[null,null,{"$f":"'[1]Tasa de Falla'!C68","v":51},{"$f":"'[1]Tasa de Falla'!D68","v":"METAN - EL TUNAL"},{"$f":"'[1]Tasa de Falla'!E68","v":132},{"$f":"'[1]Tasa de Falla'!F68","v":75.599999999999994},{"$f":"IF('[1]Tasa de Falla'!IO68=0,\"\",'[1]Tasa de Falla'!IO68)","v":""},{"$f":"IF('[1]Tasa de Falla'!IP68=0,\"\",'[1]Tasa de Falla'!IP68)","v":""},{"$f":"IF('[1]Tasa de Falla'!IQ68=0,\"\",'[1]Tasa de Falla'!IQ68)","v":""},{"$f":"IF('[1]Tasa de Falla'!IR68=0,\"\",'[1]Tasa de Falla'!IR68)","v":""},{"$f":"IF('[1]Tasa de Falla'!IS68=0,\"\",'[1]Tasa de Falla'!IS68)","v":""},{"$f":"IF('[1]Tasa de Falla'!IT68=0,\"\",'[1]Tasa de Falla'!IT68)","v":""},{"$f":"IF('[1]Tasa de Falla'!IU68=0,\"\",'[1]Tasa de Falla'!IU68)","v":""},{"$f":"IF('[1]Tasa de Falla'!IV68=0,\"\",'[1]Tasa de Falla'!IV68)","v":""},{"$f":"IF('[1]Tasa de Falla'!IW68=0,\"\",'[1]Tasa de Falla'!IW68)","v":""},{"$f":"IF('[1]Tasa de Falla'!IX68=0,\"\",'[1]Tasa de Falla'!IX68)","v":""},{"$f":"IF('[1]Tasa de Falla'!IY68=0,\"\",'[1]Tasa de Falla'!IY68)","v":""},{"$f":"IF('[1]Tasa de Falla'!IZ68=0,\"\",'[1]Tasa de Falla'!IZ68)","v":""}]
[null,null,{"$f":"'[1]Tasa de Falla'!C69","v":52},{"$f":"'[1]Tasa de Falla'!D69","v":"EL TUNAL - J.V. GONZALEZ"},{"$f":"'[1]Tasa de Falla'!E69","v":132},{"$f":"'[1]Tasa de Falla'!F69","v":41.4},{"$f":"IF('[1]Tasa de Falla'!IO69=0,\"\",'[1]Tasa de Falla'!IO69)","v":""},{"$f":"IF('[1]Tasa de Falla'!IP69=0,\"\",'[1]Tasa de Falla'!IP69)","v":""},{"$f":"IF('[1]Tasa de Falla'!IQ69=0,\"\",'[1]Tasa de Falla'!IQ69)","v":""},{"$f":"IF('[1]Tasa de Falla'!IR69=0,\"\",'[1]Tasa de Falla'!IR69)","v":""},{"$f":"IF('[1]Tasa de Falla'!IS69=0,\"\",'[1]Tasa de Falla'!IS69)","v":""},{"$f":"IF('[1]Tasa de Falla'!IT69=0,\"\",'[1]Tasa de Falla'!IT69)","v":""},{"$f":"IF('[1]Tasa de Falla'!IU69=0,\"\",'[1]Tasa de Falla'!IU69)","v":""},{"$f":"IF('[1]Tasa de Falla'!IV69=0,\"\",'[1]Tasa de Falla'!IV69)","v":""},{"$f":"IF('[1]Tasa de Falla'!IW69=0,\"\",'[1]Tasa de Falla'!IW69)","v":""},{"$f":"IF('[1]Tasa de Falla'!IX69=0,\"\",'[1]Tasa de Falla'!IX69)","v":""},{"$f":"IF('[1]Tasa de Falla'!IY69=0,\"\",'[1]Tasa de Falla'!IY69)","v":""},{"$f":"IF('[1]Tasa de Falla'!IZ69=0,\"\",'[1]Tasa de Falla'!IZ69)","v":""}]
[null,null,{"$f":"'[1]Tasa de Falla'!C70","v":0},{"$f":"'[1]Tasa de Falla'!D70","v":0},{"$f":"'[1]Tasa de Falla'!E70","v":0},{"$f":"'[1]Tasa de Falla'!F70","v":0},{"$f":"IF('[1]Tasa de Falla'!IO70=0,\"\",'[1]Tasa de Falla'!IO70)","v":""},{"$f":"IF('[1]Tasa de Falla'!IP70=0,\"\",'[1]Tasa de Falla'!IP70)","v":""},{"$f":"IF('[1]Tasa de Falla'!IQ70=0,\"\",'[1]Tasa de Falla'!IQ70)","v":""},{"$f":"IF('[1]Tasa de Falla'!IR70=0,\"\",'[1]Tasa de Falla'!IR70)","v":""},{"$f":"IF('[1]Tasa de Falla'!IS70=0,\"\",'[1]Tasa de Falla'!IS70)","v":""},{"$f":"IF('[1]Tasa de Falla'!IT70=0,\"\",'[1]Tasa de Falla'!IT70)","v":""},{"$f":"IF('[1]Tasa de Falla'!IU70=0,\"\",'[1]Tasa de Falla'!IU70)","v":""},{"$f":"IF('[1]Tasa de Falla'!IV70=0,\"\",'[1]Tasa de Falla'!IV70)","v":""},{"$f":"IF('[1]Tasa de Falla'!IW70=0,\"\",'[1]Tasa de Falla'!IW70)","v":""},{"$f":"IF('[1]Tasa de Falla'!IX70=0,\"\",'[1]Tasa de Falla'!IX70)","v":""},{"$f":"IF('[1]Tasa de Falla'!IY70=0,\"\",'[1]Tasa de Falla'!IY70)","v":""},{"$f":"IF('[1]Tasa de Falla'!IZ70=0,\"\",'[1]Tasa de Falla'!IZ70)","v":""}]
[null,null,{"$f":"'[1]Tasa de Falla'!C71","v":53},{"$f":"'[1]Tasa de Falla'!D71","v":"LOS PIZARROS - ESCABA"},{"$f":"'[1]Tasa de Falla'!E71","v":132},{"$f":"'[1]Tasa de Falla'!F71","v":21.4},{"$f":"IF('[1]Tasa de Falla'!IO71=0,\"\",'[1]Tasa de Falla'!IO71)","v":""},{"$f":"IF('[1]Tasa de Falla'!IP71=0,\"\",'[1]Tasa de Falla'!IP71)","v":""},{"$f":"IF('[1]Tasa de Falla'!IQ71=0,\"\",'[1]Tasa de Falla'!IQ71)","v":""},{"$f":"IF('[1]Tasa de Falla'!IR71=0,\"\",'[1]Tasa de Falla'!IR71)","v":1},{"$f":"IF('[1]Tasa de Falla'!IS71=0,\"\",'[1]Tasa de Falla'!IS71)","v":""},{"$f":"IF('[1]Tasa de Falla'!IT71=0,\"\",'[1]Tasa de Falla'!IT71)","v":1},{"$f":"IF('[1]Tasa de Falla'!IU71=0,\"\",'[1]Tasa de Falla'!IU71)","v":""},{"$f":"IF('[1]Tasa de Falla'!IV71=0,\"\",'[1]Tasa de Falla'!IV71)","v":1},{"$f":"IF('[1]Tasa de Falla'!IW71=0,\"\",'[1]Tasa de Falla'!IW71)","v":""},{"$f":"IF('[1]Tasa de Falla'!IX71=0,\"\",'[1]Tasa de Falla'!IX71)","v":""},{"$f":"IF('[1]Tasa de Falla'!IY71=0,\"\",'[1]Tasa de Falla'!IY71)","v":""},{"$f":"IF('[1]Tasa de Falla'!IZ71=0,\"\",'[1]Tasa de Falla'!IZ71)","v":""}]
[null,null,{"$f":"'[1]Tasa de Falla'!C72","v":54},{"$f":"'[1]Tasa de Falla'!D72","v":"LOS PIZARROS - LA COCHA"},{"$f":"'[1]Tasa de Falla'!E72","v":132},{"$f":"'[1]Tasa de Falla'!F72","v":6.5},{"$f":"IF('[1]Tasa de Falla'!IO72=0,\"\",'[1]Tasa de Falla'!IO72)","v":""},{"$f":"IF('[1]Tasa de Falla'!IP72=0,\"\",'[1]Tasa de Falla'!IP72)","v":""},{"$f":"IF('[1]Tasa de Falla'!IQ72=0,\"\",'[1]Tasa de Falla'!IQ72)","v":""},{"$f":"IF('[1]Tasa de Falla'!IR72=0,\"\",'[1]Tasa de Falla'!IR72)","v":""},{"$f":"IF('[1]Tasa de Falla'!IS72=0,\"\",'[1]Tasa de Falla'!IS72)","v":""},{"$f":"IF('[1]Tasa de Falla'!IT72=0,\"\",'[1]Tasa de Falla'!IT72)","v":""},{"$f":"IF('[1]Tasa de Falla'!IU72=0,\"\",'[1]Tasa de Falla'!IU72)","v":""},{"$f":"IF('[1]Tasa de Falla'!IV72=0,\"\",'[1]Tasa de Falla'!IV72)","v":""},{"$f":"IF('[1]Tasa de Falla'!IW72=0,\"\",'[1]Tasa de Falla'!IW72)","v":""},{"$f":"IF('[1]Tasa de Falla'!IX72=0,\"\",'[1]Tasa de Falla'!IX72)","v":""},{"$f":"IF('[1]Tasa de Falla'!IY72=0,\"\",'[1]Tasa de Falla'!IY72)","v":""},{"$f":"IF('[1]Tasa de Falla'!IZ72=0,\"\",'[1]Tasa de Falla'!IZ72)","v":""}]
[null,null,{"$f":"'[1]Tasa de Falla'!C73","v":55},{"$f":"'[1]Tasa de Falla'!D73","v":"HUACRA - LOS PIZARROS"},{"$f":"'[1]Tasa de Falla'!E73","v":132},{"$f":"'[1]Tasa de Falla'!F73","v":28.5},{"$f":"IF('[1]Tasa de Falla'!IO73=0,\"\",'[1]Tasa de Falla'!IO73)","v":""},{"$f":"IF('[1]Tasa de Falla'!IP73=0,\"\",'[1]Tasa de Falla'!IP73)","v":""},{"$f":"IF('[1]Tasa de Falla'!IQ73=0,\"\",'[1]Tasa de Falla'!IQ73)","v":""},{"$f":"IF('[1]Tasa de Falla'!IR73=0,\"\",'[1]Tasa de Falla'!IR73)","v":""},{"$f":"IF('[1]Tasa de Falla'!IS73=0,\"\",'[1]Tasa de Falla'!IS73)","v":""},{"$f":"IF('[1]Tasa de Falla'!IT73=0,\"\",'[1]Tasa de Falla'!IT73)","v":1},{"$f":"IF('[1]Tasa de Falla'!IU73=0,\"\",'[1]Tasa de Falla'!IU73)","v":1},{"$f":"IF('[1]Tasa de Falla'!IV73=0,\"\",'[1]Tasa de Falla'!IV73)","v":""},{"$f":"IF('[1]Tasa de Falla'!IW73=0,\"\",'[1]Tasa de Falla'!IW73)","v":""},{"$f":"IF('[1]Tasa de Falla'!IX73=0,\"\",'[1]Tasa de Falla'!IX73)","v":""},{"$f":"IF('[1]Tasa de Falla'!IY73=0,\"\",'[1]Tasa de Falla'!IY73)","v":""},{"$f":"IF('[1]Tasa de Falla'!IZ73=0,\"\",'[1]Tasa de Falla'!IZ73)","v":""}]
[null,null,{"$f":"'[1]Tasa de Falla'!C74","v":56},{"$f":"'[1]Tasa de Falla'!D74","v":"CEVIL POZO - AVELLANEDA"},{"$f":"'[1]Tasa de Falla'!E74","v":132},{"$f":"'[1]Tasa de Falla'!F74","v":8},{"$f":"IF('[1]Tasa de Falla'!IO74=0,\"\",'[1]Tasa de Falla'!IO74)","v":""},{"$f":"IF('[1]Tasa de Falla'!IP74=0,\"\",'[1]Tasa de Falla'!IP74)","v":""},{"$f":"IF('[1]Tasa de Falla'!IQ74=0,\"\",'[1]Tasa de Falla'!IQ74)","v":""},{"$f":"IF('[1]Tasa de Falla'!IR74=0,\"\",'[1]Tasa de Falla'!IR74)","v":""},{"$f":"IF('[1]Tasa de Falla'!IS74=0,\"\",'[1]Tasa de Falla'!IS74)","v":""},{"$f":"IF('[1]Tasa de Falla'!IT74=0,\"\",'[1]Tasa de Falla'!IT74)","v":""},{"$f":"IF('[1]Tasa de Falla'!IU74=0,\"\",'[1]Tasa de Falla'!IU74)","v":""},{"$f":"IF('[1]Tasa de Falla'!IV74=0,\"\",'[1]Tasa de Falla'!IV74)","v":""},{"$f":"IF('[1]Tasa de Falla'!IW74=0,\"\",'[1]Tasa de Falla'!IW74)","v":""},{"$f":"IF('[1]Tasa de Falla'!IX74=0,\"\",'[1]Tasa de Falla'!IX74)","v":""},{"$f":"IF('[1]Tasa de Falla'!IY74=0,\"\",'[1]Tasa de Falla'!IY74)","v":""},{"$f":"IF('[1]Tasa de Falla'!IZ74=0,\"\",'[1]Tasa de Falla'!IZ74)","v":""}]
[null,null,{"$f":"'[1]Tasa de Falla'!C75","v":57},{"$f":"'[1]Tasa de Falla'!D75","v":"CABRA CORRAL - SALTA ESTE"},{"$f":"'[1]Tasa de Falla'!E75","v":132},{"$f":"'[1]Tasa de Falla'!F75","v":55},{"$f":"IF('[1]Tasa de Falla'!IO75=0,\"\",'[1]Tasa de Falla'!IO75)","v":""},{"$f":"IF('[1]Tasa de Falla'!IP75=0,\"\",'[1]Tasa de Falla'!IP75)","v":""},{"$f":"IF('[1]Tasa de Falla'!IQ75=0,\"\",'[1]Tasa de Falla'!IQ75)","v":""},{"$f":"IF('[1]Tasa de Falla'!IR75=0,\"\",'[1]Tasa de Falla'!IR75)","v":1},{"$f":"IF('[1]Tasa de Falla'!IS75=0,\"\",'[1]Tasa de Falla'!IS75)","v":""},{"$f":"IF('[1]Tasa de Falla'!IT75=0,\"\",'[1]Tasa de Falla'!IT75)","v":""},{"$f":"IF('[1]Tasa de Falla'!IU75=0,\"\",'[1]Tasa de Falla'!IU75)","v":1},{"$f":"IF('[1]Tasa de Falla'!IV75=0,\"\",'[1]Tasa de Falla'!IV75)","v":""},{"$f":"IF('[1]Tasa de Falla'!IW75=0,\"\",'[1]Tasa de Falla'!IW75)","v":1},{"$f":"IF('[1]Tasa de Falla'!IX75=0,\"\",'[1]Tasa de Falla'!IX75)","v":""},{"$f":"IF('[1]Tasa de Falla'!IY75=0,\"\",'[1]Tasa de Falla'!IY75)","v":""},{"$f":"IF('[1]Tasa de Falla'!IZ75=0,\"\",'[1]Tasa de Falla'!IZ75)","v":1}]
[null,null,{"$f":"'[1]Tasa de Falla'!C76","v":58},{"$f":"'[1]Tasa de Falla'!D76","v":"SALTA ESTE - SALTA SUR"},{"$f":"'[1]Tasa de Falla'!E76","v":132},{"$f":"'[1]Tasa de Falla'!F76","v":7},{"$f":"IF('[1]Tasa de Falla'!IO76=0,\"\",'[1]Tasa de Falla'!IO76)","v":""},{"$f":"IF('[1]Tasa de Falla'!IP76=0,\"\",'[1]Tasa de Falla'!IP76)","v":""},{"$f":"IF('[1]Tasa de Falla'!IQ76=0,\"\",'[1]Tasa de Falla'!IQ76)","v":""},{"$f":"IF('[1]Tasa de Falla'!IR76=0,\"\",'[1]Tasa de Falla'!IR76)","v":""},{"$f":"IF('[1]Tasa de Falla'!IS76=0,\"\",'[1]Tasa de Falla'!IS76)","v":""},{"$f":"IF('[1]Tasa de Falla'!IT76=0,\"\",'[1]Tasa de Falla'!IT76)","v":""},{"$f":"IF('[1]Tasa de Falla'!IU76=0,\"\",'[1]Tasa de Falla'!IU76)","v":""},{"$f":"IF('[1]Tasa de Falla'!IV76=0,\"\",'[1]Tasa de Falla'!IV76)","v":""},{"$f":"IF('[1]Tasa de Falla'!IW76=0,\"\",'[1]Tasa de Falla'!IW76)","v":""},{"$f":"IF('[1]Tasa de Falla'!IX76=0,\"\",'[1]Tasa de Falla'!IX76)","v":""},{"$f":"IF('[1]Tasa de Falla'!IY76=0,\"\",'[1]Tasa de Falla'!IY76)","v":""},{"$f":"IF('[1]Tasa de Falla'!IZ76=0,\"\",'[1]Tasa de Falla'!IZ76)","v":""}]
[null,null,{"$f":"'[1]Tasa de Falla'!C77","v":59},{"$f":"'[1]Tasa de Falla'!D77","v":"V. QUINTEROS - ACONQUIJA - ANDALGALA"},{"$f":"'[1]Tasa de Falla'!E77","v":132},{"$f":"'[1]Tasa de Falla'!F77","v":102},{"$f":"IF('[1]Tasa de Falla'!IO77=0,\"\",'[1]Tasa de Falla'!IO77)","v":""},{"$f":"IF('[1]Tasa de Falla'!IP77=0,\"\",'[1]Tasa de Falla'!IP77)","v":""},{"$f":"IF('[1]Tasa de Falla'!IQ77=0,\"\",'[1]Tasa de Falla'!IQ77)","v":1},{"$f":"IF('[1]Tasa de Falla'!IR77=0,\"\",'[1]Tasa de Falla'!IR77)","v":""},{"$f":"IF('[1]Tasa de Falla'!IS77=0,\"\",'[1]Tasa de Falla'!IS77)","v":""},{"$f":"IF('[1]Tasa de Falla'!IT77=0,\"\",'[1]Tasa de Falla'!IT77)","v":""},{"$f":"IF('[1]Tasa de Falla'!IU77=0,\"\",'[1]Tasa de Falla'!IU77)","v":2},{"$f":"IF('[1]Tasa de Falla'!IV77=0,\"\",'[1]Tasa de Falla'!IV77)","v":1},{"$f":"IF('[1]Tasa de Falla'!IW77=0,\"\",'[1]Tasa de Falla'!IW77)","v":""},{"$f":"IF('[1]Tasa de Falla'!IX77=0,\"\",'[1]Tasa de Falla'!IX77)","v":""},{"$f":"IF('[1]Tasa de Falla'!IY77=0,\"\",'[1]Tasa de Falla'!IY77)","v":""},{"$f":"IF('[1]Tasa de Falla'!IZ77=0,\"\",'[1]Tasa de Falla'!IZ77)","v":""}]
[null,null,{"$f":"'[1]Tasa de Falla'!C78","v":60},{"$f":"'[1]Tasa de Falla'!D78","v":"ANDALGALA - BELEN"},{"$f":"'[1]Tasa de Falla'!E78","v":132},{"$f":"'[1]Tasa de Falla'!F78","v":80.3},{"$f":"IF('[1]Tasa de Falla'!IO78=0,\"\",'[1]Tasa de Falla'!IO78)","v":""},{"$f":"IF('[1]Tasa de Falla'!IP78=0,\"\",'[1]Tasa de Falla'!IP78)","v":""},{"$f":"IF('[1]Tasa de Falla'!IQ78=0,\"\",'[1]Tasa de Falla'!IQ78)","v":""},{"$f":"IF('[1]Tasa de Falla'!IR78=0,\"\",'[1]Tasa de Falla'!IR78)","v":""},{"$f":"IF('[1]Tasa de Falla'!IS78=0,\"\",'[1]Tasa de Falla'!IS78)","v":""},{"$f":"IF('[1]Tasa de Falla'!IT78=0,\"\",'[1]Tasa de Falla'!IT78)","v":""},{"$f":"IF('[1]Tasa de Falla'!IU78=0,\"\",'[1]Tasa de Falla'!IU78)","v":1},{"$f":"IF('[1]Tasa de Falla'!IV78=0,\"\",'[1]Tasa de Falla'!IV78)","v":""},{"$f":"IF('[1]Tasa de Falla'!IW78=0,\"\",'[1]Tasa de Falla'!IW78)","v":""},{"$f":"IF('[1]Tasa de Falla'!IX78=0,\"\",'[1]Tasa de Falla'!IX78)","v":""},{"$f":"IF('[1]Tasa de Falla'!IY78=0,\"\",'[1]Tasa de Falla'!IY78)","v":""},{"$f":"IF('[1]Tasa de Falla'!IZ78=0,\"\",'[1]Tasa de Falla'!IZ78)","v":""}]
[null,null,{"$f":"'[1]Tasa de Falla'!C79","v":61},{"$f":"'[1]Tasa de Falla'!D79","v":"TUCUMAN NORTE - TRANCAS"},{"$f":"'[1]Tasa de Falla'!E79","v":132},{"$f":"'[1]Tasa de Falla'!F79","v":75},{"$f":"IF('[1]Tasa de Falla'!IO79=0,\"\",'[1]Tasa de Falla'!IO79)","v":""},{"$f":"IF('[1]Tasa de Falla'!IP79=0,\"\",'[1]Tasa de Falla'!IP79)","v":""},{"$f":"IF('[1]Tasa de Falla'!IQ79=0,\"\",'[1]Tasa de Falla'!IQ79)","v":""},{"$f":"IF('[1]Tasa de Falla'!IR79=0,\"\",'[1]Tasa de Falla'!IR79)","v":""},{"$f":"IF('[1]Tasa de Falla'!IS79=0,\"\",'[1]Tasa de Falla'!IS79)","v":""},{"$f":"IF('[1]Tasa de Falla'!IT79=0,\"\",'[1]Tasa de Falla'!IT79)","v":""},{"$f":"IF('[1]Tasa de Falla'!IU79=0,\"\",'[1]Tasa de Falla'!IU79)","v":""},{"$f":"IF('[1]Tasa de Falla'!IV79=0,\"\",'[1]Tasa de Falla'!IV79)","v":""},{"$f":"IF('[1]Tasa de Falla'!IW79=0,\"\",'[1]Tasa de Falla'!IW79)","v":""},{"$f":"IF('[1]Tasa de Falla'!IX79=0,\"\",'[1]Tasa de Falla'!IX79)","v":""},{"$f":"IF('[1]Tasa de Falla'!IY79=0,\"\",'[1]Tasa de Falla'!IY79)","v":""},{"$f":"IF('[1]Tasa de Falla'!IZ79=0,\"\",'[1]Tasa de Falla'!IZ79)","v":1}]
[null,null,{"$f":"'[1]Tasa de Falla'!C80","v":62},{"$f":"'[1]Tasa de Falla'!D80","v":"CABRA CORRAL - TRANCAS"},{"$f":"'[1]Tasa de Falla'!E80","v":132},{"$f":"'[1]Tasa de Falla'!F80","v":115},{"$f":"IF('[1]Tasa de Falla'!IO80=0,\"\",'[1]Tasa de Falla'!IO80)","v":"XXXX"},{"$f":"IF('[1]Tasa de Falla'!IP80=0,\"\",'[1]Tasa de Falla'!IP80)","v":"XXXX"},{"$f":"IF('[1]Tasa de Falla'!IQ80=0,\"\",'[1]Tasa de Falla'!IQ80)","v":"XXXX"},{"$f":"IF('[1]Tasa de Falla'!IR80=0,\"\",'[1]Tasa de Falla'!IR80)","v":"XXXX"},{"$f":"IF('[1]Tasa de Falla'!IS80=0,\"\",'[1]Tasa de Falla'!IS80)","v":"XXXX"},{"$f":"IF('[1]Tasa de Falla'!IT80=0,\"\",'[1]Tasa de Falla'!IT80)","v":"XXXX"},{"$f":"IF('[1]Tasa de Falla'!IU80=0,\"\",'[1]Tasa de Falla'!IU80)","v":"XXXX"},{"$f":"IF('[1]Tasa de Falla'!IV80=0,\"\",'[1]Tasa de Falla'!IV80)","v":"XXXX"},{"$f":"IF('[1]Tasa de Falla'!IW80=0,\"\",'[1]Tasa de Falla'!IW80)","v":"XXXX"},{"$f":"IF('[1]Tasa de Falla'!IX80=0,\"\",'[1]Tasa de Falla'!IX80)","v":"XXXX"},{"$f":"IF('[1]Tasa de Falla'!IY80=0,\"\",'[1]Tasa de Falla'!IY80)","v":"XXXX"},{"$f":"IF('[1]Tasa de Falla'!IZ80=0,\"\",'[1]Tasa de Falla'!IZ80)","v":"XXXX"}]
[null,null,{"$f":"'[1]Tasa de Falla'!C81","v":63},{"$f":"'[1]Tasa de Falla'!D81","v":"LAS MADERAS - JUJUY SUR"},{"$f":"'[1]Tasa de Falla'!E81","v":132},{"$f":"'[1]Tasa de Falla'!F81","v":27.6},{"$f":"IF('[1]Tasa de Falla'!IO81=0,\"\",'[1]Tasa de Falla'!IO81)","v":""},{"$f":"IF('[1]Tasa de Falla'!IP81=0,\"\",'[1]Tasa de Falla'!IP81)","v":""},{"$f":"IF('[1]Tasa de Falla'!IQ81=0,\"\",'[1]Tasa de Falla'!IQ81)","v":""},{"$f":"IF('[1]Tasa de Falla'!IR81=0,\"\",'[1]Tasa de Falla'!IR81)","v":""},{"$f":"IF('[1]Tasa de Falla'!IS81=0,\"\",'[1]Tasa de Falla'!IS81)","v":""},{"$f":"IF('[1]Tasa de Falla'!IT81=0,\"\",'[1]Tasa de Falla'!IT81)","v":1},{"$f":"IF('[1]Tasa de Falla'!IU81=0,\"\",'[1]Tasa de Falla'!IU81)","v":""},{"$f":"IF('[1]Tasa de Falla'!IV81=0,\"\",'[1]Tasa de Falla'!IV81)","v":""},{"$f":"IF('[1]Tasa de Falla'!IW81=0,\"\",'[1]Tasa de Falla'!IW81)","v":""},{"$f":"IF('[1]Tasa de Falla'!IX81=0,\"\",'[1]Tasa de Falla'!IX81)","v":""},{"$f":"IF('[1]Tasa de Falla'!IY81=0,\"\",'[1]Tasa de Falla'!IY81)","v":""},{"$f":"IF('[1]Tasa de Falla'!IZ81=0,\"\",'[1]Tasa de Falla'!IZ81)","v":""}]
[null,null,{"$f":"'[1]Tasa de Falla'!C82","v":64},{"$f":"'[1]Tasa de Falla'!D82","v":"BELEN - TINOGASTA"},{"$f":"'[1]Tasa de Falla'!E82","v":132},{"$f":"'[1]Tasa de Falla'!F82","v":72},{"$f":"IF('[1]Tasa de Falla'!IO82=0,\"\",'[1]Tasa de Falla'!IO82)","v":""},{"$f":"IF('[1]Tasa de Falla'!IP82=0,\"\",'[1]Tasa de Falla'!IP82)","v":""},{"$f":"IF('[1]Tasa de Falla'!IQ82=0,\"\",'[1]Tasa de Falla'!IQ82)","v":""},{"$f":"IF('[1]Tasa de Falla'!IR82=0,\"\",'[1]Tasa de Falla'!IR82)","v":""},{"$f":"IF('[1]Tasa de Falla'!IS82=0,\"\",'[1]Tasa de Falla'!IS82)","v":1},{"$f":"IF('[1]Tasa de Falla'!IT82=0,\"\",'[1]Tasa de Falla'!IT82)","v":""},{"$f":"IF('[1]Tasa de Falla'!IU82=0,\"\",'[1]Tasa de Falla'!IU82)","v":""},{"$f":"IF('[1]Tasa de Falla'!IV82=0,\"\",'[1]Tasa de Falla'!IV82)","v":""},{"$f":"IF('[1]Tasa de Falla'!IW82=0,\"\",'[1]Tasa de Falla'!IW82)","v":""},{"$f":"IF('[1]Tasa de Falla'!IX82=0,\"\",'[1]Tasa de Falla'!IX82)","v":""},{"$f":"IF('[1]Tasa de Falla'!IY82=0,\"\",'[1]Tasa de Falla'!IY82)","v":""},{"$f":"IF('[1]Tasa de Falla'!IZ82=0,\"\",'[1]Tasa de Falla'!IZ82)","v":""}]
[null,null,{"$f":"'[1]Tasa de Falla'!C83","v":65},{"$f":"'[1]Tasa de Falla'!D83","v":"BURRUYACU - CEVIL POZO"},{"$f":"'[1]Tasa de Falla'!E83","v":132},{"$f":"'[1]Tasa de Falla'!F83","v":56},{"$f":"IF('[1]Tasa de Falla'!IO83=0,\"\",'[1]Tasa de Falla'!IO83)","v":""},{"$f":"IF('[1]Tasa de Falla'!IP83=0,\"\",'[1]Tasa de Falla'!IP83)","v":""},{"$f":"IF('[1]Tasa de Falla'!IQ83=0,\"\",'[1]Tasa de Falla'!IQ83)","v":""},{"$f":"IF('[1]Tasa de Falla'!IR83=0,\"\",'[1]Tasa de Falla'!IR83)","v":1},{"$f":"IF('[1]Tasa de Falla'!IS83=0,\"\",'[1]Tasa de Falla'!IS83)","v":""},{"$f":"IF('[1]Tasa de Falla'!IT83=0,\"\",'[1]Tasa de Falla'!IT83)","v":""},{"$f":"IF('[1]Tasa de Falla'!IU83=0,\"\",'[1]Tasa de Falla'!IU83)","v":1},{"$f":"IF('[1]Tasa de Falla'!IV83=0,\"\",'[1]Tasa de Falla'!IV83)","v":1},{"$f":"IF('[1]Tasa de Falla'!IW83=0,\"\",'[1]Tasa de Falla'!IW83)","v":""},{"$f":"IF('[1]Tasa de Falla'!IX83=0,\"\",'[1]Tasa de Falla'!IX83)","v":""},{"$f":"IF('[1]Tasa de Falla'!IY83=0,\"\",'[1]Tasa de Falla'!IY83)","v":""},{"$f":"IF('[1]Tasa de Falla'!IZ83=0,\"\",'[1]Tasa de Falla'!IZ83)","v":""}]
[null,null,{"$f":"'[1]Tasa de Falla'!C84","v":66},{"$f":"'[1]Tasa de Falla'!D84","v":"GÜEMES - BURRUYACU"},{"$f":"'[1]Tasa de Falla'!E84","v":132},{"$f":"'[1]Tasa de Falla'!F84","v":235.1},{"$f":"IF('[1]Tasa de Falla'!IO84=0,\"\",'[1]Tasa de Falla'!IO84)","v":"XXXX"},{"$f":"IF('[1]Tasa de Falla'!IP84=0,\"\",'[1]Tasa de Falla'!IP84)","v":"XXXX"},{"$f":"IF('[1]Tasa de Falla'!IQ84=0,\"\",'[1]Tasa de Falla'!IQ84)","v":"XXXX"},{"$f":"IF('[1]Tasa de Falla'!IR84=0,\"\",'[1]Tasa de Falla'!IR84)","v":"XXXX"},{"$f":"IF('[1]Tasa de Falla'!IS84=0,\"\",'[1]Tasa de Falla'!IS84)","v":"XXXX"},{"$f":"IF('[1]Tasa de Falla'!IT84=0,\"\",'[1]Tasa de Falla'!IT84)","v":"XXXX"},{"$f":"IF('[1]Tasa de Falla'!IU84=0,\"\",'[1]Tasa de Falla'!IU84)","v":"XXXX"},{"$f":"IF('[1]Tasa de Falla'!IV84=0,\"\",'[1]Tasa de Falla'!IV84)","v":"XXXX"},{"$f":"IF('[1]Tasa de Falla'!IW84=0,\"\",'[1]Tasa de Falla'!IW84)","v":"XXXX"},{"$f":"IF('[1]Tasa de Falla'!IX84=0,\"\",'[1]Tasa de Falla'!IX84)","v":"XXXX"},{"$f":"IF('[1]Tasa de Falla'!IY84=0,\"\",'[1]Tasa de Falla'!IY84)","v":"XXXX"},{"$f":"IF('[1]Tasa de Falla'!IZ84=0,\"\",'[1]Tasa de Falla'!IZ84)","v":"XXXX"}]
[null,null,{"$f":"'[1]Tasa de Falla'!C85","v":67},{"$f":"'[1]Tasa de Falla'!D85","v":"FRIAS - RECREO"},{"$f":"'[1]Tasa de Falla'!E85","v":132},{"$f":"'[1]Tasa de Falla'!F85","v":74.540000000000006},{"$f":"IF('[1]Tasa de Falla'!IO85=0,\"\",'[1]Tasa de Falla'!IO85)","v":""},{"$f":"IF('[1]Tasa de Falla'!IP85=0,\"\",'[1]Tasa de Falla'!IP85)","v":""},{"$f":"IF('[1]Tasa de Falla'!IQ85=0,\"\",'[1]Tasa de Falla'!IQ85)","v":""},{"$f":"IF('[1]Tasa de Falla'!IR85=0,\"\",'[1]Tasa de Falla'!IR85)","v":""},{"$f":"IF('[1]Tasa de Falla'!IS85=0,\"\",'[1]Tasa de Falla'!IS85)","v":""},{"$f":"IF('[1]Tasa de Falla'!IT85=0,\"\",'[1]Tasa de Falla'!IT85)","v":""},{"$f":"IF('[1]Tasa de Falla'!IU85=0,\"\",'[1]Tasa de Falla'!IU85)","v":""},{"$f":"IF('[1]Tasa de Falla'!IV85=0,\"\",'[1]Tasa de Falla'!IV85)","v":""},{"$f":"IF('[1]Tasa de Falla'!IW85=0,\"\",'[1]Tasa de Falla'!IW85)","v":""},{"$f":"IF('[1]Tasa de Falla'!IX85=0,\"\",'[1]Tasa de Falla'!IX85)","v":""},{"$f":"IF('[1]Tasa de Falla'!IY85=0,\"\",'[1]Tasa de Falla'!IY85)","v":""},{"$f":"IF('[1]Tasa de Falla'!IZ85=0,\"\",'[1]Tasa de Falla'!IZ85)","v":""}]
[null,null,{"$f":"'[1]Tasa de Falla'!C86","v":68},{"$f":"'[1]Tasa de Falla'!D86","v":"RECREO - LA RIOJA 1"},{"$f":"'[1]Tasa de Falla'!E86","v":132},{"$f":"'[1]Tasa de Falla'!F86","v":221},{"$f":"IF('[1]Tasa de Falla'!IO86=0,\"\",'[1]Tasa de Falla'!IO86)","v":""},{"$f":"IF('[1]Tasa de Falla'!IP86=0,\"\",'[1]Tasa de Falla'!IP86)","v":""},{"$f":"IF('[1]Tasa de Falla'!IQ86=0,\"\",'[1]Tasa de Falla'!IQ86)","v":""},{"$f":"IF('[1]Tasa de Falla'!IR86=0,\"\",'[1]Tasa de Falla'!IR86)","v":""},{"$f":"IF('[1]Tasa de Falla'!IS86=0,\"\",'[1]Tasa de Falla'!IS86)","v":""},{"$f":"IF('[1]Tasa de Falla'!IT86=0,\"\",'[1]Tasa de Falla'!IT86)","v":1},{"$f":"IF('[1]Tasa de Falla'!IU86=0,\"\",'[1]Tasa de Falla'!IU86)","v":1},{"$f":"IF('[1]Tasa de Falla'!IV86=0,\"\",'[1]Tasa de Falla'!IV86)","v":""},{"$f":"IF('[1]Tasa de Falla'!IW86=0,\"\",'[1]Tasa de Falla'!IW86)","v":""},{"$f":"IF('[1]Tasa de Falla'!IX86=0,\"\",'[1]Tasa de Falla'!IX86)","v":""},{"$f":"IF('[1]Tasa de Falla'!IY86=0,\"\",'[1]Tasa de Falla'!IY86)","v":1},{"$f":"IF('[1]Tasa de Falla'!IZ86=0,\"\",'[1]Tasa de Falla'!IZ86)","v":1}]
[null,null,{"$f":"'[1]Tasa de Falla'!C87","v":69},{"$f":"'[1]Tasa de Falla'!D87","v":"RECREO - LA RIOJA 2"},{"$f":"'[1]Tasa de Falla'!E87","v":132},{"$f":"'[1]Tasa de Falla'!F87","v":220},{"$f":"IF('[1]Tasa de Falla'!IO87=0,\"\",'[1]Tasa de Falla'!IO87)","v":""},{"$f":"IF('[1]Tasa de Falla'!IP87=0,\"\",'[1]Tasa de Falla'!IP87)","v":""},{"$f":"IF('[1]Tasa de Falla'!IQ87=0,\"\",'[1]Tasa de Falla'!IQ87)","v":""},{"$f":"IF('[1]Tasa de Falla'!IR87=0,\"\",'[1]Tasa de Falla'!IR87)","v":""},{"$f":"IF('[1]Tasa de Falla'!IS87=0,\"\",'[1]Tasa de Falla'!IS87)","v":1},{"$f":"IF('[1]Tasa de Falla'!IT87=0,\"\",'[1]Tasa de Falla'!IT87)","v":""},{"$f":"IF('[1]Tasa de Falla'!IU87=0,\"\",'[1]Tasa de Falla'!IU87)","v":1},{"$f":"IF('[1]Tasa de Falla'!IV87=0,\"\",'[1]Tasa de Falla'!IV87)","v":""},{"$f":"IF('[1]Tasa de Falla'!IW87=0,\"\",'[1]Tasa de Falla'!IW87)","v":""},{"$f":"IF('[1]Tasa de Falla'!IX87=0,\"\",'[1]Tasa de Falla'!IX87)","v":1},{"$f":"IF('[1]Tasa de Falla'!IY87=0,\"\",'[1]Tasa de Falla'!IY87)","v":1},{"$f":"IF('[1]Tasa de Falla'!IZ87=0,\"\",'[1]Tasa de Falla'!IZ87)","v":""}]
[null,null,{"$f":"'[1]Tasa de Falla'!C88","v":70},{"$f":"'[1]Tasa de Falla'!D88","v":"RECREO - CATAMARCA"},{"$f":"'[1]Tasa de Falla'!E88","v":132},{"$f":"'[1]Tasa de Falla'!F88","v":203},{"$f":"IF('[1]Tasa de Falla'!IO88=0,\"\",'[1]Tasa de Falla'!IO88)","v":1},{"$f":"IF('[1]Tasa de Falla'!IP88=0,\"\",'[1]Tasa de Falla'!IP88)","v":""},{"$f":"IF('[1]Tasa de Falla'!IQ88=0,\"\",'[1]Tasa de Falla'!IQ88)","v":""},{"$f":"IF('[1]Tasa de Falla'!IR88=0,\"\",'[1]Tasa de Falla'!IR88)","v":""},{"$f":"IF('[1]Tasa de Falla'!IS88=0,\"\",'[1]Tasa de Falla'!IS88)","v":""},{"$f":"IF('[1]Tasa de Falla'!IT88=0,\"\",'[1]Tasa de Falla'!IT88)","v":2},{"$f":"IF('[1]Tasa de Falla'!IU88=0,\"\",'[1]Tasa de Falla'!IU88)","v":""},{"$f":"IF('[1]Tasa de Falla'!IV88=0,\"\",'[1]Tasa de Falla'!IV88)","v":""},{"$f":"IF('[1]Tasa de Falla'!IW88=0,\"\",'[1]Tasa de Falla'!IW88)","v":1},{"$f":"IF('[1]Tasa de Falla'!IX88=0,\"\",'[1]Tasa de Falla'!IX88)","v":""},{"$f":"IF('[1]Tasa de Falla'!IY88=0,\"\",'[1]Tasa de Falla'!IY88)","v":""},{"$f":"IF('[1]Tasa de Falla'!IZ88=0,\"\",'[1]Tasa de Falla'!IZ88)","v":""}]
[null,null,{"$f":"'[1]Tasa de Falla'!C89","v":71},{"$f":"'[1]Tasa de Falla'!D89","v":"CABRA CORRAL - EL CARRIL"},{"$f":"'[1]Tasa de Falla'!E89","v":132},{"$f":"'[1]Tasa de Falla'!F89","v":33.75},{"$f":"IF('[1]Tasa de Falla'!IO89=0,\"\",'[1]Tasa de Falla'!IO89)","v":""},{"$f":"IF('[1]Tasa de Falla'!IP89=0,\"\",'[1]Tasa de Falla'!IP89)","v":""},{"$f":"IF('[1]Tasa de Falla'!IQ89=0,\"\",'[1]Tasa de Falla'!IQ89)","v":""},{"$f":"IF('[1]Tasa de Falla'!IR89=0,\"\",'[1]Tasa de Falla'!IR89)","v":1},{"$f":"IF('[1]Tasa de Falla'!IS89=0,\"\",'[1]Tasa de Falla'!IS89)","v":""},{"$f":"IF('[1]Tasa de Falla'!IT89=0,\"\",'[1]Tasa de Falla'!IT89)","v":""},{"$f":"IF('[1]Tasa de Falla'!IU89=0,\"\",'[1]Tasa de Falla'!IU89)","v":""},{"$f":"IF('[1]Tasa de Falla'!IV89=0,\"\",'[1]Tasa de Falla'!IV89)","v":""},{"$f":"IF('[1]Tasa de Falla'!IW89=0,\"\",'[1]Tasa de Falla'!IW89)","v":""},{"$f":"IF('[1]Tasa de Falla'!IX89=0,\"\",'[1]Tasa de Falla'!IX89)","v":""},{"$f":"IF('[1]Tasa de Falla'!IY89=0,\"\",'[1]Tasa de Falla'!IY89)","v":""},{"$f":"IF('[1]Tasa de Falla'!IZ89=0,\"\",'[1]Tasa de Falla'!IZ89)","v":1}]
[null,null,{"$f":"'[1]Tasa de Falla'!C90","v":72},{"$f":"'[1]Tasa de Falla'!D90","v":"PAMPA GRANDE - CABRA CORRAL"},{"$f":"'[1]Tasa de Falla'!E90","v":132},{"$f":"'[1]Tasa de Falla'!F90","v":60},{"$f":"IF('[1]Tasa de Falla'!IO90=0,\"\",'[1]Tasa de Falla'!IO90)","v":1},{"$f":"IF('[1]Tasa de Falla'!IP90=0,\"\",'[1]Tasa de Falla'!IP90)","v":""},{"$f":"IF('[1]Tasa de Falla'!IQ90=0,\"\",'[1]Tasa de Falla'!IQ90)","v":""},{"$f":"IF('[1]Tasa de Falla'!IR90=0,\"\",'[1]Tasa de Falla'!IR90)","v":""},{"$f":"IF('[1]Tasa de Falla'!IS90=0,\"\",'[1]Tasa de Falla'!IS90)","v":""},{"$f":"IF('[1]Tasa de Falla'!IT90=0,\"\",'[1]Tasa de Falla'!IT90)","v":""},{"$f":"IF('[1]Tasa de Falla'!IU90=0,\"\",'[1]Tasa de Falla'!IU90)","v":1},{"$f":"IF('[1]Tasa de Falla'!IV90=0,\"\",'[1]Tasa de Falla'!IV90)","v":1},{"$f":"IF('[1]Tasa de Falla'!IW90=0,\"\",'[1]Tasa de Falla'!IW90)","v":1},{"$f":"IF('[1]Tasa de Falla'!IX90=0,\"\",'[1]Tasa de Falla'!IX90)","v":""},{"$f":"IF('[1]Tasa de Falla'!IY90=0,\"\",'[1]Tasa de Falla'!IY90)","v":""},{"$f":"IF('[1]Tasa de Falla'!IZ90=0,\"\",'[1]Tasa de Falla'!IZ90)","v":1}]
[null,null,{"$f":"'[1]Tasa de Falla'!C91","v":73},{"$f":"'[1]Tasa de Falla'!D91","v":"PAMPA GRANDE - CAFAYATE"},{"$f":"'[1]Tasa de Falla'!E91","v":132},{"$f":"'[1]Tasa de Falla'!F91","v":63},{"$f":"IF('[1]Tasa de Falla'!IO91=0,\"\",'[1]Tasa de Falla'!IO91)","v":1},{"$f":"IF('[1]Tasa de Falla'!IP91=0,\"\",'[1]Tasa de Falla'!IP91)","v":""},{"$f":"IF('[1]Tasa de Falla'!IQ91=0,\"\",'[1]Tasa de Falla'!IQ91)","v":""},{"$f":"IF('[1]Tasa de Falla'!IR91=0,\"\",'[1]Tasa de Falla'!IR91)","v":""},{"$f":"IF('[1]Tasa de Falla'!IS91=0,\"\",'[1]Tasa de Falla'!IS91)","v":""},{"$f":"IF('[1]Tasa de Falla'!IT91=0,\"\",'[1]Tasa de Falla'!IT91)","v":""},{"$f":"IF('[1]Tasa de Falla'!IU91=0,\"\",'[1]Tasa de Falla'!IU91)","v":""},{"$f":"IF('[1]Tasa de Falla'!IV91=0,\"\",'[1]Tasa de Falla'!IV91)","v":""},{"$f":"IF('[1]Tasa de Falla'!IW91=0,\"\",'[1]Tasa de Falla'!IW91)","v":""},{"$f":"IF('[1]Tasa de Falla'!IX91=0,\"\",'[1]Tasa de Falla'!IX91)","v":""},{"$f":"IF('[1]Tasa de Falla'!IY91=0,\"\",'[1]Tasa de Falla'!IY91)","v":""},{"$f":"IF('[1]Tasa de Falla'!IZ91=0,\"\",'[1]Tasa de Falla'!IZ91)","v":""}]
[null,null,{"$f":"'[1]Tasa de Falla'!C92","v":74},{"$f":"'[1]Tasa de Falla'!D92","v":"PAMPA GRANDE - TRANCAS"},{"$f":"'[1]Tasa de Falla'!E92","v":132},{"$f":"'[1]Tasa de Falla'!F92","v":55},{"$f":"IF('[1]Tasa de Falla'!IO92=0,\"\",'[1]Tasa de Falla'!IO92)","v":""},{"$f":"IF('[1]Tasa de Falla'!IP92=0,\"\",'[1]Tasa de Falla'!IP92)","v":""},{"$f":"IF('[1]Tasa de Falla'!IQ92=0,\"\",'[1]Tasa de Falla'!IQ92)","v":""},{"$f":"IF('[1]Tasa de Falla'!IR92=0,\"\",'[1]Tasa de Falla'!IR92)","v":""},{"$f":"IF('[1]Tasa de Falla'!IS92=0,\"\",'[1]Tasa de Falla'!IS92)","v":""},{"$f":"IF('[1]Tasa de Falla'!IT92=0,\"\",'[1]Tasa de Falla'!IT92)","v":""},{"$f":"IF('[1]Tasa de Falla'!IU92=0,\"\",'[1]Tasa de Falla'!IU92)","v":""},{"$f":"IF('[1]Tasa de Falla'!IV92=0,\"\",'[1]Tasa de Falla'!IV92)","v":""},{"$f":"IF('[1]Tasa de Falla'!IW92=0,\"\",'[1]Tasa de Falla'!IW92)","v":""},{"$f":"IF('[1]Tasa de Falla'!IX92=0,\"\",'[1]Tasa de Falla'!IX92)","v":""},{"$f":"IF('[1]Tasa de Falla'!IY92=0,\"\",'[1]Tasa de Falla'!IY92)","v":""},{"$f":"IF('[1]Tasa de Falla'!IZ92=0,\"\",'[1]Tasa de Falla'!IZ92)","v":""}]
[null,null,{"$f":"'[1]Tasa de Falla'!C93","v":75},{"$f":"'[1]Tasa de Falla'!D93","v":"SANTIAGO CENTRO - FERNANDEZ - SUNCHO CORRAL "},{"$f":"'[1]Tasa de Falla'!E93","v":132},{"$f":"'[1]Tasa de Falla'!F93","v":103},{"$f":"IF('[1]Tasa de Falla'!IO93=0,\"\",'[1]Tasa de Falla'!IO93)","v":""},{"$f":"IF('[1]Tasa de Falla'!IP93=0,\"\",'[1]Tasa de Falla'!IP93)","v":""},{"$f":"IF('[1]Tasa de Falla'!IQ93=0,\"\",'[1]Tasa de Falla'!IQ93)","v":""},{"$f":"IF('[1]Tasa de Falla'!IR93=0,\"\",'[1]Tasa de Falla'!IR93)","v":""},{"$f":"IF('[1]Tasa de Falla'!IS93=0,\"\",'[1]Tasa de Falla'!IS93)","v":""},{"$f":"IF('[1]Tasa de Falla'!IT93=0,\"\",'[1]Tasa de Falla'!IT93)","v":""},{"$f":"IF('[1]Tasa de Falla'!IU93=0,\"\",'[1]Tasa de Falla'!IU93)","v":""},{"$f":"IF('[1]Tasa de Falla'!IV93=0,\"\",'[1]Tasa de Falla'!IV93)","v":""},{"$f":"IF('[1]Tasa de Falla'!IW93=0,\"\",'[1]Tasa de Falla'!IW93)","v":""},{"$f":"IF('[1]Tasa de Falla'!IX93=0,\"\",'[1]Tasa de Falla'!IX93)","v":""},{"$f":"IF('[1]Tasa de Falla'!IY93=0,\"\",'[1]Tasa de Falla'!IY93)","v":""},{"$f":"IF('[1]Tasa de Falla'!IZ93=0,\"\",'[1]Tasa de Falla'!IZ93)","v":""}]
[null,null,{"$f":"'[1]Tasa de Falla'!C94","v":76},{"$f":"'[1]Tasa de Falla'!D94","v":"SUNCHO CORRAL - ANATUYA"},{"$f":"'[1]Tasa de Falla'!E94","v":132},{"$f":"'[1]Tasa de Falla'!F94","v":81},{"$f":"IF('[1]Tasa de Falla'!IO94=0,\"\",'[1]Tasa de Falla'!IO94)","v":""},{"$f":"IF('[1]Tasa de Falla'!IP94=0,\"\",'[1]Tasa de Falla'!IP94)","v":""},{"$f":"IF('[1]Tasa de Falla'!IQ94=0,\"\",'[1]Tasa de Falla'!IQ94)","v":""},{"$f":"IF('[1]Tasa de Falla'!IR94=0,\"\",'[1]Tasa de Falla'!IR94)","v":2},{"$f":"IF('[1]Tasa de Falla'!IS94=0,\"\",'[1]Tasa de Falla'!IS94)","v":1},{"$f":"IF('[1]Tasa de Falla'!IT94=0,\"\",'[1]Tasa de Falla'!IT94)","v":""},{"$f":"IF('[1]Tasa de Falla'!IU94=0,\"\",'[1]Tasa de Falla'!IU94)","v":""},{"$f":"IF('[1]Tasa de Falla'!IV94=0,\"\",'[1]Tasa de Falla'!IV94)","v":""},{"$f":"IF('[1]Tasa de Falla'!IW94=0,\"\",'[1]Tasa de Falla'!IW94)","v":""},{"$f":"IF('[1]Tasa de Falla'!IX94=0,\"\",'[1]Tasa de Falla'!IX94)","v":""},{"$f":"IF('[1]Tasa de Falla'!IY94=0,\"\",'[1]Tasa de Falla'!IY94)","v":""},{"$f":"IF('[1]Tasa de Falla'!IZ94=0,\"\",'[1]Tasa de Falla'!IZ94)","v":""}]
[null,null,{"$f":"'[1]Tasa de Falla'!C95","v":77},{"$f":"'[1]Tasa de Falla'!D95","v":"LAS MADERAS - GÜEMES SALTA"},{"$f":"'[1]Tasa de Falla'!E95","v":132},{"$f":"'[1]Tasa de Falla'!F95","v":42},{"$f":"IF('[1]Tasa de Falla'!IO95=0,\"\",'[1]Tasa de Falla'!IO95)","v":""},{"$f":"IF('[1]Tasa de Falla'!IP95=0,\"\",'[1]Tasa de Falla'!IP95)","v":""},{"$f":"IF('[1]Tasa de Falla'!IQ95=0,\"\",'[1]Tasa de Falla'!IQ95)","v":""},{"$f":"IF('[1]Tasa de Falla'!IR95=0,\"\",'[1]Tasa de Falla'!IR95)","v":1},{"$f":"IF('[1]Tasa de Falla'!IS95=0,\"\",'[1]Tasa de Falla'!IS95)","v":""},{"$f":"IF('[1]Tasa de Falla'!IT95=0,\"\",'[1]Tasa de Falla'!IT95)","v":""},{"$f":"IF('[1]Tasa de Falla'!IU95=0,\"\",'[1]Tasa de Falla'!IU95)","v":""},{"$f":"IF('[1]Tasa de Falla'!IV95=0,\"\",'[1]Tasa de Falla'!IV95)","v":""},{"$f":"IF('[1]Tasa de Falla'!IW95=0,\"\",'[1]Tasa de Falla'!IW95)","v":""},{"$f":"IF('[1]Tasa de Falla'!IX95=0,\"\",'[1]Tasa de Falla'!IX95)","v":""},{"$f":"IF('[1]Tasa de Falla'!IY95=0,\"\",'[1]Tasa de Falla'!IY95)","v":""},{"$f":"IF('[1]Tasa de Falla'!IZ95=0,\"\",'[1]Tasa de Falla'!IZ95)","v":""}]
[null,null,{"$f":"'[1]Tasa de Falla'!C96","v":78},{"$f":"'[1]Tasa de Falla'!D96","v":"INDEPENDENCIA - EL BRACHO 2"},{"$f":"'[1]Tasa de Falla'!E96","v":132},{"$f":"'[1]Tasa de Falla'!F96","v":17.100000000000001},{"$f":"IF('[1]Tasa de Falla'!IO96=0,\"\",'[1]Tasa de Falla'!IO96)","v":""},{"$f":"IF('[1]Tasa de Falla'!IP96=0,\"\",'[1]Tasa de Falla'!IP96)","v":""},{"$f":"IF('[1]Tasa de Falla'!IQ96=0,\"\",'[1]Tasa de Falla'!IQ96)","v":""},{"$f":"IF('[1]Tasa de Falla'!IR96=0,\"\",'[1]Tasa de Falla'!IR96)","v":""},{"$f":"IF('[1]Tasa de Falla'!IS96=0,\"\",'[1]Tasa de Falla'!IS96)","v":""},{"$f":"IF('[1]Tasa de Falla'!IT96=0,\"\",'[1]Tasa de Falla'!IT96)","v":""},{"$f":"IF('[1]Tasa de Falla'!IU96=0,\"\",'[1]Tasa de Falla'!IU96)","v":""},{"$f":"IF('[1]Tasa de Falla'!IV96=0,\"\",'[1]Tasa de Falla'!IV96)","v":1},{"$f":"IF('[1]Tasa de Falla'!IW96=0,\"\",'[1]Tasa de Falla'!IW96)","v":""},{"$f":"IF('[1]Tasa de Falla'!IX96=0,\"\",'[1]Tasa de Falla'!IX96)","v":""},{"$f":"IF('[1]Tasa de Falla'!IY96=0,\"\",'[1]Tasa de Falla'!IY96)","v":""},{"$f":"IF('[1]Tasa de Falla'!IZ96=0,\"\",'[1]Tasa de Falla'!IZ96)","v":1}]
[null,null,{"$f":"'[1]Tasa de Falla'!C97","v":79},{"$f":"'[1]Tasa de Falla'!D97","v":"GÜEMES - SALTA NORTE"},{"$f":"'[1]Tasa de Falla'!E97","v":132},{"$f":"'[1]Tasa de Falla'!F97","v":39},{"$f":"IF('[1]Tasa de Falla'!IO97=0,\"\",'[1]Tasa de Falla'!IO97)","v":"XXXX"},{"$f":"IF('[1]Tasa de Falla'!IP97=0,\"\",'[1]Tasa de Falla'!IP97)","v":"XXXX"},{"$f":"IF('[1]Tasa de Falla'!IQ97=0,\"\",'[1]Tasa de Falla'!IQ97)","v":"XXXX"},{"$f":"IF('[1]Tasa de Falla'!IR97=0,\"\",'[1]Tasa de Falla'!IR97)","v":"XXXX"},{"$f":"IF('[1]Tasa de Falla'!IS97=0,\"\",'[1]Tasa de Falla'!IS97)","v":"XXXX"},{"$f":"IF('[1]Tasa de Falla'!IT97=0,\"\",'[1]Tasa de Falla'!IT97)","v":"XXXX"},{"$f":"IF('[1]Tasa de Falla'!IU97=0,\"\",'[1]Tasa de Falla'!IU97)","v":"XXXX"},{"$f":"IF('[1]Tasa de Falla'!IV97=0,\"\",'[1]Tasa de Falla'!IV97)","v":"XXXX"},{"$f":"IF('[1]Tasa de Falla'!IW97=0,\"\",'[1]Tasa de Falla'!IW97)","v":"XXXX"},{"$f":"IF('[1]Tasa de Falla'!IX97=0,\"\",'[1]Tasa de Falla'!IX97)","v":"XXXX"},{"$f":"IF('[1]Tasa de Falla'!IY97=0,\"\",'[1]Tasa de Falla'!IY97)","v":"XXXX"},{"$f":"IF('[1]Tasa de Falla'!IZ97=0,\"\",'[1]Tasa de Falla'!IZ97)","v":"XXXX"}]
[null,null,{"$f":"'[1]Tasa de Falla'!C98","v":80},{"$f":"'[1]Tasa de Falla'!D98","v":"BURRUYACU - COBOS"},{"$f":"'[1]Tasa de Falla'!E98","v":132},{"$f":"'[1]Tasa de Falla'!F98","v":229.5},{"$f":"IF('[1]Tasa de Falla'!IO98=0,\"\",'[1]Tasa de Falla'!IO98)","v":"XXXX"},{"$f":"IF('[1]Tasa de Falla'!IP98=0,\"\",'[1]Tasa de Falla'!IP98)","v":"XXXX"},{"$f":"IF('[1]Tasa de Falla'!IQ98=0,\"\",'[1]Tasa de Falla'!IQ98)","v":"XXXX"},{"$f":"IF('[1]Tasa de Falla'!IR98=0,\"\",'[1]Tasa de Falla'!IR98)","v":"XXXX"},{"$f":"IF('[1]Tasa de Falla'!IS98=0,\"\",'[1]Tasa de Falla'!IS98)","v":"XXXX"},{"$f":"IF('[1]Tasa de Falla'!IT98=0,\"\",'[1]Tasa de Falla'!IT98)","v":"XXXX"},{"$f":"IF('[1]Tasa de Falla'!IU98=0,\"\",'[1]Tasa de Falla'!IU98)","v":"XXXX"},{"$f":"IF('[1]Tasa de Falla'!IV98=0,\"\",'[1]Tasa de Falla'!IV98)","v":"XXXX"},{"$f":"IF('[1]Tasa de Falla'!IW98=0,\"\",'[1]Tasa de Falla'!IW98)","v":"XXXX"},{"$f":"IF('[1]Tasa de Falla'!IX98=0,\"\",'[1]Tasa de Falla'!IX98)","v":"XXXX"},{"$f":"IF('[1]Tasa de Falla'!IY98=0,\"\",'[1]Tasa de Falla'!IY98)","v":"XXXX"},{"$f":"IF('[1]Tasa de Falla'!IZ98=0,\"\",'[1]Tasa de Falla'!IZ98)","v":"XXXX"}]
[null,null,{"$f":"'[1]Tasa de Falla'!C99","v":81},{"$f":"'[1]Tasa de Falla'!D99","v":"METAN - COBOS"},{"$f":"'[1]Tasa de Falla'!E99","v":132},{"$f":"'[1]Tasa de Falla'!F99","v":89.2},{"$f":"IF('[1]Tasa de Falla'!IO99=0,\"\",'[1]Tasa de Falla'!IO99)","v":""},{"$f":"IF('[1]Tasa de Falla'!IP99=0,\"\",'[1]Tasa de Falla'!IP99)","v":""},{"$f":"IF('[1]Tasa de Falla'!IQ99=0,\"\",'[1]Tasa de Falla'!IQ99)","v":""},{"$f":"IF('[1]Tasa de Falla'!IR99=0,\"\",'[1]Tasa de Falla'!IR99)","v":""},{"$f":"IF('[1]Tasa de Falla'!IS99=0,\"\",'[1]Tasa de Falla'!IS99)","v":""},{"$f":"IF('[1]Tasa de Falla'!IT99=0,\"\",'[1]Tasa de Falla'!IT99)","v":""},{"$f":"IF('[1]Tasa de Falla'!IU99=0,\"\",'[1]Tasa de Falla'!IU99)","v":""},{"$f":"IF('[1]Tasa de Falla'!IV99=0,\"\",'[1]Tasa de Falla'!IV99)","v":""},{"$f":"IF('[1]Tasa de Falla'!IW99=0,\"\",'[1]Tasa de Falla'!IW99)","v":""},{"$f":"IF('[1]Tasa de Falla'!IX99=0,\"\",'[1]Tasa de Falla'!IX99)","v":""},{"$f":"IF('[1]Tasa de Falla'!IY99=0,\"\",'[1]Tasa de Falla'!IY99)","v":""},{"$f":"IF('[1]Tasa de Falla'!IZ99=0,\"\",'[1]Tasa de Falla'!IZ99)","v":""}]
[null,null,{"$f":"'[1]Tasa de Falla'!C100","v":82},{"$f":"'[1]Tasa de Falla'!D100","v":"AÑATUYA - BANDERA"},{"$f":"'[1]Tasa de Falla'!E100","v":132},{"$f":"'[1]Tasa de Falla'!F100","v":76},{"$f":"IF('[1]Tasa de Falla'!IO100=0,\"\",'[1]Tasa de Falla'!IO100)","v":""},{"$f":"IF('[1]Tasa de Falla'!IP100=0,\"\",'[1]Tasa de Falla'!IP100)","v":""},{"$f":"IF('[1]Tasa de Falla'!IQ100=0,\"\",'[1]Tasa de Falla'!IQ100)","v":""},{"$f":"IF('[1]Tasa de Falla'!IR100=0,\"\",'[1]Tasa de Falla'!IR100)","v":""},{"$f":"IF('[1]Tasa de Falla'!IS100=0,\"\",'[1]Tasa de Falla'!IS100)","v":2},{"$f":"IF('[1]Tasa de Falla'!IT100=0,\"\",'[1]Tasa de Falla'!IT100)","v":""},{"$f":"IF('[1]Tasa de Falla'!IU100=0,\"\",'[1]Tasa de Falla'!IU100)","v":""},{"$f":"IF('[1]Tasa de Falla'!IV100=0,\"\",'[1]Tasa de Falla'!IV100)","v":1},{"$f":"IF('[1]Tasa de Falla'!IW100=0,\"\",'[1]Tasa de Falla'!IW100)","v":""},{"$f":"IF('[1]Tasa de Falla'!IX100=0,\"\",'[1]Tasa de Falla'!IX100)","v":""},{"$f":"IF('[1]Tasa de Falla'!IY100=0,\"\",'[1]Tasa de Falla'!IY100)","v":""},{"$f":"IF('[1]Tasa de Falla'!IZ100=0,\"\",'[1]Tasa de Falla'!IZ100)","v":""}]
[null,null,{"$f":"'[1]Tasa de Falla'!C101","v":84},{"$f":"'[1]Tasa de Falla'!D101","v":"GÜEMES SALTA - COBOS 1"},{"$f":"'[1]Tasa de Falla'!E101","v":132},{"$f":"'[1]Tasa de Falla'!F101","v":12.1},{"$f":"IF('[1]Tasa de Falla'!IO101=0,\"\",'[1]Tasa de Falla'!IO101)","v":""},{"$f":"IF('[1]Tasa de Falla'!IP101=0,\"\",'[1]Tasa de Falla'!IP101)","v":""},{"$f":"IF('[1]Tasa de Falla'!IQ101=0,\"\",'[1]Tasa de Falla'!IQ101)","v":""},{"$f":"IF('[1]Tasa de Falla'!IR101=0,\"\",'[1]Tasa de Falla'!IR101)","v":""},{"$f":"IF('[1]Tasa de Falla'!IS101=0,\"\",'[1]Tasa de Falla'!IS101)","v":""},{"$f":"IF('[1]Tasa de Falla'!IT101=0,\"\",'[1]Tasa de Falla'!IT101)","v":""},{"$f":"IF('[1]Tasa de Falla'!IU101=0,\"\",'[1]Tasa de Falla'!IU101)","v":""},{"$f":"IF('[1]Tasa de Falla'!IV101=0,\"\",'[1]Tasa de Falla'!IV101)","v":""},{"$f":"IF('[1]Tasa de Falla'!IW101=0,\"\",'[1]Tasa de Falla'!IW101)","v":""},{"$f":"IF('[1]Tasa de Falla'!IX101=0,\"\",'[1]Tasa de Falla'!IX101)","v":""},{"$f":"IF('[1]Tasa de Falla'!IY101=0,\"\",'[1]Tasa de Falla'!IY101)","v":""},{"$f":"IF('[1]Tasa de Falla'!IZ101=0,\"\",'[1]Tasa de Falla'!IZ101)","v":""}]
[null,null,{"$f":"'[1]Tasa de Falla'!C102","v":85},{"$f":"'[1]Tasa de Falla'!D102","v":"GÜEMES SALTA - COBOS 2"},{"$f":"'[1]Tasa de Falla'!E102","v":132},{"$f":"'[1]Tasa de Falla'!F102","v":12.1},{"$f":"IF('[1]Tasa de Falla'!IO102=0,\"\",'[1]Tasa de Falla'!IO102)","v":""},{"$f":"IF('[1]Tasa de Falla'!IP102=0,\"\",'[1]Tasa de Falla'!IP102)","v":""},{"$f":"IF('[1]Tasa de Falla'!IQ102=0,\"\",'[1]Tasa de Falla'!IQ102)","v":""},{"$f":"IF('[1]Tasa de Falla'!IR102=0,\"\",'[1]Tasa de Falla'!IR102)","v":""},{"$f":"IF('[1]Tasa de Falla'!IS102=0,\"\",'[1]Tasa de Falla'!IS102)","v":""},{"$f":"IF('[1]Tasa de Falla'!IT102=0,\"\",'[1]Tasa de Falla'!IT102)","v":""},{"$f":"IF('[1]Tasa de Falla'!IU102=0,\"\",'[1]Tasa de Falla'!IU102)","v":""},{"$f":"IF('[1]Tasa de Falla'!IV102=0,\"\",'[1]Tasa de Falla'!IV102)","v":""},{"$f":"IF('[1]Tasa de Falla'!IW102=0,\"\",'[1]Tasa de Falla'!IW102)","v":""},{"$f":"IF('[1]Tasa de Falla'!IX102=0,\"\",'[1]Tasa de Falla'!IX102)","v":""},{"$f":"IF('[1]Tasa de Falla'!IY102=0,\"\",'[1]Tasa de Falla'!IY102)","v":""},{"$f":"IF('[1]Tasa de Falla'!IZ102=0,\"\",'[1]Tasa de Falla'!IZ102)","v":1}]
[null,null,{"$f":"'[1]Tasa de Falla'!C103","v":86},{"$f":"'[1]Tasa de Falla'!D103","v":"EL BRACHO - LA BANDA"},{"$f":"'[1]Tasa de Falla'!E103","v":132},{"$f":"'[1]Tasa de Falla'!F103","v":133.5},{"$f":"IF('[1]Tasa de Falla'!IO103=0,\"\",'[1]Tasa de Falla'!IO103)","v":"XXXX"},{"$f":"IF('[1]Tasa de Falla'!IP103=0,\"\",'[1]Tasa de Falla'!IP103)","v":"XXXX"},{"$f":"IF('[1]Tasa de Falla'!IQ103=0,\"\",'[1]Tasa de Falla'!IQ103)","v":"XXXX"},{"$f":"IF('[1]Tasa de Falla'!IR103=0,\"\",'[1]Tasa de Falla'!IR103)","v":"XXXX"},{"$f":"IF('[1]Tasa de Falla'!IS103=0,\"\",'[1]Tasa de Falla'!IS103)","v":"XXXX"},{"$f":"IF('[1]Tasa de Falla'!IT103=0,\"\",'[1]Tasa de Falla'!IT103)","v":"XXXX"},{"$f":"IF('[1]Tasa de Falla'!IU103=0,\"\",'[1]Tasa de Falla'!IU103)","v":"XXXX"},{"$f":"IF('[1]Tasa de Falla'!IV103=0,\"\",'[1]Tasa de Falla'!IV103)","v":"XXXX"},{"$f":"IF('[1]Tasa de Falla'!IW103=0,\"\",'[1]Tasa de Falla'!IW103)","v":"XXXX"},{"$f":"IF('[1]Tasa de Falla'!IX103=0,\"\",'[1]Tasa de Falla'!IX103)","v":"XXXX"},{"$f":"IF('[1]Tasa de Falla'!IY103=0,\"\",'[1]Tasa de Falla'!IY103)","v":"XXXX"},{"$f":"IF('[1]Tasa de Falla'!IZ103=0,\"\",'[1]Tasa de Falla'!IZ103)","v":"XXXX"}]
[null,null,{"$f":"'[1]Tasa de Falla'!C104","v":87},{"$f":"'[1]Tasa de Falla'!D104","v":"SANTIAGO OESTE - SANTIAGO SUR "},{"$f":"'[1]Tasa de Falla'!E104","v":132},{"$f":"'[1]Tasa de Falla'!F104","v":10.6},{"$f":"IF('[1]Tasa de Falla'!IO104=0,\"\",'[1]Tasa de Falla'!IO104)","v":""},{"$f":"IF('[1]Tasa de Falla'!IP104=0,\"\",'[1]Tasa de Falla'!IP104)","v":""},{"$f":"IF('[1]Tasa de Falla'!IQ104=0,\"\",'[1]Tasa de Falla'!IQ104)","v":""},{"$f":"IF('[1]Tasa de Falla'!IR104=0,\"\",'[1]Tasa de Falla'!IR104)","v":""},{"$f":"IF('[1]Tasa de Falla'!IS104=0,\"\",'[1]Tasa de Falla'!IS104)","v":1},{"$f":"IF('[1]Tasa de Falla'!IT104=0,\"\",'[1]Tasa de Falla'!IT104)","v":""},{"$f":"IF('[1]Tasa de Falla'!IU104=0,\"\",'[1]Tasa de Falla'!IU104)","v":""},{"$f":"IF('[1]Tasa de Falla'!IV104=0,\"\",'[1]Tasa de Falla'!IV104)","v":""},{"$f":"IF('[1]Tasa de Falla'!IW104=0,\"\",'[1]Tasa de Falla'!IW104)","v":""},{"$f":"IF('[1]Tasa de Falla'!IX104=0,\"\",'[1]Tasa de Falla'!IX104)","v":""},{"$f":"IF('[1]Tasa de Falla'!IY104=0,\"\",'[1]Tasa de Falla'!IY104)","v":""},{"$f":"IF('[1]Tasa de Falla'!IZ104=0,\"\",'[1]Tasa de Falla'!IZ104)","v":""}]
[null,null,{"$f":"'[1]Tasa de Falla'!C105","v":88},{"$f":"'[1]Tasa de Falla'!D105","v":"SANTIAGO SUR - SANTIAGO CENTRO"},{"$f":"'[1]Tasa de Falla'!E105","v":132},{"$f":"'[1]Tasa de Falla'!F105","v":4},{"$f":"IF('[1]Tasa de Falla'!IO105=0,\"\",'[1]Tasa de Falla'!IO105)","v":""},{"$f":"IF('[1]Tasa de Falla'!IP105=0,\"\",'[1]Tasa de Falla'!IP105)","v":""},{"$f":"IF('[1]Tasa de Falla'!IQ105=0,\"\",'[1]Tasa de Falla'!IQ105)","v":""},{"$f":"IF('[1]Tasa de Falla'!IR105=0,\"\",'[1]Tasa de Falla'!IR105)","v":""},{"$f":"IF('[1]Tasa de Falla'!IS105=0,\"\",'[1]Tasa de Falla'!IS105)","v":""},{"$f":"IF('[1]Tasa de Falla'!IT105=0,\"\",'[1]Tasa de Falla'!IT105)","v":""},{"$f":"IF('[1]Tasa de Falla'!IU105=0,\"\",'[1]Tasa de Falla'!IU105)","v":""},{"$f":"IF('[1]Tasa de Falla'!IV105=0,\"\",'[1]Tasa de Falla'!IV105)","v":""},{"$f":"IF('[1]Tasa de Falla'!IW105=0,\"\",'[1]Tasa de Falla'!IW105)","v":""},{"$f":"IF('[1]Tasa de Falla'!IX105=0,\"\",'[1]Tasa de Falla'!IX105)","v":""},{"$f":"IF('[1]Tasa de Falla'!IY105=0,\"\",'[1]Tasa de Falla'!IY105)","v":""},{"$f":"IF('[1]Tasa de Falla'!IZ105=0,\"\",'[1]Tasa de Falla'!IZ105)","v":""}]
[null,null,{"$f":"'[1]Tasa de Falla'!C106","v":89},{"$f":"'[1]Tasa de Falla'!D106","v":"C.H. RIO HONDO - SANTIAGO OESTE"},{"$f":"'[1]Tasa de Falla'!E106","v":132},{"$f":"'[1]Tasa de Falla'!F106","v":69.8},{"$f":"IF('[1]Tasa de Falla'!IO106=0,\"\",'[1]Tasa de Falla'!IO106)","v":""},{"$f":"IF('[1]Tasa de Falla'!IP106=0,\"\",'[1]Tasa de Falla'!IP106)","v":""},{"$f":"IF('[1]Tasa de Falla'!IQ106=0,\"\",'[1]Tasa de Falla'!IQ106)","v":""},{"$f":"IF('[1]Tasa de Falla'!IR106=0,\"\",'[1]Tasa de Falla'!IR106)","v":""},{"$f":"IF('[1]Tasa de Falla'!IS106=0,\"\",'[1]Tasa de Falla'!IS106)","v":1},{"$f":"IF('[1]Tasa de Falla'!IT106=0,\"\",'[1]Tasa de Falla'!IT106)","v":""},{"$f":"IF('[1]Tasa de Falla'!IU106=0,\"\",'[1]Tasa de Falla'!IU106)","v":""},{"$f":"IF('[1]Tasa de Falla'!IV106=0,\"\",'[1]Tasa de Falla'!IV106)","v":""},{"$f":"IF('[1]Tasa de Falla'!IW106=0,\"\",'[1]Tasa de Falla'!IW106)","v":""},{"$f":"IF('[1]Tasa de Falla'!IX106=0,\"\",'[1]Tasa de Falla'!IX106)","v":""},{"$f":"IF('[1]Tasa de Falla'!IY106=0,\"\",'[1]Tasa de Falla'!IY106)","v":""},{"$f":"IF('[1]Tasa de Falla'!IZ106=0,\"\",'[1]Tasa de Falla'!IZ106)","v":""}]
[null,null,{"$f":"'[1]Tasa de Falla'!C107","v":90},{"$f":"'[1]Tasa de Falla'!D107","v":"GÜEMES - MINETTI"},{"$f":"'[1]Tasa de Falla'!E107","v":132},{"$f":"'[1]Tasa de Falla'!F107","v":36.1},{"$f":"IF('[1]Tasa de Falla'!IO107=0,\"\",'[1]Tasa de Falla'!IO107)","v":""},{"$f":"IF('[1]Tasa de Falla'!IP107=0,\"\",'[1]Tasa de Falla'!IP107)","v":""},{"$f":"IF('[1]Tasa de Falla'!IQ107=0,\"\",'[1]Tasa de Falla'!IQ107)","v":""},{"$f":"IF('[1]Tasa de Falla'!IR107=0,\"\",'[1]Tasa de Falla'!IR107)","v":""},{"$f":"IF('[1]Tasa de Falla'!IS107=0,\"\",'[1]Tasa de Falla'!IS107)","v":""},{"$f":"IF('[1]Tasa de Falla'!IT107=0,\"\",'[1]Tasa de Falla'!IT107)","v":""},{"$f":"IF('[1]Tasa de Falla'!IU107=0,\"\",'[1]Tasa de Falla'!IU107)","v":""},{"$f":"IF('[1]Tasa de Falla'!IV107=0,\"\",'[1]Tasa de Falla'!IV107)","v":""},{"$f":"IF('[1]Tasa de Falla'!IW107=0,\"\",'[1]Tasa de Falla'!IW107)","v":2},{"$f":"IF('[1]Tasa de Falla'!IX107=0,\"\",'[1]Tasa de Falla'!IX107)","v":3},{"$f":"IF('[1]Tasa de Falla'!IY107=0,\"\",'[1]Tasa de Falla'!IY107)","v":""},{"$f":"IF('[1]Tasa de Falla'!IZ107=0,\"\",'[1]Tasa de Falla'!IZ107)","v":""}]
[null,null,{"$f":"'[1]Tasa de Falla'!C108","v":91},{"$f":"'[1]Tasa de Falla'!D108","v":"GÜEMES - SALTA NORTE"},{"$f":"'[1]Tasa de Falla'!E108","v":132},{"$f":"'[1]Tasa de Falla'!F108","v":38.97},{"$f":"IF('[1]Tasa de Falla'!IO108=0,\"\",'[1]Tasa de Falla'!IO108)","v":""},{"$f":"IF('[1]Tasa de Falla'!IP108=0,\"\",'[1]Tasa de Falla'!IP108)","v":""},{"$f":"IF('[1]Tasa de Falla'!IQ108=0,\"\",'[1]Tasa de Falla'!IQ108)","v":1},{"$f":"IF('[1]Tasa de Falla'!IR108=0,\"\",'[1]Tasa de Falla'!IR108)","v":""},{"$f":"IF('[1]Tasa de Falla'!IS108=0,\"\",'[1]Tasa de Falla'!IS108)","v":""},{"$f":"IF('[1]Tasa de Falla'!IT108=0,\"\",'[1]Tasa de Falla'!IT108)","v":""},{"$f":"IF('[1]Tasa de Falla'!IU108=0,\"\",'[1]Tasa de Falla'!IU108)","v":""},{"$f":"IF('[1]Tasa de Falla'!IV108=0,\"\",'[1]Tasa de Falla'!IV108)","v":""},{"$f":"IF('[1]Tasa de Falla'!IW108=0,\"\",'[1]Tasa de Falla'!IW108)","v":""},{"$f":"IF('[1]Tasa de Falla'!IX108=0,\"\",'[1]Tasa de Falla'!IX108)","v":""},{"$f":"IF('[1]Tasa de Falla'!IY108=0,\"\",'[1]Tasa de Falla'!IY108)","v":""},{"$f":"IF('[1]Tasa de Falla'!IZ108=0,\"\",'[1]Tasa de Falla'!IZ108)","v":""}]
[null,null,{"$f":"'[1]Tasa de Falla'!C109","v":92},{"$f":"'[1]Tasa de Falla'!D109","v":"BURRUYACU - R. DE LA FRONTERA"},{"$f":"'[1]Tasa de Falla'!E109","v":132},{"$f":"'[1]Tasa de Falla'!F109","v":99.1},{"$f":"IF('[1]Tasa de Falla'!IO109=0,\"\",'[1]Tasa de Falla'!IO109)","v":""},{"$f":"IF('[1]Tasa de Falla'!IP109=0,\"\",'[1]Tasa de Falla'!IP109)","v":""},{"$f":"IF('[1]Tasa de Falla'!IQ109=0,\"\",'[1]Tasa de Falla'!IQ109)","v":""},{"$f":"IF('[1]Tasa de Falla'!IR109=0,\"\",'[1]Tasa de Falla'!IR109)","v":""},{"$f":"IF('[1]Tasa de Falla'!IS109=0,\"\",'[1]Tasa de Falla'!IS109)","v":""},{"$f":"IF('[1]Tasa de Falla'!IT109=0,\"\",'[1]Tasa de Falla'!IT109)","v":""},{"$f":"IF('[1]Tasa de Falla'!IU109=0,\"\",'[1]Tasa de Falla'!IU109)","v":""},{"$f":"IF('[1]Tasa de Falla'!IV109=0,\"\",'[1]Tasa de Falla'!IV109)","v":""},{"$f":"IF('[1]Tasa de Falla'!IW109=0,\"\",'[1]Tasa de Falla'!IW109)","v":""},{"$f":"IF('[1]Tasa de Falla'!IX109=0,\"\",'[1]Tasa de Falla'!IX109)","v":""},{"$f":"IF('[1]Tasa de Falla'!IY109=0,\"\",'[1]Tasa de Falla'!IY109)","v":""},{"$f":"IF('[1]Tasa de Falla'!IZ109=0,\"\",'[1]Tasa de Falla'!IZ109)","v":""}]
[null,null,{"$f":"'[1]Tasa de Falla'!C110","v":93},{"$f":"'[1]Tasa de Falla'!D110","v":"R. DE LA FRONTERA - COBOS"},{"$f":"'[1]Tasa de Falla'!E110","v":132},{"$f":"'[1]Tasa de Falla'!F110","v":130.4},{"$f":"IF('[1]Tasa de Falla'!IO110=0,\"\",'[1]Tasa de Falla'!IO110)","v":""},{"$f":"IF('[1]Tasa de Falla'!IP110=0,\"\",'[1]Tasa de Falla'!IP110)","v":""},{"$f":"IF('[1]Tasa de Falla'!IQ110=0,\"\",'[1]Tasa de Falla'!IQ110)","v":""},{"$f":"IF('[1]Tasa de Falla'!IR110=0,\"\",'[1]Tasa de Falla'!IR110)","v":""},{"$f":"IF('[1]Tasa de Falla'!IS110=0,\"\",'[1]Tasa de Falla'!IS110)","v":""},{"$f":"IF('[1]Tasa de Falla'!IT110=0,\"\",'[1]Tasa de Falla'!IT110)","v":1},{"$f":"IF('[1]Tasa de Falla'!IU110=0,\"\",'[1]Tasa de Falla'!IU110)","v":""},{"$f":"IF('[1]Tasa de Falla'!IV110=0,\"\",'[1]Tasa de Falla'!IV110)","v":""},{"$f":"IF('[1]Tasa de Falla'!IW110=0,\"\",'[1]Tasa de Falla'!IW110)","v":""},{"$f":"IF('[1]Tasa de Falla'!IX110=0,\"\",'[1]Tasa de Falla'!IX110)","v":""},{"$f":"IF('[1]Tasa de Falla'!IY110=0,\"\",'[1]Tasa de Falla'!IY110)","v":""},{"$f":"IF('[1]Tasa de Falla'!IZ110=0,\"\",'[1]Tasa de Falla'!IZ110)","v":""}]
[null,null,{"$f":"'[1]Tasa de Falla'!C111","v":94},{"$f":"'[1]Tasa de Falla'!D111","v":"J.V. GONZALEZ - APOLINARIO SARAVIA"},{"$f":"'[1]Tasa de Falla'!E111","v":132},{"$f":"'[1]Tasa de Falla'!F111","v":94},{"$f":"IF('[1]Tasa de Falla'!IO111=0,\"\",'[1]Tasa de Falla'!IO111)","v":""},{"$f":"IF('[1]Tasa de Falla'!IP111=0,\"\",'[1]Tasa de Falla'!IP111)","v":""},{"$f":"IF('[1]Tasa de Falla'!IQ111=0,\"\",'[1]Tasa de Falla'!IQ111)","v":""},{"$f":"IF('[1]Tasa de Falla'!IR111=0,\"\",'[1]Tasa de Falla'!IR111)","v":""},{"$f":"IF('[1]Tasa de Falla'!IS111=0,\"\",'[1]Tasa de Falla'!IS111)","v":""},{"$f":"IF('[1]Tasa de Falla'!IT111=0,\"\",'[1]Tasa de Falla'!IT111)","v":""},{"$f":"IF('[1]Tasa de Falla'!IU111=0,\"\",'[1]Tasa de Falla'!IU111)","v":""},{"$f":"IF('[1]Tasa de Falla'!IV111=0,\"\",'[1]Tasa de Falla'!IV111)","v":""},{"$f":"IF('[1]Tasa de Falla'!IW111=0,\"\",'[1]Tasa de Falla'!IW111)","v":""},{"$f":"IF('[1]Tasa de Falla'!IX111=0,\"\",'[1]Tasa de Falla'!IX111)","v":""},{"$f":"IF('[1]Tasa de Falla'!IY111=0,\"\",'[1]Tasa de Falla'!IY111)","v":""},{"$f":"IF('[1]Tasa de Falla'!IZ111=0,\"\",'[1]Tasa de Falla'!IZ111)","v":""}]
[null,null,{"$f":"'[1]Tasa de Falla'!C112","v":95},{"$f":"'[1]Tasa de Falla'!D112","v":"ANDALGALA - SAULIL"},{"$f":"'[1]Tasa de Falla'!E112","v":132},{"$f":"'[1]Tasa de Falla'!F112","v":76},{"$f":"IF('[1]Tasa de Falla'!IO112=0,\"\",'[1]Tasa de Falla'!IO112)","v":""},{"$f":"IF('[1]Tasa de Falla'!IP112=0,\"\",'[1]Tasa de Falla'!IP112)","v":""},{"$f":"IF('[1]Tasa de Falla'!IQ112=0,\"\",'[1]Tasa de Falla'!IQ112)","v":1},{"$f":"IF('[1]Tasa de Falla'!IR112=0,\"\",'[1]Tasa de Falla'!IR112)","v":""},{"$f":"IF('[1]Tasa de Falla'!IS112=0,\"\",'[1]Tasa de Falla'!IS112)","v":""},{"$f":"IF('[1]Tasa de Falla'!IT112=0,\"\",'[1]Tasa de Falla'!IT112)","v":""},{"$f":"IF('[1]Tasa de Falla'!IU112=0,\"\",'[1]Tasa de Falla'!IU112)","v":""},{"$f":"IF('[1]Tasa de Falla'!IV112=0,\"\",'[1]Tasa de Falla'!IV112)","v":""},{"$f":"IF('[1]Tasa de Falla'!IW112=0,\"\",'[1]Tasa de Falla'!IW112)","v":""},{"$f":"IF('[1]Tasa de Falla'!IX112=0,\"\",'[1]Tasa de Falla'!IX112)","v":""},{"$f":"IF('[1]Tasa de Falla'!IY112=0,\"\",'[1]Tasa de Falla'!IY112)","v":""},{"$f":"IF('[1]Tasa de Falla'!IZ112=0,\"\",'[1]Tasa de Falla'!IZ112)","v":""}]
[null,null,{"$f":"'[1]Tasa de Falla'!C113","v":96},{"$f":"'[1]Tasa de Falla'!D113","v":"SANTIAGO OESTE - SANT. SUR  - SANT. CENTRO"},{"$f":"'[1]Tasa de Falla'!E113","v":132},{"$f":"'[1]Tasa de Falla'!F113","v":14.6},{"$f":"IF('[1]Tasa de Falla'!IO113=0,\"\",'[1]Tasa de Falla'!IO113)","v":"XXXX"},{"$f":"IF('[1]Tasa de Falla'!IP113=0,\"\",'[1]Tasa de Falla'!IP113)","v":"XXXX"},{"$f":"IF('[1]Tasa de Falla'!IQ113=0,\"\",'[1]Tasa de Falla'!IQ113)","v":"XXXX"},{"$f":"IF('[1]Tasa de Falla'!IR113=0,\"\",'[1]Tasa de Falla'!IR113)","v":"XXXX"},{"$f":"IF('[1]Tasa de Falla'!IS113=0,\"\",'[1]Tasa de Falla'!IS113)","v":"XXXX"},{"$f":"IF('[1]Tasa de Falla'!IT113=0,\"\",'[1]Tasa de Falla'!IT113)","v":"XXXX"},{"$f":"IF('[1]Tasa de Falla'!IU113=0,\"\",'[1]Tasa de Falla'!IU113)","v":"XXXX"},{"$f":"IF('[1]Tasa de Falla'!IV113=0,\"\",'[1]Tasa de Falla'!IV113)","v":"XXXX"},{"$f":"IF('[1]Tasa de Falla'!IW113=0,\"\",'[1]Tasa de Falla'!IW113)","v":"XXXX"},{"$f":"IF('[1]Tasa de Falla'!IX113=0,\"\",'[1]Tasa de Falla'!IX113)","v":"XXXX"},{"$f":"IF('[1]Tasa de Falla'!IY113=0,\"\",'[1]Tasa de Falla'!IY113)","v":"XXXX"},{"$f":"IF('[1]Tasa de Falla'!IZ113=0,\"\",'[1]Tasa de Falla'!IZ113)","v":"XXXX"}]
[null,null,{"$f":"'[1]Tasa de Falla'!C114","v":97},{"$f":"'[1]Tasa de Falla'!D114","v":"SUNCHO CORRAL - QUIMILI"},{"$f":"'[1]Tasa de Falla'!E114","v":132},{"$f":"'[1]Tasa de Falla'!F114","v":108},{"$f":"IF('[1]Tasa de Falla'!IO114=0,\"\",'[1]Tasa de Falla'!IO114)","v":""},{"$f":"IF('[1]Tasa de Falla'!IP114=0,\"\",'[1]Tasa de Falla'!IP114)","v":""},{"$f":"IF('[1]Tasa de Falla'!IQ114=0,\"\",'[1]Tasa de Falla'!IQ114)","v":""},{"$f":"IF('[1]Tasa de Falla'!IR114=0,\"\",'[1]Tasa de Falla'!IR114)","v":""},{"$f":"IF('[1]Tasa de Falla'!IS114=0,\"\",'[1]Tasa de Falla'!IS114)","v":""},{"$f":"IF('[1]Tasa de Falla'!IT114=0,\"\",'[1]Tasa de Falla'!IT114)","v":""},{"$f":"IF('[1]Tasa de Falla'!IU114=0,\"\",'[1]Tasa de Falla'!IU114)","v":""},{"$f":"IF('[1]Tasa de Falla'!IV114=0,\"\",'[1]Tasa de Falla'!IV114)","v":""},{"$f":"IF('[1]Tasa de Falla'!IW114=0,\"\",'[1]Tasa de Falla'!IW114)","v":""},{"$f":"IF('[1]Tasa de Falla'!IX114=0,\"\",'[1]Tasa de Falla'!IX114)","v":""},{"$f":"IF('[1]Tasa de Falla'!IY114=0,\"\",'[1]Tasa de Falla'!IY114)","v":""},{"$f":"IF('[1]Tasa de Falla'!IZ114=0,\"\",'[1]Tasa de Falla'!IZ114)","v":""}]
[null,null,{"$f":"'[1]Tasa de Falla'!C115","v":98},{"$f":"'[1]Tasa de Falla'!D115","v":"EL BRACHO - LA BANDA ESTE"},{"$f":"'[1]Tasa de Falla'!E115","v":132},{"$f":"'[1]Tasa de Falla'!F115","v":140.9},{"$f":"IF('[1]Tasa de Falla'!IO115=0,\"\",'[1]Tasa de Falla'!IO115)","v":""},{"$f":"IF('[1]Tasa de Falla'!IP115=0,\"\",'[1]Tasa de Falla'!IP115)","v":""},{"$f":"IF('[1]Tasa de Falla'!IQ115=0,\"\",'[1]Tasa de Falla'!IQ115)","v":""},{"$f":"IF('[1]Tasa de Falla'!IR115=0,\"\",'[1]Tasa de Falla'!IR115)","v":""},{"$f":"IF('[1]Tasa de Falla'!IS115=0,\"\",'[1]Tasa de Falla'!IS115)","v":""},{"$f":"IF('[1]Tasa de Falla'!IT115=0,\"\",'[1]Tasa de Falla'!IT115)","v":1},{"$f":"IF('[1]Tasa de Falla'!IU115=0,\"\",'[1]Tasa de Falla'!IU115)","v":""},{"$f":"IF('[1]Tasa de Falla'!IV115=0,\"\",'[1]Tasa de Falla'!IV115)","v":1},{"$f":"IF('[1]Tasa de Falla'!IW115=0,\"\",'[1]Tasa de Falla'!IW115)","v":""},{"$f":"IF('[1]Tasa de Falla'!IX115=0,\"\",'[1]Tasa de Falla'!IX115)","v":""},{"$f":"IF('[1]Tasa de Falla'!IY115=0,\"\",'[1]Tasa de Falla'!IY115)","v":""},{"$f":"IF('[1]Tasa de Falla'!IZ115=0,\"\",'[1]Tasa de Falla'!IZ115)","v":""}]
[null,null,{"$f":"'[1]Tasa de Falla'!C116","v":99},{"$f":"'[1]Tasa de Falla'!D116","v":"LA BANDA ESTE - LA BANDA"},{"$f":"'[1]Tasa de Falla'!E116","v":132},{"$f":"'[1]Tasa de Falla'!F116","v":16.2},{"$f":"IF('[1]Tasa de Falla'!IO116=0,\"\",'[1]Tasa de Falla'!IO116)","v":""},{"$f":"IF('[1]Tasa de Falla'!IP116=0,\"\",'[1]Tasa de Falla'!IP116)","v":""},{"$f":"IF('[1]Tasa de Falla'!IQ116=0,\"\",'[1]Tasa de Falla'!IQ116)","v":""},{"$f":"IF('[1]Tasa de Falla'!IR116=0,\"\",'[1]Tasa de Falla'!IR116)","v":""},{"$f":"IF('[1]Tasa de Falla'!IS116=0,\"\",'[1]Tasa de Falla'!IS116)","v":""},{"$f":"IF('[1]Tasa de Falla'!IT116=0,\"\",'[1]Tasa de Falla'!IT116)","v":""},{"$f":"IF('[1]Tasa de Falla'!IU116=0,\"\",'[1]Tasa de Falla'!IU116)","v":""},{"$f":"IF('[1]Tasa de Falla'!IV116=0,\"\",'[1]Tasa de Falla'!IV116)","v":""},{"$f":"IF('[1]Tasa de Falla'!IW116=0,\"\",'[1]Tasa de Falla'!IW116)","v":""},{"$f":"IF('[1]Tasa de Falla'!IX116=0,\"\",'[1]Tasa de Falla'!IX116)","v":""},{"$f":"IF('[1]Tasa de Falla'!IY116=0,\"\",'[1]Tasa de Falla'!IY116)","v":""},{"$f":"IF('[1]Tasa de Falla'!IZ116=0,\"\",'[1]Tasa de Falla'!IZ116)","v":""}]
[null,null,{"$f":"'[1]Tasa de Falla'!C117","v":100},{"$f":"'[1]Tasa de Falla'!D117","v":"TABACAL - PICHANAL"},{"$f":"'[1]Tasa de Falla'!E117","v":132},{"$f":"'[1]Tasa de Falla'!F117","v":7},{"$f":"IF('[1]Tasa de Falla'!IO117=0,\"\",'[1]Tasa de Falla'!IO117)","v":""},{"$f":"IF('[1]Tasa de Falla'!IP117=0,\"\",'[1]Tasa de Falla'!IP117)","v":""},{"$f":"IF('[1]Tasa de Falla'!IQ117=0,\"\",'[1]Tasa de Falla'!IQ117)","v":""},{"$f":"IF('[1]Tasa de Falla'!IR117=0,\"\",'[1]Tasa de Falla'!IR117)","v":""},{"$f":"IF('[1]Tasa de Falla'!IS117=0,\"\",'[1]Tasa de Falla'!IS117)","v":""},{"$f":"IF('[1]Tasa de Falla'!IT117=0,\"\",'[1]Tasa de Falla'!IT117)","v":""},{"$f":"IF('[1]Tasa de Falla'!IU117=0,\"\",'[1]Tasa de Falla'!IU117)","v":""},{"$f":"IF('[1]Tasa de Falla'!IV117=0,\"\",'[1]Tasa de Falla'!IV117)","v":""},{"$f":"IF('[1]Tasa de Falla'!IW117=0,\"\",'[1]Tasa de Falla'!IW117)","v":""},{"$f":"IF('[1]Tasa de Falla'!IX117=0,\"\",'[1]Tasa de Falla'!IX117)","v":""},{"$f":"IF('[1]Tasa de Falla'!IY117=0,\"\",'[1]Tasa de Falla'!IY117)","v":""},{"$f":"IF('[1]Tasa de Falla'!IZ117=0,\"\",'[1]Tasa de Falla'!IZ117)","v":""}]
[null,null,{"$f":"'[1]Tasa de Falla'!C118","v":101},{"$f":"'[1]Tasa de Falla'!D118","v":"ORAN - TABACAL"},{"$f":"'[1]Tasa de Falla'!E118","v":132},{"$f":"'[1]Tasa de Falla'!F118","v":10},{"$f":"IF('[1]Tasa de Falla'!IO118=0,\"\",'[1]Tasa de Falla'!IO118)","v":""},{"$f":"IF('[1]Tasa de Falla'!IP118=0,\"\",'[1]Tasa de Falla'!IP118)","v":""},{"$f":"IF('[1]Tasa de Falla'!IQ118=0,\"\",'[1]Tasa de Falla'!IQ118)","v":""},{"$f":"IF('[1]Tasa de Falla'!IR118=0,\"\",'[1]Tasa de Falla'!IR118)","v":""},{"$f":"IF('[1]Tasa de Falla'!IS118=0,\"\",'[1]Tasa de Falla'!IS118)","v":""},{"$f":"IF('[1]Tasa de Falla'!IT118=0,\"\",'[1]Tasa de Falla'!IT118)","v":""},{"$f":"IF('[1]Tasa de Falla'!IU118=0,\"\",'[1]Tasa de Falla'!IU118)","v":""},{"$f":"IF('[1]Tasa de Falla'!IV118=0,\"\",'[1]Tasa de Falla'!IV118)","v":""},{"$f":"IF('[1]Tasa de Falla'!IW118=0,\"\",'[1]Tasa de Falla'!IW118)","v":""},{"$f":"IF('[1]Tasa de Falla'!IX118=0,\"\",'[1]Tasa de Falla'!IX118)","v":""},{"$f":"IF('[1]Tasa de Falla'!IY118=0,\"\",'[1]Tasa de Falla'!IY118)","v":1},{"$f":"IF('[1]Tasa de Falla'!IZ118=0,\"\",'[1]Tasa de Falla'!IZ118)","v":""}]
[null,null,{"$f":"'[1]Tasa de Falla'!C119","v":102},{"$f":"'[1]Tasa de Falla'!D119","v":"MONTE QUEMADO -COPO - QUIMILI"},{"$f":"'[1]Tasa de Falla'!E119","v":132},{"$f":"'[1]Tasa de Falla'!F119","v":218},{"$f":"IF('[1]Tasa de Falla'!IO119=0,\"\",'[1]Tasa de Falla'!IO119)","v":""},{"$f":"IF('[1]Tasa de Falla'!IP119=0,\"\",'[1]Tasa de Falla'!IP119)","v":""},{"$f":"IF('[1]Tasa de Falla'!IQ119=0,\"\",'[1]Tasa de Falla'!IQ119)","v":""},{"$f":"IF('[1]Tasa de Falla'!IR119=0,\"\",'[1]Tasa de Falla'!IR119)","v":""},{"$f":"IF('[1]Tasa de Falla'!IS119=0,\"\",'[1]Tasa de Falla'!IS119)","v":""},{"$f":"IF('[1]Tasa de Falla'!IT119=0,\"\",'[1]Tasa de Falla'!IT119)","v":1},{"$f":"IF('[1]Tasa de Falla'!IU119=0,\"\",'[1]Tasa de Falla'!IU119)","v":""},{"$f":"IF('[1]Tasa de Falla'!IV119=0,\"\",'[1]Tasa de Falla'!IV119)","v":""},{"$f":"IF('[1]Tasa de Falla'!IW119=0,\"\",'[1]Tasa de Falla'!IW119)","v":""},{"$f":"IF('[1]Tasa de Falla'!IX119=0,\"\",'[1]Tasa de Falla'!IX119)","v":""},{"$f":"IF('[1]Tasa de Falla'!IY119=0,\"\",'[1]Tasa de Falla'!IY119)","v":""},{"$f":"IF('[1]Tasa de Falla'!IZ119=0,\"\",'[1]Tasa de Falla'!IZ119)","v":""}]
[null,null,{"$f":"'[1]Tasa de Falla'!C120","v":103},{"$f":"'[1]Tasa de Falla'!D120","v":"PI. CIRCUNVALACIÓN - LARIOJA N. 1"},{"$f":"'[1]Tasa de Falla'!E120","v":132},{"$f":"'[1]Tasa de Falla'!F120","v":16.649999999999999},{"$f":"IF('[1]Tasa de Falla'!IO120=0,\"\",'[1]Tasa de Falla'!IO120)","v":"XXXX"},{"$f":"IF('[1]Tasa de Falla'!IP120=0,\"\",'[1]Tasa de Falla'!IP120)","v":""},{"$f":"IF('[1]Tasa de Falla'!IQ120=0,\"\",'[1]Tasa de Falla'!IQ120)","v":""},{"$f":"IF('[1]Tasa de Falla'!IR120=0,\"\",'[1]Tasa de Falla'!IR120)","v":""},{"$f":"IF('[1]Tasa de Falla'!IS120=0,\"\",'[1]Tasa de Falla'!IS120)","v":1},{"$f":"IF('[1]Tasa de Falla'!IT120=0,\"\",'[1]Tasa de Falla'!IT120)","v":""},{"$f":"IF('[1]Tasa de Falla'!IU120=0,\"\",'[1]Tasa de Falla'!IU120)","v":""},{"$f":"IF('[1]Tasa de Falla'!IV120=0,\"\",'[1]Tasa de Falla'!IV120)","v":""},{"$f":"IF('[1]Tasa de Falla'!IW120=0,\"\",'[1]Tasa de Falla'!IW120)","v":""},{"$f":"IF('[1]Tasa de Falla'!IX120=0,\"\",'[1]Tasa de Falla'!IX120)","v":""},{"$f":"IF('[1]Tasa de Falla'!IY120=0,\"\",'[1]Tasa de Falla'!IY120)","v":""},{"$f":"IF('[1]Tasa de Falla'!IZ120=0,\"\",'[1]Tasa de Falla'!IZ120)","v":""}]
[null,null,{"$f":"'[1]Tasa de Falla'!C121","v":104},{"$f":"'[1]Tasa de Falla'!D121","v":"PATQUIA NONOGASTA 132 1"},{"$f":"'[1]Tasa de Falla'!E121","v":132},{"$f":"'[1]Tasa de Falla'!F121","v":108.3},{"$f":"IF('[1]Tasa de Falla'!IO121=0,\"\",'[1]Tasa de Falla'!IO121)","v":"XXXX"},{"$f":"IF('[1]Tasa de Falla'!IP121=0,\"\",'[1]Tasa de Falla'!IP121)","v":""},{"$f":"IF('[1]Tasa de Falla'!IQ121=0,\"\",'[1]Tasa de Falla'!IQ121)","v":""},{"$f":"IF('[1]Tasa de Falla'!IR121=0,\"\",'[1]Tasa de Falla'!IR121)","v":""},{"$f":"IF('[1]Tasa de Falla'!IS121=0,\"\",'[1]Tasa de Falla'!IS121)","v":""},{"$f":"IF('[1]Tasa de Falla'!IT121=0,\"\",'[1]Tasa de Falla'!IT121)","v":""},{"$f":"IF('[1]Tasa de Falla'!IU121=0,\"\",'[1]Tasa de Falla'!IU121)","v":""},{"$f":"IF('[1]Tasa de Falla'!IV121=0,\"\",'[1]Tasa de Falla'!IV121)","v":""},{"$f":"IF('[1]Tasa de Falla'!IW121=0,\"\",'[1]Tasa de Falla'!IW121)","v":""},{"$f":"IF('[1]Tasa de Falla'!IX121=0,\"\",'[1]Tasa de Falla'!IX121)","v":""},{"$f":"IF('[1]Tasa de Falla'!IY121=0,\"\",'[1]Tasa de Falla'!IY121)","v":""},{"$f":"IF('[1]Tasa de Falla'!IZ121=0,\"\",'[1]Tasa de Falla'!IZ121)","v":""}]
[null,null,{"$f":"'[1]Tasa de Falla'!C122","v":105},{"$f":"'[1]Tasa de Falla'!D122","v":"NONOGASTA - VILLA UNION 132 1"},{"$f":"'[1]Tasa de Falla'!E122","v":132},{"$f":"'[1]Tasa de Falla'!F122","v":82.1},{"$f":"IF('[1]Tasa de Falla'!IO122=0,\"\",'[1]Tasa de Falla'!IO122)","v":"XXXX"},{"$f":"IF('[1]Tasa de Falla'!IP122=0,\"\",'[1]Tasa de Falla'!IP122)","v":""},{"$f":"IF('[1]Tasa de Falla'!IQ122=0,\"\",'[1]Tasa de Falla'!IQ122)","v":""},{"$f":"IF('[1]Tasa de Falla'!IR122=0,\"\",'[1]Tasa de Falla'!IR122)","v":""},{"$f":"IF('[1]Tasa de Falla'!IS122=0,\"\",'[1]Tasa de Falla'!IS122)","v":""},{"$f":"IF('[1]Tasa de Falla'!IT122=0,\"\",'[1]Tasa de Falla'!IT122)","v":""},{"$f":"IF('[1]Tasa de Falla'!IU122=0,\"\",'[1]Tasa de Falla'!IU122)","v":""},{"$f":"IF('[1]Tasa de Falla'!IV122=0,\"\",'[1]Tasa de Falla'!IV122)","v":""},{"$f":"IF('[1]Tasa de Falla'!IW122=0,\"\",'[1]Tasa de Falla'!IW122)","v":""},{"$f":"IF('[1]Tasa de Falla'!IX122=0,\"\",'[1]Tasa de Falla'!IX122)","v":""},{"$f":"IF('[1]Tasa de Falla'!IY122=0,\"\",'[1]Tasa de Falla'!IY122)","v":""},{"$f":"IF('[1]Tasa de Falla'!IZ122=0,\"\",'[1]Tasa de Falla'!IZ122)","v":""}]
[null,null,{"$f":"'[1]Tasa de Falla'!C123","v":106},{"$f":"'[1]Tasa de Falla'!D123","v":"ARAUCO - AIMOGASTA 132 1"},{"$f":"'[1]Tasa de Falla'!E123","v":132},{"$f":"'[1]Tasa de Falla'!F123","v":20},{"$f":"IF('[1]Tasa de Falla'!IO123=0,\"\",'[1]Tasa de Falla'!IO123)","v":"XXXX"},{"$f":"IF('[1]Tasa de Falla'!IP123=0,\"\",'[1]Tasa de Falla'!IP123)","v":""},{"$f":"IF('[1]Tasa de Falla'!IQ123=0,\"\",'[1]Tasa de Falla'!IQ123)","v":""},{"$f":"IF('[1]Tasa de Falla'!IR123=0,\"\",'[1]Tasa de Falla'!IR123)","v":""},{"$f":"IF('[1]Tasa de Falla'!IS123=0,\"\",'[1]Tasa de Falla'!IS123)","v":""},{"$f":"IF('[1]Tasa de Falla'!IT123=0,\"\",'[1]Tasa de Falla'!IT123)","v":""},{"$f":"IF('[1]Tasa de Falla'!IU123=0,\"\",'[1]Tasa de Falla'!IU123)","v":""},{"$f":"IF('[1]Tasa de Falla'!IV123=0,\"\",'[1]Tasa de Falla'!IV123)","v":""},{"$f":"IF('[1]Tasa de Falla'!IW123=0,\"\",'[1]Tasa de Falla'!IW123)","v":""},{"$f":"IF('[1]Tasa de Falla'!IX123=0,\"\",'[1]Tasa de Falla'!IX123)","v":""},{"$f":"IF('[1]Tasa de Falla'!IY123=0,\"\",'[1]Tasa de Falla'!IY123)","v":""},{"$f":"IF('[1]Tasa de Falla'!IZ123=0,\"\",'[1]Tasa de Falla'!IZ123)","v":""}]
[null,null,{"$f":"'[1]Tasa de Falla'!C124","v":107},{"$f":"'[1]Tasa de Falla'!D124","v":"PATQUIA - CHAMICAL 132 1"},{"$f":"'[1]Tasa de Falla'!E124","v":132},{"$f":"'[1]Tasa de Falla'!F124","v":67.400000000000006},{"$f":"IF('[1]Tasa de Falla'!IO124=0,\"\",'[1]Tasa de Falla'!IO124)","v":"XXXX"},{"$f":"IF('[1]Tasa de Falla'!IP124=0,\"\",'[1]Tasa de Falla'!IP124)","v":1},{"$f":"IF('[1]Tasa de Falla'!IQ124=0,\"\",'[1]Tasa de Falla'!IQ124)","v":""},{"$f":"IF('[1]Tasa de Falla'!IR124=0,\"\",'[1]Tasa de Falla'!IR124)","v":""},{"$f":"IF('[1]Tasa de Falla'!IS124=0,\"\",'[1]Tasa de Falla'!IS124)","v":""},{"$f":"IF('[1]Tasa de Falla'!IT124=0,\"\",'[1]Tasa de Falla'!IT124)","v":""},{"$f":"IF('[1]Tasa de Falla'!IU124=0,\"\",'[1]Tasa de Falla'!IU124)","v":""},{"$f":"IF('[1]Tasa de Falla'!IV124=0,\"\",'[1]Tasa de Falla'!IV124)","v":""},{"$f":"IF('[1]Tasa de Falla'!IW124=0,\"\",'[1]Tasa de Falla'!IW124)","v":""},{"$f":"IF('[1]Tasa de Falla'!IX124=0,\"\",'[1]Tasa de Falla'!IX124)","v":""},{"$f":"IF('[1]Tasa de Falla'!IY124=0,\"\",'[1]Tasa de Falla'!IY124)","v":""},{"$f":"IF('[1]Tasa de Falla'!IZ124=0,\"\",'[1]Tasa de Falla'!IZ124)","v":""}]
[null,null,{"$f":"'[1]Tasa de Falla'!C125","v":108},{"$f":"'[1]Tasa de Falla'!D125","v":"LA RIOJA - ARAUCO 132 1"},{"$f":"'[1]Tasa de Falla'!E125","v":132},{"$f":"'[1]Tasa de Falla'!F125","v":84.3},{"$f":"IF('[1]Tasa de Falla'!IO125=0,\"\",'[1]Tasa de Falla'!IO125)","v":"XXXX"},{"$f":"IF('[1]Tasa de Falla'!IP125=0,\"\",'[1]Tasa de Falla'!IP125)","v":""},{"$f":"IF('[1]Tasa de Falla'!IQ125=0,\"\",'[1]Tasa de Falla'!IQ125)","v":""},{"$f":"IF('[1]Tasa de Falla'!IR125=0,\"\",'[1]Tasa de Falla'!IR125)","v":""},{"$f":"IF('[1]Tasa de Falla'!IS125=0,\"\",'[1]Tasa de Falla'!IS125)","v":""},{"$f":"IF('[1]Tasa de Falla'!IT125=0,\"\",'[1]Tasa de Falla'!IT125)","v":""},{"$f":"IF('[1]Tasa de Falla'!IU125=0,\"\",'[1]Tasa de Falla'!IU125)","v":""},{"$f":"IF('[1]Tasa de Falla'!IV125=0,\"\",'[1]Tasa de Falla'!IV125)","v":""},{"$f":"IF('[1]Tasa de Falla'!IW125=0,\"\",'[1]Tasa de Falla'!IW125)","v":1},{"$f":"IF('[1]Tasa de Falla'!IX125=0,\"\",'[1]Tasa de Falla'!IX125)","v":""},{"$f":"IF('[1]Tasa de Falla'!IY125=0,\"\",'[1]Tasa de Falla'!IY125)","v":""},{"$f":"IF('[1]Tasa de Falla'!IZ125=0,\"\",'[1]Tasa de Falla'!IZ125)","v":""}]
[null,null,{"$f":"'[1]Tasa de Falla'!C126","v":109},{"$f":"'[1]Tasa de Falla'!D126","v":"PI PATQUIA - PATQUIA 132 1"},{"$f":"'[1]Tasa de Falla'!E126","v":132},{"$f":"'[1]Tasa de Falla'!F126","v":58.65},{"$f":"IF('[1]Tasa de Falla'!IO126=0,\"\",'[1]Tasa de Falla'!IO126)","v":"XXXX"},{"$f":"IF('[1]Tasa de Falla'!IP126=0,\"\",'[1]Tasa de Falla'!IP126)","v":""},{"$f":"IF('[1]Tasa de Falla'!IQ126=0,\"\",'[1]Tasa de Falla'!IQ126)","v":""},{"$f":"IF('[1]Tasa de Falla'!IR126=0,\"\",'[1]Tasa de Falla'!IR126)","v":""},{"$f":"IF('[1]Tasa de Falla'!IS126=0,\"\",'[1]Tasa de Falla'!IS126)","v":""},{"$f":"IF('[1]Tasa de Falla'!IT126=0,\"\",'[1]Tasa de Falla'!IT126)","v":""},{"$f":"IF('[1]Tasa de Falla'!IU126=0,\"\",'[1]Tasa de Falla'!IU126)","v":""},{"$f":"IF('[1]Tasa de Falla'!IV126=0,\"\",'[1]Tasa de Falla'!IV126)","v":""},{"$f":"IF('[1]Tasa de Falla'!IW126=0,\"\",'[1]Tasa de Falla'!IW126)","v":""},{"$f":"IF('[1]Tasa de Falla'!IX126=0,\"\",'[1]Tasa de Falla'!IX126)","v":""},{"$f":"IF('[1]Tasa de Falla'!IY126=0,\"\",'[1]Tasa de Falla'!IY126)","v":""},{"$f":"IF('[1]Tasa de Falla'!IZ126=0,\"\",'[1]Tasa de Falla'!IZ126)","v":""}]
[null,null,{"$f":"'[1]Tasa de Falla'!C127","v":110},{"$f":"'[1]Tasa de Falla'!D127","v":"RIO HONDO - TERMAS NORTE"},{"$f":"'[1]Tasa de Falla'!E127","v":132},{"$f":"'[1]Tasa de Falla'!F127","v":5.8},{"$f":"IF('[1]Tasa de Falla'!IO127=0,\"\",'[1]Tasa de Falla'!IO127)","v":"XXXX"},{"$f":"IF('[1]Tasa de Falla'!IP127=0,\"\",'[1]Tasa de Falla'!IP127)","v":"XXXX"},{"$f":"IF('[1]Tasa de Falla'!IQ127=0,\"\",'[1]Tasa de Falla'!IQ127)","v":"XXXX"},{"$f":"IF('[1]Tasa de Falla'!IR127=0,\"\",'[1]Tasa de Falla'!IR127)","v":"XXXX"},{"$f":"IF('[1]Tasa de Falla'!IS127=0,\"\",'[1]Tasa de Falla'!IS127)","v":""},{"$f":"IF('[1]Tasa de Falla'!IT127=0,\"\",'[1]Tasa de Falla'!IT127)","v":""},{"$f":"IF('[1]Tasa de Falla'!IU127=0,\"\",'[1]Tasa de Falla'!IU127)","v":""},{"$f":"IF('[1]Tasa de Falla'!IV127=0,\"\",'[1]Tasa de Falla'!IV127)","v":""},{"$f":"IF('[1]Tasa de Falla'!IW127=0,\"\",'[1]Tasa de Falla'!IW127)","v":""},{"$f":"IF('[1]Tasa de Falla'!IX127=0,\"\",'[1]Tasa de Falla'!IX127)","v":""},{"$f":"IF('[1]Tasa de Falla'!IY127=0,\"\",'[1]Tasa de Falla'!IY127)","v":""},{"$f":"IF('[1]Tasa de Falla'!IZ127=0,\"\",'[1]Tasa de Falla'!IZ127)","v":""}]
[null,null,{"$f":"'[1]Tasa de Falla'!C128","v":111},{"$f":"'[1]Tasa de Falla'!D128","v":"EL BRACHO - TETRMAS NORTE"},{"$f":"'[1]Tasa de Falla'!E128","v":132},{"$f":"'[1]Tasa de Falla'!F128","v":78.400000000000006},{"$f":"IF('[1]Tasa de Falla'!IO128=0,\"\",'[1]Tasa de Falla'!IO128)","v":"XXXX"},{"$f":"IF('[1]Tasa de Falla'!IP128=0,\"\",'[1]Tasa de Falla'!IP128)","v":"XXXX"},{"$f":"IF('[1]Tasa de Falla'!IQ128=0,\"\",'[1]Tasa de Falla'!IQ128)","v":"XXXX"},{"$f":"IF('[1]Tasa de Falla'!IR128=0,\"\",'[1]Tasa de Falla'!IR128)","v":"XXXX"},{"$f":"IF('[1]Tasa de Falla'!IS128=0,\"\",'[1]Tasa de Falla'!IS128)","v":""},{"$f":"IF('[1]Tasa de Falla'!IT128=0,\"\",'[1]Tasa de Falla'!IT128)","v":""},{"$f":"IF('[1]Tasa de Falla'!IU128=0,\"\",'[1]Tasa de Falla'!IU128)","v":""},{"$f":"IF('[1]Tasa de Falla'!IV128=0,\"\",'[1]Tasa de Falla'!IV128)","v":""},{"$f":"IF('[1]Tasa de Falla'!IW128=0,\"\",'[1]Tasa de Falla'!IW128)","v":""},{"$f":"IF('[1]Tasa de Falla'!IX128=0,\"\",'[1]Tasa de Falla'!IX128)","v":""},{"$f":"IF('[1]Tasa de Falla'!IY128=0,\"\",'[1]Tasa de Falla'!IY128)","v":""},{"$f":"IF('[1]Tasa de Falla'!IZ128=0,\"\",'[1]Tasa de Falla'!IZ128)","v":1}]
[null,null,{"$f":"'[1]Tasa de Falla'!C129","v":112},{"$f":"'[1]Tasa de Falla'!D129","v":"PI 150 NORTE - LA RIOJA ESTE"},{"$f":"'[1]Tasa de Falla'!E129","v":132},{"$f":"'[1]Tasa de Falla'!F129","v":4},{"$f":"IF('[1]Tasa de Falla'!IO129=0,\"\",'[1]Tasa de Falla'!IO129)","v":"XXXX"},{"$f":"IF('[1]Tasa de Falla'!IP129=0,\"\",'[1]Tasa de Falla'!IP129)","v":"XXXX"},{"$f":"IF('[1]Tasa de Falla'!IQ129=0,\"\",'[1]Tasa de Falla'!IQ129)","v":"XXXX"},{"$f":"IF('[1]Tasa de Falla'!IR129=0,\"\",'[1]Tasa de Falla'!IR129)","v":"XXXX"},{"$f":"IF('[1]Tasa de Falla'!IS129=0,\"\",'[1]Tasa de Falla'!IS129)","v":""},{"$f":"IF('[1]Tasa de Falla'!IT129=0,\"\",'[1]Tasa de Falla'!IT129)","v":""},{"$f":"IF('[1]Tasa de Falla'!IU129=0,\"\",'[1]Tasa de Falla'!IU129)","v":""},{"$f":"IF('[1]Tasa de Falla'!IV129=0,\"\",'[1]Tasa de Falla'!IV129)","v":""},{"$f":"IF('[1]Tasa de Falla'!IW129=0,\"\",'[1]Tasa de Falla'!IW129)","v":""},{"$f":"IF('[1]Tasa de Falla'!IX129=0,\"\",'[1]Tasa de Falla'!IX129)","v":""},{"$f":"IF('[1]Tasa de Falla'!IY129=0,\"\",'[1]Tasa de Falla'!IY129)","v":""},{"$f":"IF('[1]Tasa de Falla'!IZ129=0,\"\",'[1]Tasa de Falla'!IZ129)","v":""}]
[null,null,{"$f":"'[1]Tasa de Falla'!C130","v":113},{"$f":"'[1]Tasa de Falla'!D130","v":"PI 150 SUR - LA RIOJA ESTE"},{"$f":"'[1]Tasa de Falla'!E130","v":132},{"$f":"'[1]Tasa de Falla'!F130","v":4},{"$f":"IF('[1]Tasa de Falla'!IO130=0,\"\",'[1]Tasa de Falla'!IO130)","v":"XXXX"},{"$f":"IF('[1]Tasa de Falla'!IP130=0,\"\",'[1]Tasa de Falla'!IP130)","v":"XXXX"},{"$f":"IF('[1]Tasa de Falla'!IQ130=0,\"\",'[1]Tasa de Falla'!IQ130)","v":"XXXX"},{"$f":"IF('[1]Tasa de Falla'!IR130=0,\"\",'[1]Tasa de Falla'!IR130)","v":"XXXX"},{"$f":"IF('[1]Tasa de Falla'!IS130=0,\"\",'[1]Tasa de Falla'!IS130)","v":""},{"$f":"IF('[1]Tasa de Falla'!IT130=0,\"\",'[1]Tasa de Falla'!IT130)","v":""},{"$f":"IF('[1]Tasa de Falla'!IU130=0,\"\",'[1]Tasa de Falla'!IU130)","v":""},{"$f":"IF('[1]Tasa de Falla'!IV130=0,\"\",'[1]Tasa de Falla'!IV130)","v":""},{"$f":"IF('[1]Tasa de Falla'!IW130=0,\"\",'[1]Tasa de Falla'!IW130)","v":""},{"$f":"IF('[1]Tasa de Falla'!IX130=0,\"\",'[1]Tasa de Falla'!IX130)","v":""},{"$f":"IF('[1]Tasa de Falla'!IY130=0,\"\",'[1]Tasa de Falla'!IY130)","v":""},{"$f":"IF('[1]Tasa de Falla'!IZ130=0,\"\",'[1]Tasa de Falla'!IZ130)","v":""}]
[null,null,{"$f":"'[1]Tasa de Falla'!C131","v":114},{"$f":"'[1]Tasa de Falla'!D131","v":"QUIMILI - CAMPO GALLO 132 1"},{"$f":"'[1]Tasa de Falla'!E131","v":132},{"$f":"'[1]Tasa de Falla'!F131","v":140},{"$f":"IF('[1]Tasa de Falla'!IO131=0,\"\",'[1]Tasa de Falla'!IO131)","v":"XXXX"},{"$f":"IF('[1]Tasa de Falla'!IP131=0,\"\",'[1]Tasa de Falla'!IP131)","v":"XXXX"},{"$f":"IF('[1]Tasa de Falla'!IQ131=0,\"\",'[1]Tasa de Falla'!IQ131)","v":"XXXX"},{"$f":"IF('[1]Tasa de Falla'!IR131=0,\"\",'[1]Tasa de Falla'!IR131)","v":"XXXX"},{"$f":"IF('[1]Tasa de Falla'!IS131=0,\"\",'[1]Tasa de Falla'!IS131)","v":"XXXX"},{"$f":"IF('[1]Tasa de Falla'!IT131=0,\"\",'[1]Tasa de Falla'!IT131)","v":""},{"$f":"IF('[1]Tasa de Falla'!IU131=0,\"\",'[1]Tasa de Falla'!IU131)","v":""},{"$f":"IF('[1]Tasa de Falla'!IV131=0,\"\",'[1]Tasa de Falla'!IV131)","v":""},{"$f":"IF('[1]Tasa de Falla'!IW131=0,\"\",'[1]Tasa de Falla'!IW131)","v":""},{"$f":"IF('[1]Tasa de Falla'!IX131=0,\"\",'[1]Tasa de Falla'!IX131)","v":""},{"$f":"IF('[1]Tasa de Falla'!IY131=0,\"\",'[1]Tasa de Falla'!IY131)","v":""},{"$f":"IF('[1]Tasa de Falla'!IZ131=0,\"\",'[1]Tasa de Falla'!IZ131)","v":""}]
[null,null,{"$f":"'[1]Tasa de Falla'!C132","v":115},{"$f":"'[1]Tasa de Falla'!D132","v":"CAMPO GALLO - COPO 132 1"},{"$f":"'[1]Tasa de Falla'!E132","v":132},{"$f":"'[1]Tasa de Falla'!F132","v":90},{"$f":"IF('[1]Tasa de Falla'!IO132=0,\"\",'[1]Tasa de Falla'!IO132)","v":"XXXX"},{"$f":"IF('[1]Tasa de Falla'!IP132=0,\"\",'[1]Tasa de Falla'!IP132)","v":"XXXX"},{"$f":"IF('[1]Tasa de Falla'!IQ132=0,\"\",'[1]Tasa de Falla'!IQ132)","v":"XXXX"},{"$f":"IF('[1]Tasa de Falla'!IR132=0,\"\",'[1]Tasa de Falla'!IR132)","v":"XXXX"},{"$f":"IF('[1]Tasa de Falla'!IS132=0,\"\",'[1]Tasa de Falla'!IS132)","v":"XXXX"},{"$f":"IF('[1]Tasa de Falla'!IT132=0,\"\",'[1]Tasa de Falla'!IT132)","v":""},{"$f":"IF('[1]Tasa de Falla'!IU132=0,\"\",'[1]Tasa de Falla'!IU132)","v":""},{"$f":"IF('[1]Tasa de Falla'!IV132=0,\"\",'[1]Tasa de Falla'!IV132)","v":""},{"$f":"IF('[1]Tasa de Falla'!IW132=0,\"\",'[1]Tasa de Falla'!IW132)","v":""},{"$f":"IF('[1]Tasa de Falla'!IX132=0,\"\",'[1]Tasa de Falla'!IX132)","v":""},{"$f":"IF('[1]Tasa de Falla'!IY132=0,\"\",'[1]Tasa de Falla'!IY132)","v":""},{"$f":"IF('[1]Tasa de Falla'!IZ132=0,\"\",'[1]Tasa de Falla'!IZ132)","v":""}]
[null,null,{"$f":"'[1]Tasa de Falla'!C133","v":116},{"$f":"'[1]Tasa de Falla'!D133","v":"PICHANAL - SENDA HACHADA 132 1"},{"$f":"'[1]Tasa de Falla'!E133","v":132},{"$f":"'[1]Tasa de Falla'!F133","v":46.5},{"$f":"IF('[1]Tasa de Falla'!IO133=0,\"\",'[1]Tasa de Falla'!IO133)","v":"XXXX"},{"$f":"IF('[1]Tasa de Falla'!IP133=0,\"\",'[1]Tasa de Falla'!IP133)","v":"XXXX"},{"$f":"IF('[1]Tasa de Falla'!IQ133=0,\"\",'[1]Tasa de Falla'!IQ133)","v":"XXXX"},{"$f":"IF('[1]Tasa de Falla'!IR133=0,\"\",'[1]Tasa de Falla'!IR133)","v":"XXXX"},{"$f":"IF('[1]Tasa de Falla'!IS133=0,\"\",'[1]Tasa de Falla'!IS133)","v":"XXXX"},{"$f":"IF('[1]Tasa de Falla'!IT133=0,\"\",'[1]Tasa de Falla'!IT133)","v":"XXXX"},{"$f":"IF('[1]Tasa de Falla'!IU133=0,\"\",'[1]Tasa de Falla'!IU133)","v":"XXXX"},{"$f":"IF('[1]Tasa de Falla'!IV133=0,\"\",'[1]Tasa de Falla'!IV133)","v":""},{"$f":"IF('[1]Tasa de Falla'!IW133=0,\"\",'[1]Tasa de Falla'!IW133)","v":""},{"$f":"IF('[1]Tasa de Falla'!IX133=0,\"\",'[1]Tasa de Falla'!IX133)","v":""},{"$f":"IF('[1]Tasa de Falla'!IY133=0,\"\",'[1]Tasa de Falla'!IY133)","v":""},{"$f":"IF('[1]Tasa de Falla'!IZ133=0,\"\",'[1]Tasa de Falla'!IZ133)","v":""}]
[null,null,{"$f":"'[1]Tasa de Falla'!C134","v":117},{"$f":"'[1]Tasa de Falla'!D134","v":"SENDA HACHADA - TARTAGAL 132 1"},{"$f":"'[1]Tasa de Falla'!E134","v":132},{"$f":"'[1]Tasa de Falla'!F134","v":58.5},{"$f":"IF('[1]Tasa de Falla'!IO134=0,\"\",'[1]Tasa de Falla'!IO134)","v":"XXXX"},{"$f":"IF('[1]Tasa de Falla'!IP134=0,\"\",'[1]Tasa de Falla'!IP134)","v":"XXXX"},{"$f":"IF('[1]Tasa de Falla'!IQ134=0,\"\",'[1]Tasa de Falla'!IQ134)","v":"XXXX"},{"$f":"IF('[1]Tasa de Falla'!IR134=0,\"\",'[1]Tasa de Falla'!IR134)","v":"XXXX"},{"$f":"IF('[1]Tasa de Falla'!IS134=0,\"\",'[1]Tasa de Falla'!IS134)","v":"XXXX"},{"$f":"IF('[1]Tasa de Falla'!IT134=0,\"\",'[1]Tasa de Falla'!IT134)","v":"XXXX"},{"$f":"IF('[1]Tasa de Falla'!IU134=0,\"\",'[1]Tasa de Falla'!IU134)","v":"XXXX"},{"$f":"IF('[1]Tasa de Falla'!IV134=0,\"\",'[1]Tasa de Falla'!IV134)","v":""},{"$f":"IF('[1]Tasa de Falla'!IW134=0,\"\",'[1]Tasa de Falla'!IW134)","v":""},{"$f":"IF('[1]Tasa de Falla'!IX134=0,\"\",'[1]Tasa de Falla'!IX134)","v":""},{"$f":"IF('[1]Tasa de Falla'!IY134=0,\"\",'[1]Tasa de Falla'!IY134)","v":""},{"$f":"IF('[1]Tasa de Falla'!IZ134=0,\"\",'[1]Tasa de Falla'!IZ134)","v":""}]
[null,null,{"$f":"'[1]Tasa de Falla'!C135","v":118},{"$f":"'[1]Tasa de Falla'!D135","v":"ESTATICA - INDEPENDENCIA.TUC. 132 2"},{"$f":"'[1]Tasa de Falla'!E135","v":132},{"$f":"'[1]Tasa de Falla'!F135","v":3.1},{"$f":"IF('[1]Tasa de Falla'!IO135=0,\"\",'[1]Tasa de Falla'!IO135)","v":"XXXX"},{"$f":"IF('[1]Tasa de Falla'!IP135=0,\"\",'[1]Tasa de Falla'!IP135)","v":"XXXX"},{"$f":"IF('[1]Tasa de Falla'!IQ135=0,\"\",'[1]Tasa de Falla'!IQ135)","v":"XXXX"},{"$f":"IF('[1]Tasa de Falla'!IR135=0,\"\",'[1]Tasa de Falla'!IR135)","v":"XXXX"},{"$f":"IF('[1]Tasa de Falla'!IS135=0,\"\",'[1]Tasa de Falla'!IS135)","v":"XXXX"},{"$f":"IF('[1]Tasa de Falla'!IT135=0,\"\",'[1]Tasa de Falla'!IT135)","v":"XXXX"},{"$f":"IF('[1]Tasa de Falla'!IU135=0,\"\",'[1]Tasa de Falla'!IU135)","v":"XXXX"},{"$f":"IF('[1]Tasa de Falla'!IV135=0,\"\",'[1]Tasa de Falla'!IV135)","v":"XXXX"},{"$f":"IF('[1]Tasa de Falla'!IW135=0,\"\",'[1]Tasa de Falla'!IW135)","v":"XXXX"},{"$f":"IF('[1]Tasa de Falla'!IX135=0,\"\",'[1]Tasa de Falla'!IX135)","v":""},{"$f":"IF('[1]Tasa de Falla'!IY135=0,\"\",'[1]Tasa de Falla'!IY135)","v":""},{"$f":"IF('[1]Tasa de Falla'!IZ135=0,\"\",'[1]Tasa de Falla'!IZ135)","v":1}]
[null,null,{"$f":"'[1]Tasa de Falla'!C136","v":119},{"$f":"'[1]Tasa de Falla'!D136","v":"SENDA HACHADA - DRAGONES 132 1"},{"$f":"'[1]Tasa de Falla'!E136","v":132},{"$f":"'[1]Tasa de Falla'!F136","v":65},{"$f":"IF('[1]Tasa de Falla'!IO136=0,\"\",'[1]Tasa de Falla'!IO136)","v":"XXXX"},{"$f":"IF('[1]Tasa de Falla'!IP136=0,\"\",'[1]Tasa de Falla'!IP136)","v":"XXXX"},{"$f":"IF('[1]Tasa de Falla'!IQ136=0,\"\",'[1]Tasa de Falla'!IQ136)","v":"XXXX"},{"$f":"IF('[1]Tasa de Falla'!IR136=0,\"\",'[1]Tasa de Falla'!IR136)","v":"XXXX"},{"$f":"IF('[1]Tasa de Falla'!IS136=0,\"\",'[1]Tasa de Falla'!IS136)","v":"XXXX"},{"$f":"IF('[1]Tasa de Falla'!IT136=0,\"\",'[1]Tasa de Falla'!IT136)","v":"XXXX"},{"$f":"IF('[1]Tasa de Falla'!IU136=0,\"\",'[1]Tasa de Falla'!IU136)","v":"XXXX"},{"$f":"IF('[1]Tasa de Falla'!IV136=0,\"\",'[1]Tasa de Falla'!IV136)","v":"XXXX"},{"$f":"IF('[1]Tasa de Falla'!IW136=0,\"\",'[1]Tasa de Falla'!IW136)","v":"XXXX"},{"$f":"IF('[1]Tasa de Falla'!IX136=0,\"\",'[1]Tasa de Falla'!IX136)","v":"XXXX"},{"$f":"IF('[1]Tasa de Falla'!IY136=0,\"\",'[1]Tasa de Falla'!IY136)","v":"XXXX"},{"$f":"IF('[1]Tasa de Falla'!IZ136=0,\"\",'[1]Tasa de Falla'!IZ136)","v":"XXXX"}]
[null,null,{"$f":"'[1]Tasa de Falla'!C137","v":120},{"$f":"'[1]Tasa de Falla'!D137","v":"COBOS - SALTA ESTE 132 1"},{"$f":"'[1]Tasa de Falla'!E137","v":132},{"$f":"'[1]Tasa de Falla'!F137","v":45.6},{"$f":"IF('[1]Tasa de Falla'!IO137=0,\"\",'[1]Tasa de Falla'!IO137)","v":"XXXX"},{"$f":"IF('[1]Tasa de Falla'!IP137=0,\"\",'[1]Tasa de Falla'!IP137)","v":"XXXX"},{"$f":"IF('[1]Tasa de Falla'!IQ137=0,\"\",'[1]Tasa de Falla'!IQ137)","v":"XXXX"},{"$f":"IF('[1]Tasa de Falla'!IR137=0,\"\",'[1]Tasa de Falla'!IR137)","v":"XXXX"},{"$f":"IF('[1]Tasa de Falla'!IS137=0,\"\",'[1]Tasa de Falla'!IS137)","v":"XXXX"},{"$f":"IF('[1]Tasa de Falla'!IT137=0,\"\",'[1]Tasa de Falla'!IT137)","v":"XXXX"},{"$f":"IF('[1]Tasa de Falla'!IU137=0,\"\",'[1]Tasa de Falla'!IU137)","v":"XXXX"},{"$f":"IF('[1]Tasa de Falla'!IV137=0,\"\",'[1]Tasa de Falla'!IV137)","v":"XXXX"},{"$f":"IF('[1]Tasa de Falla'!IW137=0,\"\",'[1]Tasa de Falla'!IW137)","v":"XXXX"},{"$f":"IF('[1]Tasa de Falla'!IX137=0,\"\",'[1]Tasa de Falla'!IX137)","v":""},{"$f":"IF('[1]Tasa de Falla'!IY137=0,\"\",'[1]Tasa de Falla'!IY137)","v":1},{"$f":"IF('[1]Tasa de Falla'!IZ137=0,\"\",'[1]Tasa de Falla'!IZ137)","v":""}]
[null,null,{"$f":"'[1]Tasa de Falla'!C138","v":121},{"$f":"'[1]Tasa de Falla'!D138","v":"SANTIAGO - SANTIAGO SUR "},{"$f":"'[1]Tasa de Falla'!E138","v":132},{"$f":"'[1]Tasa de Falla'!F138","v":8.4},{"$f":"IF('[1]Tasa de Falla'!IO138=0,\"\",'[1]Tasa de Falla'!IO138)","v":"XXXX"},{"$f":"IF('[1]Tasa de Falla'!IP138=0,\"\",'[1]Tasa de Falla'!IP138)","v":"XXXX"},{"$f":"IF('[1]Tasa de Falla'!IQ138=0,\"\",'[1]Tasa de Falla'!IQ138)","v":"XXXX"},{"$f":"IF('[1]Tasa de Falla'!IR138=0,\"\",'[1]Tasa de Falla'!IR138)","v":"XXXX"},{"$f":"IF('[1]Tasa de Falla'!IS138=0,\"\",'[1]Tasa de Falla'!IS138)","v":"XXXX"},{"$f":"IF('[1]Tasa de Falla'!IT138=0,\"\",'[1]Tasa de Falla'!IT138)","v":"XXXX"},{"$f":"IF('[1]Tasa de Falla'!IU138=0,\"\",'[1]Tasa de Falla'!IU138)","v":"XXXX"},{"$f":"IF('[1]Tasa de Falla'!IV138=0,\"\",'[1]Tasa de Falla'!IV138)","v":"XXXX"},{"$f":"IF('[1]Tasa de Falla'!IW138=0,\"\",'[1]Tasa de Falla'!IW138)","v":"XXXX"},{"$f":"IF('[1]Tasa de Falla'!IX138=0,\"\",'[1]Tasa de Falla'!IX138)","v":"XXXX"},{"$f":"IF('[1]Tasa de Falla'!IY138=0,\"\",'[1]Tasa de Falla'!IY138)","v":"XXXX"},{"$f":"IF('[1]Tasa de Falla'!IZ138=0,\"\",'[1]Tasa de Falla'!IZ138)","v":"XXXX"}]
[null,null,{"$f":"'[1]Tasa de Falla'!C139","v":122},{"$f":"'[1]Tasa de Falla'!D139","v":"SANTIAGO OESTE - SANTIAGO"},{"$f":"'[1]Tasa de Falla'!E139","v":132},{"$f":"'[1]Tasa de Falla'!F139","v":8.4},{"$f":"IF('[1]Tasa de Falla'!IO139=0,\"\",'[1]Tasa de Falla'!IO139)","v":"XXXX"},{"$f":"IF('[1]Tasa de Falla'!IP139=0,\"\",'[1]Tasa de Falla'!IP139)","v":"XXXX"},{"$f":"IF('[1]Tasa de Falla'!IQ139=0,\"\",'[1]Tasa de Falla'!IQ139)","v":"XXXX"},{"$f":"IF('[1]Tasa de Falla'!IR139=0,\"\",'[1]Tasa de Falla'!IR139)","v":"XXXX"},{"$f":"IF('[1]Tasa de Falla'!IS139=0,\"\",'[1]Tasa de Falla'!IS139)","v":"XXXX"},{"$f":"IF('[1]Tasa de Falla'!IT139=0,\"\",'[1]Tasa de Falla'!IT139)","v":"XXXX"},{"$f":"IF('[1]Tasa de Falla'!IU139=0,\"\",'[1]Tasa de Falla'!IU139)","v":"XXXX"},{"$f":"IF('[1]Tasa de Falla'!IV139=0,\"\",'[1]Tasa de Falla'!IV139)","v":"XXXX"},{"$f":"IF('[1]Tasa de Falla'!IW139=0,\"\",'[1]Tasa de Falla'!IW139)","v":"XXXX"},{"$f":"IF('[1]Tasa de Falla'!IX139=0,\"\",'[1]Tasa de Falla'!IX139)","v":"XXXX"},{"$f":"IF('[1]Tasa de Falla'!IY139=0,\"\",'[1]Tasa de Falla'!IY139)","v":"XXXX"},{"$f":"IF('[1]Tasa de Falla'!IZ139=0,\"\",'[1]Tasa de Falla'!IZ139)","v":"XXXX"}]
[null,null,{"$f":"'[1]Tasa de Falla'!C140","v":123},{"$f":"'[1]Tasa de Falla'!D140","v":"LA BANDA - MISQUI MAYU II - SANTIAGO ESTE II"},{"$f":"'[1]Tasa de Falla'!E140","v":132},{"$f":"'[1]Tasa de Falla'!F140","v":4.92},{"$f":"IF('[1]Tasa de Falla'!IO140=0,\"\",'[1]Tasa de Falla'!IO140)","v":"XXXX"},{"$f":"IF('[1]Tasa de Falla'!IP140=0,\"\",'[1]Tasa de Falla'!IP140)","v":"XXXX"},{"$f":"IF('[1]Tasa de Falla'!IQ140=0,\"\",'[1]Tasa de Falla'!IQ140)","v":"XXXX"},{"$f":"IF('[1]Tasa de Falla'!IR140=0,\"\",'[1]Tasa de Falla'!IR140)","v":"XXXX"},{"$f":"IF('[1]Tasa de Falla'!IS140=0,\"\",'[1]Tasa de Falla'!IS140)","v":"XXXX"},{"$f":"IF('[1]Tasa de Falla'!IT140=0,\"\",'[1]Tasa de Falla'!IT140)","v":"XXXX"},{"$f":"IF('[1]Tasa de Falla'!IU140=0,\"\",'[1]Tasa de Falla'!IU140)","v":"XXXX"},{"$f":"IF('[1]Tasa de Falla'!IV140=0,\"\",'[1]Tasa de Falla'!IV140)","v":"XXXX"},{"$f":"IF('[1]Tasa de Falla'!IW140=0,\"\",'[1]Tasa de Falla'!IW140)","v":"XXXX"},{"$f":"IF('[1]Tasa de Falla'!IX140=0,\"\",'[1]Tasa de Falla'!IX140)","v":"XXXX"},{"$f":"IF('[1]Tasa de Falla'!IY140=0,\"\",'[1]Tasa de Falla'!IY140)","v":""},{"$f":"IF('[1]Tasa de Falla'!IZ140=0,\"\",'[1]Tasa de Falla'!IZ140)","v":""}]
[null,null,null,null,null,null,{"$f":"IF('[1]Tasa de Falla'!IO141=0,\"\",'[1]Tasa de Falla'!IO141)","v":""},{"$f":"IF('[1]Tasa de Falla'!IP141=0,\"\",'[1]Tasa de Falla'!IP141)","v":""},{"$f":"IF('[1]Tasa de Falla'!IQ141=0,\"\",'[1]Tasa de Falla'!IQ141)","v":""},{"$f":"IF('[1]Tasa de Falla'!IR141=0,\"\",'[1]Tasa de Falla'!IR141)","v":""},{"$f":"IF('[1]Tasa de Falla'!IS141=0,\"\",'[1]Tasa de Falla'!IS141)","v":""},{"$f":"IF('[1]Tasa de Falla'!IT141=0,\"\",'[1]Tasa de Falla'!IT141)","v":""},{"$f":"IF('[1]Tasa de Falla'!IU141=0,\"\",'[1]Tasa de Falla'!IU141)","v":""},{"$f":"IF('[1]Tasa de Falla'!IV141=0,\"\",'[1]Tasa de Falla'!IV141)","v":""},{"$f":"IF('[1]Tasa de Falla'!IW141=0,\"\",'[1]Tasa de Falla'!IW141)","v":""},{"$f":"IF('[1]Tasa de Falla'!IX141=0,\"\",'[1]Tasa de Falla'!IX141)","v":""},{"$f":"IF('[1]Tasa de Falla'!IY141=0,\"\",'[1]Tasa de Falla'!IY141)","v":""},{"$f":"IF('[1]Tasa de Falla'!IZ141=0,\"\",'[1]Tasa de Falla'!IZ141)","v":""}]
[null,null,null,null,"Longitud Total    ",{"$f":"SUM(F16:F141)-F19-F21-F22-F26-F27-F37-F39-F40-F43-F44-F47-F48-F49-F53-F60-F65-F78-F82-F96-F101-F111","v":5812.5300000000025}]
[null,null,null,null,null,"Indisponibilidades Forzadas  ",{"$f":"SUM(G17:G141)","v":6},{"$f":"SUM(H17:H141)","v":3},{"$f":"SUM(I17:I141)","v":5},17,10,19,12,14,15,10,4,11]
[null,null,null,null,null,"TASA DE FALLA  ",{"$f":"+'[1]Tasa de Falla'!IO151","v":4.6500000000000004},{"$f":"+'[1]Tasa de Falla'!IP151","v":3.87},{"$f":"+'[1]Tasa de Falla'!IQ151","v":3.45},{"$f":"+'[1]Tasa de Falla'!IR151","v":3.26},{"$f":"+'[1]Tasa de Falla'!IS151","v":3.35},{"$f":"+'[1]Tasa de Falla'!IT151","v":2.96},{"$f":"+'[1]Tasa de Falla'!IU151","v":2.64},{"$f":"+'[1]Tasa de Falla'!IV151","v":2.37},{"$f":"+'[1]Tasa de Falla'!IW151","v":2.4500000000000002},{"$f":"+'[1]Tasa de Falla'!IX151","v":2.4700000000000002},{"$f":"+'[1]Tasa de Falla'!IY151","v":2.58},{"$f":"+'[1]Tasa de Falla'!IZ151","v":2.3199999999999998},{"$f":"+'[1]Tasa de Falla'!JA151","v":2.5}]
[]
[null,null,"XXX","  Línea no computada en el mes",null,null,null,null,"TASA DE FALLA",null,null,{"$f":"S144","v":2.5},null,"SALIDAS x AÑO / 100 km"]

{"sheet":"DATO","index":11,"n_rows":25,"n_cols":29,"rows_kept":25,"cut":false,"hidden":false,"merged":[]}
["Mes","Mes","Dia","Año"]
["enero","01",31,2006]
["febrero","02",{"$f":"IF(MOD(E14,4)=0,29,28)","v":28},{"$f":"+D2+1","v":2007}]
["marzo","03",31,2008]
["abril","04",30,2009]
["mayo","05",31,2010]
["junio","06",30,2011]
["julio","07",31,2012]
["agosto","08",31,2013]
["septiembre","09",30,2014]
["octubre","10",31,2015]
["noviembre","11",30]
["diciembre","12",31,null,null,null,null,null,"Total"]
[10,8,{"$f":"CELL(\"CONTENIDO\",OFFSET(A1,B14,0))","v":"agosto"},{"$f":"CELL(\"CONTENIDO\",OFFSET(C1,B14,0))","v":31},{"$f":"CELL(\"CONTENIDO\",OFFSET(D1,A14,0))","v":2015},{"$f":"\"Desde el 01 al \" & D14 & \" de \" & C14 & \" de \" & E14","v":"Desde el 01 al 31 de agosto de 2015"},{"$f":"CELL(\"CONTENIDO\",OFFSET(B1,B14,0))","v":"08"},{"$f":"RIGHT(E14,2)","v":"15"},"B14"]
[null,{"$f":"\"\\\\rugor\\files\\Transporte\\Transporte\\AA PROCESO AUT ARCHIVOS J\\TRANSNOA\\\" &E14","v":"\\\\rugor\\files\\Transporte\\Transporte\\AA PROCESO AUT ARCHIVOS J\\TRANSNOA\\2015"},null,null,null,null,{"$f":"\"J\"&G14&H14&\"NOA\"","v":"J0815NOA"}]
[null,{"$f":"\"\\\\rugor\\files\\Transporte\\transporte\\AA PROCESO AUT\\INTERCAMBIO\\\" &H14&G14","v":"\\\\rugor\\files\\Transporte\\transporte\\AA PROCESO AUT\\INTERCAMBIO\\1508"}]
["Hoja","FilaInicio","FilasPlantilla","Columnas","NombreHoja","OrigenDeDatos","Col00","Col01","Col02","Col03","Col04","Col05","Col06","Col07","Col08","Col09","Col10","Col11","Col12","Col13","Col14","Col15","FILHTOTAL","COLHTOTAL","FILHCALC","COLHCALC","FILTRANSP","COLTRANSP","COL TSAL"]
["MODELO L",21,20,11,{"$f":"\"LI-\" & $G$14","v":"LI-08"},"TRANSNOA_INDISPONIBILIDADES_LINEAS_TRANSNOA.XLS",3,5,4,6,7,8,0,10,11,14,0,26,0,0,0,0,19,10,42,27,19,27,14]
["MODELO T",24,20,13,{"$f":"\"T-\" & $G$14","v":"T-08"},"TRANSNOA_INDISPONIBILIDADES_TRAFOS_TRANSNOA.XLS",3,5,4,6,7,8,9,11,12,15,16,18,28,17,0,0,25,10,45,29,22,29,15]
["MODELO S",23,20,10,{"$f":"\"SA-\" & $G$14","v":"SA-08"},"TRANSNOA_INDISPONIBILIDADES_SALIDAS_TRANSNOA.XLS",3,5,4,6,7,8,10,11,14,15,21,0,0,0,0,0,29,10,44,22,21,22,14]
["MODELO L RIOJA",21,20,11,{"$f":"\"LI-RIOJA-\" & $G$14","v":"LI-RIOJA-08"},"TRANSNOA_INDISPONIBILIDADES_LINEAS_RIOJA.XLS",3,5,4,6,7,8,0,10,11,14,2,26,0,0,0,0,21,10,42,27,19,27,14]
["MODELO L EDESA",21,20,11,{"$f":"\"LI-EDESA-\" & $G$14","v":"LI-EDESA-08"},"TRANSNOA_INDISPONIBILIDADES_LINEAS_EDESA.XLS",3,5,4,6,7,8,0,10,11,14,2,26,0,0,0,0,20,10,42,27,19,27,14]
["MODELO T EDESA",24,20,13,{"$f":"\"T-EDESA-\" & $G$14","v":"T-EDESA-08"},"TRANSNOA_INDISPONIBILIDADES_TRAFOS_EDESA.XLS",3,5,4,6,7,8,9,11,12,15,16,18,28,17,0,0,26,10,45,29,22,29,15]
["MODELO S EDESA",23,20,10,{"$f":"\"SA-EDESA-\" & $G$14","v":"SA-EDESA-08"},"TRANSNOA_INDISPONIBILIDADES_SALIDAS_EDESA.XLS",3,5,4,6,7,8,10,11,14,15,21,0,0,0,0,0,30,10,44,22,21,22,14]
["MODELO VST",19,24,4,{"$f":"\"CAUSAS-VST-\" & $G$14","v":"CAUSAS-VST-08"},"TRANSNOA_CAUSAS_VST.XLS",3,4,5,6,7,0,0,0,0,0,0,0,0,0,0,0,999,999,0,0,0,0,0]