{"text_format":"1","workbook":"xlsx","n_sheets":14,"sheets":["TOT-0415","LI-04 (1)","LI-04 (2)","T-04 (1)","T-04 (2)","T-04 (3)","LI-RIOJA-04 (1)","CAUSAS-VST-04 (1)","CAUSAS-VST-04 (2)","CAUSAS-VST-04 (3)","CAUSAS-VST-04 (4)","SUP-TRANSPORTEL","Tasa de Falla","DATO"],"not_rendered":{"charts":0,"images":3,"macros":1,"external_links":1,"defined_names":1,"comments":0,"pivot_tables":0},"unopened":[],"bounds":{"document_bytes":16777216,"sheet_cells":100000,"rows_first":2000,"rows_last":500,"rows_between":2000,"halvings":0,"cell_chars":16384,"cell_head_chars":4096},"cells_cut":0,"cells_raw":0,"read":"whole","date_system":"1900"}

{"sheet":"TOT-0415","index":0,"n_rows":33,"n_cols":10,"rows_kept":33,"cut":false,"hidden":false,"merged":[]}
[]
[null,"ANEXO I   al Memorandum  D.T.E.E. N°  526  / 2016"]
[]
["ENTE NACIONAL REGULADOR "]
["DE LA ELECTRICIDAD"]
[]
[null,"SISTEMA DE TRANSPORTE DE ENERGÍA ELÉCTRICA POR DISTRIBUCIÓN TRONCAL"]
[]
[null,"TRANSNOA S.A."]
[]
[null,"TOTAL DE PENALIZACIONES"]
[]
[null,1]
[null,"Desde el 01 al 30 de abril de 2015"]
[]
[null,"Sanciones duplicadas por tasa de falla > 4 Sal. x año/100km."]
[]
[null,null,"1.-","LÍNEAS"]
[null,null,null,"1.1.-","Equipamiento propio",null,null,null,null,{"$f":"'LI-04 (2)'!AA42","v":147363.93}]
[null,null,null,"1.2.-","Equipamiento del T.I.TRANSPORTEL La Rioja Sur",null,null,null,null,{"$f":"'LI-RIOJA-04 (1)'!AA42","v":3513.93}]
[]
[null,null,"2.-","CONEXIÓN"]
[null,null,null,"2.1.-","Transformación"]
[null,null,null,null,"2.1.1.-","Equipamiento propio",null,null,null,{"$f":"'T-04 (3)'!AC39","v":26587.25}]
[]
[]
[null,null,"3.-","SUPERVISIÓN"]
[null,null,null,"3.1.-","T.I. TRANSPORTEL La Rioja Sur",null,null,null,null,{"$f":"'SUP-TRANSPORTEL'!I44","v":1405.5734830570848}]
[]
[]
[null,null,null,null,null,null,"TOTAL ",{"$f":"SUM(J18:J29)","v":178870.68348305707}]
[]
[null,null,"Valores remuneratorios según Convenio de Renovación del acuerdo Instrumental, Nota ENRE Nº 117773"]

{"sheet":"LI-04 (1)","index":1,"n_rows":41,"n_cols":27,"rows_kept":41,"cut":false,"hidden":false,"merged":[]}
[]
[null,"ANEXO I   al Memorandum  D.T.E.E. N°  526  / 2016"]
[]
[" ENTE NACIONAL REGULADOR "]
["       DE LA ELECTRICIDAD"]
[]
[]
[null,null,null,null,null,"SISTEMA DE TRANSPORTE DE ENERGÍA ELÉCTRICA POR DISTRIBUCIÓN TRONCAL - TRANSNOA S.A."]
[]
[null,null,null,null,null,"1.- LÍNEAS"]
[]
[null,null,null,null,null,"1.1.- Equipamiento propio"]
[]
[null,{"$f":"'TOT-0415'!B14","v":"Desde el 01 al 30 de abril de 2015"}]
[]
[null,null,null,null,null,"$/100 km-h : LINEAS 132 kV ",464.68400000000003,null,null,null,"FACTOR DE PENALIZACION  K =",{"$f":"30*'TOT-0415'!B13","v":30},{"$f":"IF(L16=30,\" \",IF(L16=60,\"Coeficiente duplicado por tasa de falla >4 Sal. x año/100 km.\",\"REVISAR COEFICIENTE\"))","v":" "}]
[null,null,3,4,5,6,7,8,9,10,11,12,13,14,15,16,17,18,19,20,21,22,23,24,25,26,27]
[null,null,"N°","INDISP","ID EQUIPO","LÍNEAS","U\n[kV]","Long.\n[km]","$/h","Salida","Entrada","Hs. \nIndisp","Minutos\nIndisp.","Tipo \nSal.(²)","C.R.\n%","PENALIZ.\nPROGRAM.","REDUCC.\nPROGRAM.","PENALIZACION FORZADA\nPor Salida    1ras. 3 hs.   hs. Restantes",null,null,"REDUCC. FORZADA\nPor Salida     1ras. 3 hs.     hs. Restantes",null,null,"RESTANTE\nFORZADA","REDUCC.\nRESTANTE","Informó\nen Térm.","TOTAL\nPENALIZAC."]
[]
[]
[null,null,1,287075,4677,"GUEMES SALTA - MINETTI",132,36.099998474121094,{"$f":"$G$16/100*IF(H21>25,H21,25)","v":167.75091690948486},"2015-04-01T01:44:00","2015-04-01T03:58:00",{"$f":"IF(F21=\"\",\"\",(K21-J21)*24)","v":2.2333333332790062},{"$f":"IF(F21=\"\",\"\",ROUND((K21-J21)*24*60,0))","v":134},"F",{"$f":"IF(F21=\"\",\"\",\"--\")","v":"--"},{"$f":"IF(N21=\"P\",ROUND(M21/60,2)*I21*$L$16*0.01,\"--\")","v":"--"},{"$f":"IF(N21=\"RP\",I21*O21*ROUND(L21/60,2)*0.01*M21/100,\"--\")","v":"--"},{"$f":"IF(N21=\"F\",I21*$L$16,\"--\")","v":5032.5275072845461},{"$f":"IF(AND(M21>10,N21=\"F\"),I21*$L$16*IF(M21>180,3,ROUND((M21)/60,2)),\"--\")","v":11222.536341244539},{"$f":"IF(AND(M21>180,N21=\"F\"),(ROUND(M21/60,2)-3)*I21*$L$16*0.1,\"--\")","v":"--"},{"$f":"IF(N21=\"R\",I21*$L$16*O21/100,\"--\")","v":"--"},{"$f":"IF(AND(M21>10,N21=\"R\"),I21*$L$16*O21/100*IF(M21>180,3,ROUND(M21/60,2)),\"--\")","v":"--"},{"$f":"IF(AND(M21>180,N21=\"R\"),(ROUND(M21/60,2)-3)*I21*$L$16*0.1*O21/100,\"--\")","v":"--"},{"$f":"IF(N21=\"RF\",ROUND(M21/60,2)*I21*$L$16*0.1,\"--\")","v":"--"},{"$f":"IF(N21=\"RR\",ROUND(M21/60,2)*I21*$L$16*0.1*O21/100,\"--\")","v":"--"},"SI",{"$f":"IF(F21=\"\",\"\",SUM(P21:Y21)*IF(Z21=\"SI\",1,2))","v":16255.063848529084}]
[null,null,2,287076,287,"AGUA BLANCA - INDEPENDENCIA TUC",132,34.139999389648438,158.64311476379396,"2015-04-01T08:28:00","2015-04-01T13:44:00",5.2666666667209938,316,"P","--",250.81476444155822,"--","--","--","--","--","--","--","--","--","SI",250.81476444155822]
[null,null,3,287083,5436,"LA RIOJA - ARAUCO",132,84.3,391.728612,"2015-04-04T01:27:00","2015-04-04T01:37:00",0.16666666668606922,10,"F","--","--","--",11751.85836,"--","--","--","--","--","--","--","SI",11751.85836]
[null,null,4,287200,311,"AGUILARES - VILLA QUINTEROS",132,21,116.17100000000001,"2015-04-07T09:35:00","2015-04-07T16:59:00",7.4000000000232831,444,"P","--",257.89962000000003,"--","--","--","--","--","--","--","--","--","SI",257.89962000000003]
[null,null,5,287202,311,"AGUILARES - VILLA QUINTEROS",132,21,116.17100000000001,"2015-04-08T01:02:00","2015-04-08T01:09:00",0.11666666669771075,7,"F","--","--","--",3485.13,"--","--","--","--","--","--","--","SI",3485.13]
[null,null,6,287214,311,"AGUILARES - VILLA QUINTEROS",132,21,116.17100000000001,"2015-04-09T08:14:00","2015-04-09T17:13:00",8.9833333334536292,539,"P","--",312.964674,"--","--","--","--","--","--","--","--","--","SI",312.964674]
[null,null,7,287216,311,"AGUILARES - VILLA QUINTEROS",132,21,116.17100000000001,"2015-04-10T08:06:00","2015-04-10T16:18:00",8.2000000000116415,492,"P","--",285.78066000000001,"--","--","--","--","--","--","--","--","--","SI",285.78066000000001]
[null,null,8,287217,281,"GÜEMES - SAN JUANCITO 1",132,36.240001678466797,168.40148939956666,"2015-04-11T09:01:00","2015-04-11T09:04:00",4.9999999988358468E-2,3,"F","--","--","--",5052.0446819869994,"--","--","--","--","--","--","--","SI",5052.0446819869994]
[null,null,9,287470,4633,"GUEMES SALTA - COBOS 1",132,12.100000381469727,116.17100000000001,"2015-04-14T11:33:00","2015-04-14T12:09:00",0.6000000000349246,36,"P","--",20.910779999999999,"--","--","--","--","--","--","--","--","--","SI",20.910779999999999]
[null,null,10,287482,5139,"CATAMARCA - V. VIEJO - HUACRA",132,67.300003051757813,312.73234618103027,"2015-04-14T11:58:00","2015-04-14T12:04:00",9.9999999976716936E-2,6,"F","--","--","--",9381.9703854309082,"--","--","--","--","--","--","--","SI",9381.9703854309082]
[null,null,11,287500,3772,"RECREO - CATAMARCA",132,203,943.30852000000004,"2015-04-17T07:15:00","2015-04-17T07:29:00",0.23333333322079852,14,"F","--","--","--",28299.2556,6508.8287880000007,"--","--","--","--","--","--","SI",34808.084388000003]
[null,null,12,287503,299,"PALPALA - SAN JUANCITO",132,23.899999618530273,116.17100000000001,"2015-04-17T12:41:00","2015-04-17T13:24:00",0.71666666673263535,43,"F","--","--","--",3485.13,2509.2936,"--","--","--","--","--","--","SI",5994.4236000000001]
[null,null,13,287504,2623,"PALPALA - JUJUY ESTE",132,12.25,116.17100000000001,"2015-04-17T12:41:00","2015-04-17T13:22:00",0.68333333329064772,41,"F","--","--","--",3485.13,2369.8884000000003,"--","--","--","--","--","--","SI",5855.0184000000008]
[null,null,14,287513,3565,"CABRA CORRAL - SALTA ESTE",132,55,255.5762,"2015-04-18T03:26:00","2015-04-18T03:31:00",8.3333333255723119E-2,5,"F","--","--","--",7667.2860000000001,"--","--","--","--","--","--","--","SI",7667.2860000000001]
[null,null,15,287515,3772,"RECREO - CATAMARCA",132,203,943.30852000000004,"2015-04-19T06:38:00","2015-04-19T12:43:00",6.0833333334303461,365,"P","--",1720.5947404800004,"--","--","--","--","--","--","--","--","--","SI",1720.5947404800004]
[null,null,16,287716,297,"C.H. RIO HONDO - LA BANDA",132,76.5,355.48326000000003,"2015-04-20T09:59:00","2015-04-20T14:04:00",4.0833333331975155,245,"P","--",435.11151024000009,"--","--","--","--","--","--","--","--","--","SI",435.11151024000009]
[null,null,17,287729,308,"C.H. EL CADILLAL - TUCUMAN NORTE",132,21.780000686645508,116.17100000000001,"2015-04-20T23:26:00","2015-04-20T23:30:00",{"$f":"IF(F37=\"\",\"\",(K37-J37)*24)","v":6.6666666534729302E-2},{"$f":"IF(F37=\"\",\"\",ROUND((K37-J37)*24*60,0))","v":4},"F",{"$f":"IF(F37=\"\",\"\",\"--\")","v":"--"},{"$f":"IF(N37=\"P\",ROUND(M37/60,2)*I37*$L$16*0.01,\"--\")","v":"--"},{"$f":"IF(N37=\"RP\",I37*O37*ROUND(L37/60,2)*0.01*M37/100,\"--\")","v":"--"},{"$f":"IF(N37=\"F\",I37*$L$16,\"--\")","v":3485.13},{"$f":"IF(AND(M37>10,N37=\"F\"),I37*$L$16*IF(M37>180,3,ROUND((M37)/60,2)),\"--\")","v":"--"},{"$f":"IF(AND(M37>180,N37=\"F\"),(ROUND(M37/60,2)-3)*I37*$L$16*0.1,\"--\")","v":"--"},{"$f":"IF(N37=\"R\",I37*$L$16*O37/100,\"--\")","v":"--"},{"$f":"IF(AND(M37>10,N37=\"R\"),I37*$L$16*O37/100*IF(M37>180,3,ROUND(M37/60,2)),\"--\")","v":"--"},{"$f":"IF(AND(M37>180,N37=\"R\"),(ROUND(M37/60,2)-3)*I37*$L$16*0.1*O37/100,\"--\")","v":"--"},{"$f":"IF(N37=\"RF\",ROUND(M37/60,2)*I37*$L$16*0.1,\"--\")","v":"--"},{"$f":"IF(N37=\"RR\",ROUND(M37/60,2)*I37*$L$16*0.1*O37/100,\"--\")","v":"--"},"SI",{"$f":"IF(F37=\"\",\"\",SUM(P37:Y37)*IF(Z37=\"SI\",1,2))","v":3485.13}]
[null,null,18,287731,299,"PALPALA - SAN JUANCITO",132,23.899999618530273,116.17100000000001,"2015-04-22T08:05:00","2015-04-22T10:19:00",{"$f":"IF(F38=\"\",\"\",(K38-J38)*24)","v":2.2333333332790062},{"$f":"IF(F38=\"\",\"\",ROUND((K38-J38)*24*60,0))","v":134},"P",{"$f":"IF(F38=\"\",\"\",\"--\")","v":"--"},{"$f":"IF(N38=\"P\",ROUND(M38/60,2)*I38*$L$16*0.01,\"--\")","v":77.718399000000005},{"$f":"IF(N38=\"RP\",I38*O38*ROUND(L38/60,2)*0.01*M38/100,\"--\")","v":"--"},{"$f":"IF(N38=\"F\",I38*$L$16,\"--\")","v":"--"},{"$f":"IF(AND(M38>10,N38=\"F\"),I38*$L$16*IF(M38>180,3,ROUND((M38)/60,2)),\"--\")","v":"--"},{"$f":"IF(AND(M38>180,N38=\"F\"),(ROUND(M38/60,2)-3)*I38*$L$16*0.1,\"--\")","v":"--"},{"$f":"IF(N38=\"R\",I38*$L$16*O38/100,\"--\")","v":"--"},{"$f":"IF(AND(M38>10,N38=\"R\"),I38*$L$16*O38/100*IF(M38>180,3,ROUND(M38/60,2)),\"--\")","v":"--"},{"$f":"IF(AND(M38>180,N38=\"R\"),(ROUND(M38/60,2)-3)*I38*$L$16*0.1*O38/100,\"--\")","v":"--"},{"$f":"IF(N38=\"RF\",ROUND(M38/60,2)*I38*$L$16*0.1,\"--\")","v":"--"},{"$f":"IF(N38=\"RR\",ROUND(M38/60,2)*I38*$L$16*0.1*O38/100,\"--\")","v":"--"},"SI",{"$f":"IF(F38=\"\",\"\",SUM(P38:Y38)*IF(Z38=\"SI\",1,2))","v":77.718399000000005}]
[null,null,19,287732,279,"ESTATICA SUR - INDEPENDENCIA (O.F.)",132,2.5999999046325684,116.17100000000001,"2015-04-22T09:35:00","2015-04-22T14:41:00",{"$f":"IF(F39=\"\",\"\",(K39-J39)*24)","v":5.1000000000349246},{"$f":"IF(F39=\"\",\"\",ROUND((K39-J39)*24*60,0))","v":306},"P",{"$f":"IF(F39=\"\",\"\",\"--\")","v":"--"},{"$f":"IF(N39=\"P\",ROUND(M39/60,2)*I39*$L$16*0.01,\"--\")","v":177.74163000000001},{"$f":"IF(N39=\"RP\",I39*O39*ROUND(L39/60,2)*0.01*M39/100,\"--\")","v":"--"},{"$f":"IF(N39=\"F\",I39*$L$16,\"--\")","v":"--"},{"$f":"IF(AND(M39>10,N39=\"F\"),I39*$L$16*IF(M39>180,3,ROUND((M39)/60,2)),\"--\")","v":"--"},{"$f":"IF(AND(M39>180,N39=\"F\"),(ROUND(M39/60,2)-3)*I39*$L$16*0.1,\"--\")","v":"--"},{"$f":"IF(N39=\"R\",I39*$L$16*O39/100,\"--\")","v":"--"},{"$f":"IF(AND(M39>10,N39=\"R\"),I39*$L$16*O39/100*IF(M39>180,3,ROUND(M39/60,2)),\"--\")","v":"--"},{"$f":"IF(AND(M39>180,N39=\"R\"),(ROUND(M39/60,2)-3)*I39*$L$16*0.1*O39/100,\"--\")","v":"--"},{"$f":"IF(N39=\"RF\",ROUND(M39/60,2)*I39*$L$16*0.1,\"--\")","v":"--"},{"$f":"IF(N39=\"RR\",ROUND(M39/60,2)*I39*$L$16*0.1*O39/100,\"--\")","v":"--"},"SI",{"$f":"IF(F39=\"\",\"\",SUM(P39:Y39)*IF(Z39=\"SI\",1,2))","v":177.74163000000001}]
[]
[null,null,"(²)","P - PROGRAMADA  ; F - FORZADA",null,null,null,null,null,null,null,null,null,null,null,{"$f":"SUM(P19:P40)","v":3539.5367781615587},0,81125.46253470247,22610.54712924454,0,0,0,0,0,0,null,{"$f":"ROUND(SUM(AA19:AA40),2)","v":107275.55}]

{"sheet":"LI-04 (2)","index":2,"n_rows":42,"n_cols":27,"rows_kept":42,"cut":false,"hidden":false,"merged":[]}
[]
[null,"ANEXO I   al Memorandum  D.T.E.E. N°  526   / 2016"]
[]
[" ENTE NACIONAL REGULADOR "]
["       DE LA ELECTRICIDAD"]
[]
[]
[null,null,null,null,null,"SISTEMA DE TRANSPORTE DE ENERGÍA ELÉCTRICA POR DISTRIBUCIÓN TRONCAL - TRANSNOA S.A."]
[]
[null,null,null,null,null,"1.- LÍNEAS"]
[]
[null,null,null,null,null,"1.1.- Equipamiento propio"]
[]
[null,{"$f":"'TOT-0415'!B14","v":"Desde el 01 al 30 de abril de 2015"}]
[]
[null,null,null,null,null,"$/100 km-h : LINEAS 132 kV ",464.68400000000003,null,null,null,"FACTOR DE PENALIZACION  K =",{"$f":"30*'TOT-0415'!B13","v":30},{"$f":"IF(L16=30,\" \",IF(L16=60,\"Coeficiente duplicado por tasa de falla >4 Sal. x año/100 km.\",\"REVISAR COEFICIENTE\"))","v":" "}]
[null,null,3,4,5,6,7,8,9,10,11,12,13,14,15,16,17,18,19,20,21,22,23,24,25,26,27]
[null,null,"N°","INDISP","ID EQUIPO","LÍNEAS","U\n[kV]","Long.\n[km]","$/h","Salida","Entrada","Hs. \nIndisp","Minutos\nIndisp.","Tipo \nSal.(²)","C.R.\n%","PENALIZ.\nPROGRAM.","REDUCC.\nPROGRAM.","PENALIZACION FORZADA\nPor Salida    1ras. 3 hs.   hs. Restantes",null,null,"REDUCC. FORZADA\nPor Salida     1ras. 3 hs.     hs. Restantes",null,null,"RESTANTE\nFORZADA","REDUCC.\nRESTANTE","Informó\nen Térm.","TOTAL\nPENALIZAC."]
[null,null,null,null,null,null,null,null,null,null,null,null,null,null,null,null,null,null,null,null,null,null,null,null,null,null,{"$f":"'LI-04 (1)'!AA41","v":107275.55}]
[]
[null,null,20,287733,279,"ESTATICA SUR - INDEPENDENCIA (O.F.)",132,2.5999999046325684,{"$f":"$G$16/100*IF(H21>25,H21,25)","v":116.17100000000001},"2015-04-23T08:39:00","2015-04-23T14:53:00",{"$f":"IF(F21=\"\",\"\",(K21-J21)*24)","v":6.2333333332207985},{"$f":"IF(F21=\"\",\"\",ROUND((K21-J21)*24*60,0))","v":374},"P",{"$f":"IF(F21=\"\",\"\",\"--\")","v":"--"},{"$f":"IF(N21=\"P\",ROUND(M21/60,2)*I21*$L$16*0.01,\"--\")","v":217.12359900000004},{"$f":"IF(N21=\"RP\",I21*O21*ROUND(L21/60,2)*0.01*M21/100,\"--\")","v":"--"},{"$f":"IF(N21=\"F\",I21*$L$16,\"--\")","v":"--"},{"$f":"IF(AND(M21>10,N21=\"F\"),I21*$L$16*IF(M21>180,3,ROUND((M21)/60,2)),\"--\")","v":"--"},{"$f":"IF(AND(M21>180,N21=\"F\"),(ROUND(M21/60,2)-3)*I21*$L$16*0.1,\"--\")","v":"--"},{"$f":"IF(N21=\"R\",I21*$L$16*O21/100,\"--\")","v":"--"},{"$f":"IF(AND(M21>10,N21=\"R\"),I21*$L$16*O21/100*IF(M21>180,3,ROUND(M21/60,2)),\"--\")","v":"--"},{"$f":"IF(AND(M21>180,N21=\"R\"),(ROUND(M21/60,2)-3)*I21*$L$16*0.1*O21/100,\"--\")","v":"--"},{"$f":"IF(N21=\"RF\",ROUND(M21/60,2)*I21*$L$16*0.1,\"--\")","v":"--"},{"$f":"IF(N21=\"RR\",ROUND(M21/60,2)*I21*$L$16*0.1*O21/100,\"--\")","v":"--"},"SI",{"$f":"IF(F21=\"\",\"\",SUM(P21:Y21)*IF(Z21=\"SI\",1,2))","v":217.12359900000004}]
[null,null,21,287735,281,"GÜEMES - SAN JUANCITO 1",132,36.240001678466797,{"$f":"$G$16/100*IF(H22>25,H22,25)","v":168.40148939956666},"2015-04-23T18:40:00","2015-04-23T20:47:00",{"$f":"IF(F22=\"\",\"\",(K22-J22)*24)","v":2.1166666665812954},{"$f":"IF(F22=\"\",\"\",ROUND((K22-J22)*24*60,0))","v":127},"F",{"$f":"IF(F22=\"\",\"\",\"--\")","v":"--"},{"$f":"IF(N22=\"P\",ROUND(M22/60,2)*I22*$L$16*0.01,\"--\")","v":"--"},{"$f":"IF(N22=\"RP\",I22*O22*ROUND(L22/60,2)*0.01*M22/100,\"--\")","v":"--"},{"$f":"IF(N22=\"F\",I22*$L$16,\"--\")","v":5052.0446819869994},{"$f":"IF(AND(M22>10,N22=\"F\"),I22*$L$16*IF(M22>180,3,ROUND((M22)/60,2)),\"--\")","v":10710.33472581244},{"$f":"IF(AND(M22>180,N22=\"F\"),(ROUND(M22/60,2)-3)*I22*$L$16*0.1,\"--\")","v":"--"},{"$f":"IF(N22=\"R\",I22*$L$16*O22/100,\"--\")","v":"--"},{"$f":"IF(AND(M22>10,N22=\"R\"),I22*$L$16*O22/100*IF(M22>180,3,ROUND(M22/60,2)),\"--\")","v":"--"},{"$f":"IF(AND(M22>180,N22=\"R\"),(ROUND(M22/60,2)-3)*I22*$L$16*0.1*O22/100,\"--\")","v":"--"},{"$f":"IF(N22=\"RF\",ROUND(M22/60,2)*I22*$L$16*0.1,\"--\")","v":"--"},{"$f":"IF(N22=\"RR\",ROUND(M22/60,2)*I22*$L$16*0.1*O22/100,\"--\")","v":"--"},"SI",{"$f":"IF(F22=\"\",\"\",SUM(P22:Y22)*IF(Z22=\"SI\",1,2))","v":15762.379407799439}]
[null,null,22,287736,279,"ESTATICA SUR - INDEPENDENCIA (O.F.)",132,2.5999999046325684,116.17100000000001,"2015-04-24T08:36:00","2015-04-24T14:40:00",6.0666666667093523,364,"P","--",211.54739100000003,"--","--","--","--","--","--","--","--","--","SI",211.54739100000003]
[null,null,23,287738,313,"C.H. RIO HONDO - VILLA QUINTEROS",132,75.400001525878906,350.37174309051517,"2015-04-25T08:03:00","2015-04-25T11:54:00",3.8499999999767169,231,"P","--",404.67936326954498,"--","--","--","--","--","--","--","--","--","SI",404.67936326954498]
[null,null,24,287937,4249,"PAMPA GRANDE - CABRA CORRAL",132,60,278.81040000000002,"2015-04-27T11:11:00","2015-04-27T11:20:00",0.1499999999650754,9,"F","--","--","--",8364.3119999999999,"--","--","--","--","--","--","--","SI",8364.3119999999999]
[null,null,25,287938,4677,"GUEMES SALTA - MINETTI",132,36.099998474121094,167.75091690948486,"2015-04-27T11:48:00","2015-04-27T11:51:00",4.9999999988358468E-2,3,"F","--","--","--",5032.5275072845461,"--","--","--","--","--","--","--","SI",5032.5275072845461]
[null,null,26,287939,281,"GÜEMES - SAN JUANCITO 1",132,36.240001678466797,168.40148939956666,"2015-04-27T11:48:00","2015-04-27T12:02:00",0.23333333322079852,14,"F","--","--","--",5052.0446819869994,1161.9702768570098,"--","--","--","--","--","--","SI",6214.014958844009]
[null,null,27,287940,299,"PALPALA - SAN JUANCITO",132,23.899999618530273,116.17100000000001,"2015-04-27T11:50:00","2015-04-27T12:00:00",0.16666666668606922,10,"F","--","--","--",3485.13,"--","--","--","--","--","--","--","SI",3485.13]
[null,null,28,287941,271,"AGUA BLANCA - VILLA QUINTEROS",132,23.799999237060547,116.17100000000001,"2015-04-28T09:26:00","2015-04-28T14:32:00",5.1000000000349246,306,"P","--",177.74163000000001,"--","--","--","--","--","--","--","--","--","SI",177.74163000000001]
[null,null,29,287942,287,"AGUA BLANCA - INDEPENDENCIA TUC",132,34.139999389648438,158.64311476379396,"2015-04-28T09:41:00","2015-04-28T14:17:00",4.5999999999767169,276,"P","--",218.92749837403565,"--","--","--","--","--","--","--","--","--","SI",218.92749837403565]
[null,null,null,null,null,null,null,null,116.17100000000001,null,null,"","",null,"","--","--","--","--","--","--","--","--","--","--",{"$f":"IF(F31=\"\",\"\",\"SI\")","v":""},""]
[null,null,null,null,null,null,null,null,116.17100000000001,null,null,"","",null,"","--","--","--","--","--","--","--","--","--","--","",""]
[null,null,null,null,null,null,null,null,116.17100000000001,null,null,"","",null,"","--","--","--","--","--","--","--","--","--","--","",""]
[null,null,null,null,null,null,null,null,116.17100000000001,null,null,"","",null,"","--","--","--","--","--","--","--","--","--","--","",""]
[null,null,null,null,null,null,null,null,116.17100000000001,null,null,"","",null,"","--","--","--","--","--","--","--","--","--","--","",""]
[null,null,null,null,null,null,null,null,116.17100000000001,null,null,"","",null,"","--","--","--","--","--","--","--","--","--","--","",""]
[null,null,null,null,null,null,null,null,116.17100000000001,null,null,"","",null,"","--","--","--","--","--","--","--","--","--","--","",""]
[null,null,null,null,null,null,null,null,116.17100000000001,null,null,{"$f":"IF(F38=\"\",\"\",(K38-J38)*24)","v":""},{"$f":"IF(F38=\"\",\"\",ROUND((K38-J38)*24*60,0))","v":""},null,{"$f":"IF(F38=\"\",\"\",\"--\")","v":""},{"$f":"IF(N38=\"P\",ROUND(M38/60,2)*I38*$L$16*0.01,\"--\")","v":"--"},{"$f":"IF(N38=\"RP\",I38*O38*ROUND(L38/60,2)*0.01*M38/100,\"--\")","v":"--"},{"$f":"IF(N38=\"F\",I38*$L$16,\"--\")","v":"--"},{"$f":"IF(AND(M38>10,N38=\"F\"),I38*$L$16*IF(M38>180,3,ROUND((M38)/60,2)),\"--\")","v":"--"},{"$f":"IF(AND(M38>180,N38=\"F\"),(ROUND(M38/60,2)-3)*I38*$L$16*0.1,\"--\")","v":"--"},{"$f":"IF(N38=\"R\",I38*$L$16*O38/100,\"--\")","v":"--"},{"$f":"IF(AND(M38>10,N38=\"R\"),I38*$L$16*O38/100*IF(M38>180,3,ROUND(M38/60,2)),\"--\")","v":"--"},{"$f":"IF(AND(M38>180,N38=\"R\"),(ROUND(M38/60,2)-3)*I38*$L$16*0.1*O38/100,\"--\")","v":"--"},{"$f":"IF(N38=\"RF\",ROUND(M38/60,2)*I38*$L$16*0.1,\"--\")","v":"--"},{"$f":"IF(N38=\"RR\",ROUND(M38/60,2)*I38*$L$16*0.1*O38/100,\"--\")","v":"--"},"",{"$f":"IF(F38=\"\",\"\",SUM(P38:Y38)*IF(Z38=\"SI\",1,2))","v":""}]
[null,null,null,null,null,null,null,null,116.17100000000001,null,null,{"$f":"IF(F39=\"\",\"\",(K39-J39)*24)","v":""},{"$f":"IF(F39=\"\",\"\",ROUND((K39-J39)*24*60,0))","v":""},null,{"$f":"IF(F39=\"\",\"\",\"--\")","v":""},{"$f":"IF(N39=\"P\",ROUND(M39/60,2)*I39*$L$16*0.01,\"--\")","v":"--"},{"$f":"IF(N39=\"RP\",I39*O39*ROUND(L39/60,2)*0.01*M39/100,\"--\")","v":"--"},{"$f":"IF(N39=\"F\",I39*$L$16,\"--\")","v":"--"},{"$f":"IF(AND(M39>10,N39=\"F\"),I39*$L$16*IF(M39>180,3,ROUND((M39)/60,2)),\"--\")","v":"--"},{"$f":"IF(AND(M39>180,N39=\"F\"),(ROUND(M39/60,2)-3)*I39*$L$16*0.1,\"--\")","v":"--"},{"$f":"IF(N39=\"R\",I39*$L$16*O39/100,\"--\")","v":"--"},{"$f":"IF(AND(M39>10,N39=\"R\"),I39*$L$16*O39/100*IF(M39>180,3,ROUND(M39/60,2)),\"--\")","v":"--"},{"$f":"IF(AND(M39>180,N39=\"R\"),(ROUND(M39/60,2)-3)*I39*$L$16*0.1*O39/100,\"--\")","v":"--"},{"$f":"IF(N39=\"RF\",ROUND(M39/60,2)*I39*$L$16*0.1,\"--\")","v":"--"},{"$f":"IF(N39=\"RR\",ROUND(M39/60,2)*I39*$L$16*0.1*O39/100,\"--\")","v":"--"},"",{"$f":"IF(F39=\"\",\"\",SUM(P39:Y39)*IF(Z39=\"SI\",1,2))","v":""}]
[null,null,null,null,null,null,null,null,116.17100000000001,null,null,{"$f":"IF(F40=\"\",\"\",(K40-J40)*24)","v":""},{"$f":"IF(F40=\"\",\"\",ROUND((K40-J40)*24*60,0))","v":""},null,{"$f":"IF(F40=\"\",\"\",\"--\")","v":""},{"$f":"IF(N40=\"P\",ROUND(M40/60,2)*I40*$L$16*0.01,\"--\")","v":"--"},{"$f":"IF(N40=\"RP\",I40*O40*ROUND(L40/60,2)*0.01*M40/100,\"--\")","v":"--"},{"$f":"IF(N40=\"F\",I40*$L$16,\"--\")","v":"--"},{"$f":"IF(AND(M40>10,N40=\"F\"),I40*$L$16*IF(M40>180,3,ROUND((M40)/60,2)),\"--\")","v":"--"},{"$f":"IF(AND(M40>180,N40=\"F\"),(ROUND(M40/60,2)-3)*I40*$L$16*0.1,\"--\")","v":"--"},{"$f":"IF(N40=\"R\",I40*$L$16*O40/100,\"--\")","v":"--"},{"$f":"IF(AND(M40>10,N40=\"R\"),I40*$L$16*O40/100*IF(M40>180,3,ROUND(M40/60,2)),\"--\")","v":"--"},{"$f":"IF(AND(M40>180,N40=\"R\"),(ROUND(M40/60,2)-3)*I40*$L$16*0.1*O40/100,\"--\")","v":"--"},{"$f":"IF(N40=\"RF\",ROUND(M40/60,2)*I40*$L$16*0.1,\"--\")","v":"--"},{"$f":"IF(N40=\"RR\",ROUND(M40/60,2)*I40*$L$16*0.1*O40/100,\"--\")","v":"--"},"",{"$f":"IF(F40=\"\",\"\",SUM(P40:Y40)*IF(Z40=\"SI\",1,2))","v":""}]
[]
[null,null,"(²)","P - PROGRAMADA  ; F - FORZADA",null,null,null,null,null,null,null,null,null,null,null,{"$f":"SUM(P19:P41)","v":1230.0194816435808},0,26986.058871258549,11872.305002669449,0,0,0,0,0,0,null,{"$f":"ROUND(SUM(AA19:AA41),2)","v":147363.93}]

{"sheet":"T-04 (1)","index":3,"n_rows":39,"n_cols":29,"rows_kept":39,"cut":false,"hidden":false,"merged":[]}
[]
[null,"ANEXO I   al Memorandum  D.T.E.E. N° 526  / 2016"]
[]
[" ENTE NACIONAL REGULADOR "]
["       DE LA ELECTRICIDAD"]
[]
[]
[null,null,null,null,null,"SISTEMA DE TRANSPORTE DE ENERGÍA ELÉCTRICA POR DISTRIBUCIÓN TRONCAL - TRANSNOA S.A."]
[]
[null,null,null,null,null,"2.- CONEXIÓN"]
[]
[null,null,null,null,null,"2.1.- Transformación"]
[]
[null,null,null,null,null,"2.1.1.- Equipamiento propio"]
[]
[null,{"$f":"'TOT-0415'!B14","v":"Desde el 01 al 30 de abril de 2015"}]
[]
[null,null,null,null,null,"Por Transformador por MVA    $ =",null,null,1.617]
[null,null,null,null,null,"Coeficiente de penalización por salida forzada   =",null,null,{"$f":"30*'TOT-0415'!B13","v":30},null,{"$f":"IF(I19=30,\" \",IF(I19=60,\"  Coeficiente duplicado por tasa de falla >4 Sal. x año/100 km.\",\"REVISAR COEFICIENTE\"))","v":" "}]
[null,null,3,4,5,6,7,8,9,10,11,12,13,14,15,16,17,18,19,20,21,22,23,24,25,26,27,28,29]
[null,null,"N°","INDISP","ID EQUIPO","ESTACIÓN\nTRANSFORMADORA","EQUIPO","POT.\n[MVA]","U\n[kV]","$/h","Salida","Entrada","Hs\nIndisp.","Mtos.\nIndisp.","Tipo \nSal.(²)","AUT.","C.R.\n%","E.N.S.","K (P;ENS)","PENALIZ.\nPROGRAM.","REDUCC.\nPROGRAM.","PENALIZAC. FORZADA\nPor Salida       hs. Restantes",null,"REDUCC. FORZADA\nPor Salida       hs. Restantes",null,"RESTANTE\nFORZADA","REDUCC.\nRESTANTE","Informó\nen Térm.","TOTAL\nPENALIZAC."]
[]
[]
[null,null,30,282242,4228,"SUNCHO CORRAL","TRP2",15,"132/33/13,2",{"$f":"H24*$I$18","v":24.254999999999999},"2015-04-01","2015-04-30T23:59:59",{"$f":"IF(F24=\"\",\"\",(L24-K24)*24)","v":719.99972222215729},{"$f":"IF(F24=\"\",\"\",ROUND((L24-K24)*24*60,0))","v":43200},"P",{"$f":"IF(F24=\"\",\"\",IF(OR(O24=\"P\",O24=\"RP\"),\"--\",\"NO\"))","v":"--"},"0,000","NO",{"$f":"$I$19*IF(R24=\"SI\",1,0.1)*IF(OR(O24=\"P\",O24=\"RP\"),0.1,1)","v":0.30000000000000004},{"$f":"IF(O24=\"P\",J24*S24*ROUND(N24/60,2),\"--\")","v":5239.08},{"$f":"IF(O24=\"RP\",J24*S24*Q24/100*ROUND(N24/60,2),\"--\")","v":"--"},{"$f":"IF(AND(O24=\"F\",P24=\"NO\"),J24*S24,\"--\")","v":"--"},{"$f":"IF(O24=\"F\",J24*S24*ROUND(N24/60,2),\"--\")","v":"--"},{"$f":"IF(AND(O24=\"R\",P24=\"NO\"),J24*S24*Q24/100,\"--\")","v":"--"},{"$f":"IF(O24=\"R\",J24*S24*ROUND(N24/60,2)*Q24/100,\"--\")","v":"--"},{"$f":"IF(O24=\"RF\",J24*S24*ROUND(N24/60,2),\"--\")","v":"--"},{"$f":"IF(O24=\"RR\",J24*S24*ROUND(N24/60,2)*Q24/100,\"--\")","v":"--"},"SI",{"$f":"IF(F24=\"\",\"\",SUM(T24:AA24)*IF(AB24=\"SI\",1,2))","v":5239.08}]
[null,null,31,287077,4839,"SANTIAGO OESTE","TRAFO 2",30,"132/13,2",{"$f":"H25*$I$18","v":48.51},"2015-04-01T08:48:00","2015-04-01T11:07:00",2.3166666665347293,139,"P","--","0,000","NO",{"$f":"$I$19*IF(R25=\"SI\",1,0.1)*IF(OR(O25=\"P\",O25=\"RP\"),0.1,1)","v":0.30000000000000004},33.76296,"--","--","--","--","--","--","--","SI",33.76296]
[null,null,32,287093,3823,"LAS MADERAS","TRAFO 1",7.5,"132/33/13,2",{"$f":"H26*$I$18","v":12.1275},"2015-04-05T09:01:00","2015-04-05T14:07:00",5.0999999998603016,306,"P","--","0,000","NO",{"$f":"$I$19*IF(R26=\"SI\",1,0.1)*IF(OR(O26=\"P\",O26=\"RP\"),0.1,1)","v":0.30000000000000004},18.555074999999999,"--","--","--","--","--","--","--","SI",18.555074999999999]
[null,null,33,287094,4875,"LAS MADERAS","TRAFO 2",7.5,"132/33/13,2",{"$f":"H27*$I$18","v":12.1275},"2015-04-05T09:01:00","2015-04-05T14:07:00",5.0999999998603016,306,"P","--","0,000","NO",{"$f":"$I$19*IF(R27=\"SI\",1,0.1)*IF(OR(O27=\"P\",O27=\"RP\"),0.1,1)","v":0.30000000000000004},18.555074999999999,"--","--","--","--","--","--","--","SI",18.555074999999999]
[null,null,34,287193,5495,"CATAMARCA","TRAFO 3",30,"132/33/13,2",{"$f":"H28*$I$18","v":48.51},"2015-04-06T15:49:00","2015-04-06T16:02:00",0.21666666667442769,13,"F","NO","0,000","SI",{"$f":"$I$19*IF(R28=\"SI\",1,0.1)*IF(OR(O28=\"P\",O28=\"RP\"),0.1,1)","v":30},"--","--",1455.3,320.166,"--","--","--","--","SI",1775.4659999999999]
[null,null,35,287199,5495,"CATAMARCA","TRAFO 3",30,"132/33/13,2",{"$f":"H29*'T-04 (2)'!$I$18","v":48.51},"2015-04-06T16:03:00","2015-04-06T16:41:00",0.63333333347691223,38,"F","NO","0,000","NO",{"$f":"'T-04 (2)'!$I$19*IF(R29=\"SI\",1,0.1)*IF(OR(O29=\"P\",O29=\"RP\"),0.1,1)","v":3},"--","--",145.53,91.683900000000008,"--","--","--","--","SI",237.21390000000002]
[null,null,36,287201,5063,"QUIMILI","TRAFO 2",15,"132/33/13,2",{"$f":"H30*'T-04 (2)'!$I$18","v":24.254999999999999},"2015-04-07T09:49:00","2015-04-07T16:22:00",6.5499999998719431,393,"P","--","0,000","NO",{"$f":"'T-04 (2)'!$I$19*IF(R30=\"SI\",1,0.1)*IF(OR(O30=\"P\",O30=\"RP\"),0.1,1)","v":0.30000000000000004},47.661075000000004,"--","--","--","--","--","--","--","SI",47.661075000000004]
[null,null,37,287215,556,"LA BANDA ","TRAFO 1",30,"132/33/13,2",{"$f":"H31*'T-04 (2)'!$I$18","v":48.51},"2015-04-09T08:23:00","2015-04-09T16:01:00",7.6333333332440816,458,"RP","--",40,"NO",{"$f":"'T-04 (2)'!$I$19*IF(R31=\"SI\",1,0.1)*IF(OR(O31=\"P\",O31=\"RP\"),0.1,1)","v":0.30000000000000004},"--",44.415756000000002,"--","--","--","--","--","--","SI",44.415756000000002]
[null,null,38,287220,5130,"VALLE VIEJO","TRAFO 1",30,"132/33/13,2",{"$f":"H32*'T-04 (2)'!$I$18","v":48.51},"2015-04-12T00:46:00","2015-04-12T01:06:00",0.33333333319751546,20,"F","NO","0,000","SI",{"$f":"'T-04 (2)'!$I$19*IF(R32=\"SI\",1,0.1)*IF(OR(O32=\"P\",O32=\"RP\"),0.1,1)","v":30},"--","--",1455.3,480.24900000000002,"--","--","--","--","SI",1935.549]
[null,null,39,287221,3823,"LAS MADERAS","TRAFO 1",7.5,"132/33/13,2",{"$f":"H33*'T-04 (2)'!$I$18","v":12.1275},"2015-04-12T08:38:00","2015-04-12T14:33:00",5.9166666665696539,355,"P","--","0,000","NO",{"$f":"'T-04 (2)'!$I$19*IF(R33=\"SI\",1,0.1)*IF(OR(O33=\"P\",O33=\"RP\"),0.1,1)","v":0.30000000000000004},21.538440000000001,"--","--","--","--","--","--","--","SI",21.538440000000001]
[null,null,40,287222,4875,"LAS MADERAS","TRAFO 2",7.5,"132/33/13,2",{"$f":"H34*'T-04 (2)'!$I$18","v":12.1275},"2015-04-12T08:38:00","2015-04-12T14:33:00",5.9166666665696539,355,"P","--","0,000","NO",{"$f":"'T-04 (2)'!$I$19*IF(R34=\"SI\",1,0.1)*IF(OR(O34=\"P\",O34=\"RP\"),0.1,1)","v":0.30000000000000004},21.538440000000001,"--","--","--","--","--","--","--","SI",21.538440000000001]
[null,null,41,287224,3618,"TINOGASTA","TRAFO 1",7.5,"132/33/13,2",{"$f":"H35*'T-04 (2)'!$I$18","v":12.1275},"2015-04-12T09:29:00","2015-04-12T09:50:00",0.34999999991850927,21,"F","NO","0,000","SI",{"$f":"'T-04 (2)'!$I$19*IF(R35=\"SI\",1,0.1)*IF(OR(O35=\"P\",O35=\"RP\"),0.1,1)","v":30},"--","--",363.82499999999999,127.33874999999999,"--","--","--","--","SI",491.16374999999999]
[null,null,42,287232,2731,"TUCUMAN OESTE","TRAFO 1",30,"132/13,2",{"$f":"H36*'T-04 (2)'!$I$18","v":48.51},"2015-04-12T21:57:00","2015-04-12T22:21:00",0.40000000008149073,24,"F","NO","0,000","SI",{"$f":"'T-04 (2)'!$I$19*IF(R36=\"SI\",1,0.1)*IF(OR(O36=\"P\",O36=\"RP\"),0.1,1)","v":30},"--","--",1455.3,582.12,"--","--","--","--","SI",2037.42]
[null,null,null,null,null,null,null,null,null,{"$f":"H37*$I$18","v":0},null,null,null,null,null,"",null,null,{"$f":"$I$19*IF(R37=\"SI\",1,0.1)*IF(OR(O37=\"P\",O37=\"RP\"),0.1,1)","v":3},"--","--","--","--","--","--","--","--",null,""]
[]
[null,null,"(²)","P - PROGRAMADA  ; F - FORZADA  ; RP - REDUCCIÓN PROGRAMADA",null,null,null,null,null,null,null,null,null,null,null,null,null,null,null,{"$f":"SUM(T22:T38)","v":5400.6910650000009},44.415756000000002,4875.2550000000001,1601.55765,0,0,0,0,null,{"$f":"ROUND(SUM(AC22:AC38),2)","v":11921.92}]

{"sheet":"T-04 (2)","index":4,"n_rows":38,"n_cols":29,"rows_kept":38,"cut":false,"hidden":false,"merged":[]}
[]
[null,"ANEXO I   al Memorandum  D.T.E.E. N°  526      / 2016"]
[]
[" ENTE NACIONAL REGULADOR "]
["       DE LA ELECTRICIDAD"]
[]
[]
[null,null,null,null,null,"SISTEMA DE TRANSPORTE DE ENERGÍA ELÉCTRICA POR DISTRIBUCIÓN TRONCAL - TRANSNOA S.A."]
[]
[null,null,null,null,null,"2.- CONEXIÓN"]
[]
[null,null,null,null,null,"2.1.- Transformación"]
[]
[null,null,null,null,null,"2.1.1.- Equipamiento propio"]
[]
[null,{"$f":"'TOT-0415'!B14","v":"Desde el 01 al 30 de abril de 2015"}]
[]
[null,null,null,null,null,"Por Transformador por MVA    $ =",null,null,1.617]
[null,null,null,null,null,"Coeficiente de penalización por salida forzada   =",null,null,{"$f":"30*'TOT-0415'!B13","v":30},null,{"$f":"IF(I19=30,\" \",IF(I19=60,\"  Coeficiente duplicado por tasa de falla >4 Sal. x año/100 km.\",\"REVISAR COEFICIENTE\"))","v":" "}]
[null,null,3,4,5,6,7,8,9,10,11,12,13,14,15,16,17,18,19,20,21,22,23,24,25,26,27,28,29]
[null,null,"N°","INDISP","ID EQUIPO","ESTACIÓN\nTRANSFORMADORA","EQUIPO","POT.\n[MVA]","U\n[kV]","$/h","Salida","Entrada","Hs\nIndisp.","Mtos.\nIndisp.","Tipo \nSal.(²)","AUT.","C.R.\n%","E.N.S.","K (P;ENS)","PENALIZ.\nPROGRAM.","REDUCC.\nPROGRAM.","PENALIZAC. FORZADA\nPor Salida       hs. Restantes",null,"REDUCC. FORZADA\nPor Salida       hs. Restantes",null,"RESTANTE\nFORZADA","REDUCC.\nRESTANTE","Informó\nen Térm.","TOTAL\nPENALIZAC."]
[null,null,null,null,null,null,null,null,null,null,null,null,null,null,null,null,null,null,null,null,null,null,null,null,null,null,null,null,{"$f":"'T-04 (1)'!AC39","v":11921.92}]
[]
[null,null,43,287233,2731,"TUCUMAN OESTE","TRAFO 1",30,"132/13,2",{"$f":"H24*$I$18","v":48.51},"2015-04-12T22:22:00","2015-04-13T10:46:00",{"$f":"IF(F24=\"\",\"\",(L24-K24)*24)","v":12.400000000081491},{"$f":"IF(F24=\"\",\"\",ROUND((L24-K24)*24*60,0))","v":744},"F",{"$f":"IF(F24=\"\",\"\",IF(OR(O24=\"P\",O24=\"RP\"),\"--\",\"NO\"))","v":"NO"},"0,000","NO",{"$f":"$I$19*IF(R24=\"SI\",1,0.1)*IF(OR(O24=\"P\",O24=\"RP\"),0.1,1)","v":3},{"$f":"IF(O24=\"P\",J24*S24*ROUND(N24/60,2),\"--\")","v":"--"},{"$f":"IF(O24=\"RP\",J24*S24*Q24/100*ROUND(N24/60,2),\"--\")","v":"--"},{"$f":"IF(AND(O24=\"F\",P24=\"NO\"),J24*S24,\"--\")","v":145.53},{"$f":"IF(O24=\"F\",J24*S24*ROUND(N24/60,2),\"--\")","v":1804.5720000000001},{"$f":"IF(AND(O24=\"R\",P24=\"NO\"),J24*S24*Q24/100,\"--\")","v":"--"},{"$f":"IF(O24=\"R\",J24*S24*ROUND(N24/60,2)*Q24/100,\"--\")","v":"--"},{"$f":"IF(O24=\"RF\",J24*S24*ROUND(N24/60,2),\"--\")","v":"--"},{"$f":"IF(O24=\"RR\",J24*S24*ROUND(N24/60,2)*Q24/100,\"--\")","v":"--"},"SI",{"$f":"IF(F24=\"\",\"\",SUM(T24:AA24)*IF(AB24=\"SI\",1,2))","v":1950.1020000000001}]
[null,null,44,287469,2624,"TUCUMAN NORTE ","TRAFO 1",30,"132/33/13,2",48.51,"2015-04-14T09:14:00","2015-04-14T11:27:00",2.2166666665580124,133,"RP","--",40,"NO",0.30000000000000004,"--",12.923064000000002,"--","--","--","--","--","--","SI",12.923064000000002]
[null,null,45,287485,3618,"TINOGASTA","TRAFO 1",7.5,"132/33/13,2",12.1275,"2015-04-14T13:53:00","2015-04-14T14:12:00",0.31666666665114462,19,"R","NO",40,"SI",30,"--","--","--","--",145.53,46.569600000000001,"--","--","SI",192.09960000000001]
[null,null,46,287486,4812,"ROSARIO DE LA FRONTERA","TRAFO 1",30,"132/33/13,2",48.51,"2015-04-15T07:49:00","2015-04-15T12:10:00",4.3500000000349246,261,"RP","--",40,"NO",0.30000000000000004,"--",25.322219999999998,"--","--","--","--","--","--","SI",25.322219999999998]
[null,null,47,287487,2731,"TUCUMAN OESTE","TRAFO 1",30,"132/13,2",48.51,"2015-04-16T09:20:00","2015-04-16T12:12:00",2.8666666665812954,172,"P","--","0,000","NO",0.30000000000000004,41.767110000000002,"--","--","--","--","--","--","--","SI",41.767110000000002]
[null,null,48,287493,5495,"CATAMARCA","TRAFO 3",30,"132/33/13,2",48.51,"2015-04-16T10:20:00","2015-04-16T10:43:00",0.38333333336049691,23,"R","NO",60,"SI",30,"--","--","--","--",873.18,331.80840000000006,"--","--","SI",1204.9884]
[null,null,49,287497,540,"C.H. RIO HONDO ","TRAFO 1",10,"132/33/13,2",16.170000000000002,"2015-04-16T12:15:00","2015-04-16T12:21:00",9.9999999976716936E-2,6,"F","NO","0,000","SI",30,"--","--",485.1,48.510000000000005,"--","--","--","--","SI",533.61]
[null,null,50,287498,5232,"C.H. RIO HONDO ","TRAFO 2",15,"132/33/13,2",24.254999999999999,"2015-04-16T12:15:00","2015-04-16T12:24:00",0.15000000013969839,9,"F","NO","0,000","SI",30,"--","--",727.65,109.14749999999999,"--","--","--","--","SI",836.79750000000001]
[null,null,51,287499,540,"C.H. RIO HONDO ","TRAFO 1",10,"132/33/13,2",16.170000000000002,"2015-04-16T16:51:00","2015-04-16T18:16:00",1.4166666667442769,85,"F","NO","0,000","NO",3,"--","--",48.510000000000005,68.884200000000007,"--","--","--","--","SI",117.39420000000001]
[null,null,52,287514,4555,"ANATUYA","TRAFO 1",20,"132/33/13,2",32.340000000000003,"2015-04-18T19:48:00","2015-04-18T20:14:00",0.43333333334885538,26,"R","NO",60,"NO",3,"--","--","--","--",58.21200000000001,25.03116,"--","--","SI",83.243160000000017]
[null,null,53,287516,542,"ESTATICA SUR ","TRAFO 1",30,"132/13,2",48.51,"2015-04-19T07:57:00","2015-04-19T17:56:00",9.9833333332207985,599,"P","--","0,000","NO",0.30000000000000004,145.23894000000001,"--","--","--","--","--","--","--","SI",145.23894000000001]
[null,null,54,287517,544,"ESTATICA SUR ","TRAFO 2",30,"132/13,2",48.51,"2015-04-19T07:57:00","2015-04-19T17:57:00",9.9999999999417923,600,"P","--","0,000","NO",0.30000000000000004,145.53,"--","--","--","--","--","--","--","SI",145.53]
[null,null,null,null,null,null,null,null,null,null,null,null,null,null,null,"",null,null,3,"--","--","--","--","--","--","--","--",null,""]
[]
[null,null,"(²)","P - PROGRAMADA  ; F - FORZADA  ; RP - REDUCCIÓN PROGRAMADA  ; R - REDUCCIÓN FORZADA",null,null,null,null,null,null,null,null,null,null,null,null,null,null,null,{"$f":"SUM(T22:T37)","v":332.53605000000005},38.245283999999998,1406.79,2031.1137000000001,1076.922,403.40916000000004,0,0,null,{"$f":"ROUND(SUM(AC22:AC37),2)","v":17210.939999999999}]

{"sheet":"T-04 (3)","index":5,"n_rows":39,"n_cols":29,"rows_kept":39,"cut":false,"hidden":false,"merged":[]}
[]
[null,"ANEXO I   al Memorandum  D.T.E.E. N° 526   / 2016"]
[]
[" ENTE NACIONAL REGULADOR "]
["       DE LA ELECTRICIDAD"]
[]
[]
[null,null,null,null,null,"SISTEMA DE TRANSPORTE DE ENERGÍA ELÉCTRICA POR DISTRIBUCIÓN TRONCAL - TRANSNOA S.A."]
[]
[null,null,null,null,null,"2.- CONEXIÓN"]
[]
[null,null,null,null,null,"2.1.- Transformación"]
[]
[null,null,null,null,null,"2.1.1.- Equipamiento propio"]
[]
[null,{"$f":"'TOT-0415'!B14","v":"Desde el 01 al 30 de abril de 2015"}]
[]
[null,null,null,null,null,"Por Transformador por MVA    $ =",null,null,1.617]
[null,null,null,null,null,"Coeficiente de penalización por salida forzada   =",null,null,{"$f":"30*'TOT-0415'!B13","v":30},null,{"$f":"IF(I19=30,\" \",IF(I19=60,\"  Coeficiente duplicado por tasa de falla >4 Sal. x año/100 km.\",\"REVISAR COEFICIENTE\"))","v":" "}]
[null,null,3,4,5,6,7,8,9,10,11,12,13,14,15,16,17,18,19,20,21,22,23,24,25,26,27,28,29]
[null,null,"N°","INDISP","ID EQUIPO","ESTACIÓN\nTRANSFORMADORA","EQUIPO","POT.\n[MVA]","U\n[kV]","$/h","Salida","Entrada","Hs\nIndisp.","Mtos.\nIndisp.","Tipo \nSal.(²)","AUT.","C.R.\n%","E.N.S.","K (P;ENS)","PENALIZ.\nPROGRAM.","REDUCC.\nPROGRAM.","PENALIZAC. FORZADA\nPor Salida       hs. Restantes",null,"REDUCC. FORZADA\nPor Salida       hs. Restantes",null,"RESTANTE\nFORZADA","REDUCC.\nRESTANTE","Informó\nen Térm.","TOTAL\nPENALIZAC."]
[null,null,null,null,null,null,null,null,null,null,null,null,null,null,null,null,null,null,null,null,null,null,null,null,null,null,null,null,{"$f":"'T-04 (2)'!AC38","v":17210.939999999999}]
[]
[null,null,55,287724,2742,"TUCUMAN OESTE ","TRAFO 2",30,"132/33/13,2",{"$f":"H24*$I$18","v":48.51},"2015-04-20T10:23:00","2015-04-20T14:58:00",{"$f":"IF(F24=\"\",\"\",(L24-K24)*24)","v":4.5833333334303461},{"$f":"IF(F24=\"\",\"\",ROUND((L24-K24)*24*60,0))","v":275},"F",{"$f":"IF(F24=\"\",\"\",IF(OR(O24=\"P\",O24=\"RP\"),\"--\",\"NO\"))","v":"NO"},"0,000","NO",{"$f":"$I$19*IF(R24=\"SI\",1,0.1)*IF(OR(O24=\"P\",O24=\"RP\"),0.1,1)","v":3},{"$f":"IF(O24=\"P\",J24*S24*ROUND(N24/60,2),\"--\")","v":"--"},{"$f":"IF(O24=\"RP\",J24*S24*Q24/100*ROUND(N24/60,2),\"--\")","v":"--"},{"$f":"IF(AND(O24=\"F\",P24=\"NO\"),J24*S24,\"--\")","v":145.53},{"$f":"IF(O24=\"F\",J24*S24*ROUND(N24/60,2),\"--\")","v":666.52740000000006},{"$f":"IF(AND(O24=\"R\",P24=\"NO\"),J24*S24*Q24/100,\"--\")","v":"--"},{"$f":"IF(O24=\"R\",J24*S24*ROUND(N24/60,2)*Q24/100,\"--\")","v":"--"},{"$f":"IF(O24=\"RF\",J24*S24*ROUND(N24/60,2),\"--\")","v":"--"},{"$f":"IF(O24=\"RR\",J24*S24*ROUND(N24/60,2)*Q24/100,\"--\")","v":"--"},"SI",{"$f":"IF(F24=\"\",\"\",SUM(T24:AA24)*IF(AB24=\"SI\",1,2))","v":812.05740000000003}]
[null,null,56,287725,5266,"TUCUMAN OESTE ","TRAFO3",30,"132/33/13,2",{"$f":"H25*$I$18","v":48.51},"2015-04-20T10:40:00","2015-04-20T11:19:00",{"$f":"IF(F25=\"\",\"\",(L25-K25)*24)","v":0.65000000002328306},{"$f":"IF(F25=\"\",\"\",ROUND((L25-K25)*24*60,0))","v":39},"R",{"$f":"IF(F25=\"\",\"\",IF(OR(O25=\"P\",O25=\"RP\"),\"--\",\"NO\"))","v":"NO"},60,"NO",{"$f":"$I$19*IF(R25=\"SI\",1,0.1)*IF(OR(O25=\"P\",O25=\"RP\"),0.1,1)","v":3},{"$f":"IF(O25=\"P\",J25*S25*ROUND(N25/60,2),\"--\")","v":"--"},{"$f":"IF(O25=\"RP\",J25*S25*Q25/100*ROUND(N25/60,2),\"--\")","v":"--"},{"$f":"IF(AND(O25=\"F\",P25=\"NO\"),J25*S25,\"--\")","v":"--"},{"$f":"IF(O25=\"F\",J25*S25*ROUND(N25/60,2),\"--\")","v":"--"},{"$f":"IF(AND(O25=\"R\",P25=\"NO\"),J25*S25*Q25/100,\"--\")","v":87.317999999999998},{"$f":"IF(O25=\"R\",J25*S25*ROUND(N25/60,2)*Q25/100,\"--\")","v":56.756700000000009},{"$f":"IF(O25=\"RF\",J25*S25*ROUND(N25/60,2),\"--\")","v":"--"},{"$f":"IF(O25=\"RR\",J25*S25*ROUND(N25/60,2)*Q25/100,\"--\")","v":"--"},"SI",{"$f":"IF(F25=\"\",\"\",SUM(T25:AA25)*IF(AB25=\"SI\",1,2))","v":144.07470000000001}]
[null,null,57,287730,5446,"CHAMICAL","TRAFO 1",30,"132/33/13,2",48.51,"2015-04-21T14:26:00","2015-04-21T17:44:00",3.2999999999301508,198,"RP","--",60,"SI",3,"--",288.14939999999996,"--","--","--","--","--","--","SI",288.14939999999996]
[null,null,58,287734,4484,"AGUA BLANCA","TRP1",30,"132/33/13,2",48.51,"2015-04-23T08:59:00","2015-04-23T14:15:00",5.2666666667209938,316,"P","--","0,000","NO",0.30000000000000004,76.694310000000002,"--","--","--","--","--","--","--","SI",76.694310000000002]
[null,null,59,287737,5090,"ESTATICA","TRAFO 3",15,"132/33/13,2",24.254999999999999,"2015-04-24T09:12:00","2015-04-24T13:04:00",3.8666666666977108,232,"RP","--",60,"NO",0.30000000000000004,"--",16.896032999999999,"--","--","--","--","--","--","SI",16.896032999999999]
[null,null,60,287739,573,"SAN JUANCITO","TRAFO 1",15,"132/33/13,2",24.254999999999999,"2015-04-25T08:52:00","2015-04-25T14:24:00",5.53333333338378,332,"RP","--",40,"NO",0.30000000000000004,"--",16.095618000000002,"--","--","--","--","--","--","SI",16.095618000000002]
[null,null,61,287740,5332,"COPO","TRAFO 1",15,"132/33/13,2",24.254999999999999,"2015-04-26T16:17:00","2015-04-26T17:04:00",0.78333333326736465,47,"F","NO","0,000","SI",30,"--","--",727.65,567.56700000000001,"--","--","--","--","SI",1295.2170000000001]
[null,null,62,287743,5332,"COPO","TRAFO 1",15,"132/33/13,2",24.254999999999999,"2015-04-26T17:05:00","2015-04-30T12:32:00",91.450000000011642,5487,"F","NO","0,000","NO",3,"--","--",72.765000000000001,6654.3592500000004,"--","--","--","--","SI",6727.1242500000008]
[null,null,null,null,null,null,null,null,null,0,null,null,"","",null,"",{"$f":"IF(F32=\"\",\"\",\"--\")","v":""},null,3,"--","--","--","--","--","--","--","--",{"$f":"IF(F32=\"\",\"\",\"SI\")","v":""},""]
[null,null,null,null,null,null,null,null,null,0,null,null,"","",null,"","",null,3,"--","--","--","--","--","--","--","--","",""]
[null,null,null,null,null,null,null,null,null,0,null,null,"","",null,"","",null,3,"--","--","--","--","--","--","--","--","",""]
[null,null,null,null,null,null,null,null,null,0,null,null,"","",null,"","",null,3,"--","--","--","--","--","--","--","--","",""]
[null,null,null,null,null,null,null,null,null,0,null,null,{"$f":"IF(F36=\"\",\"\",(L36-K36)*24)","v":""},{"$f":"IF(F36=\"\",\"\",ROUND((L36-K36)*24*60,0))","v":""},null,"","",null,{"$f":"$I$19*IF(R36=\"SI\",1,0.1)*IF(OR(O36=\"P\",O36=\"RP\"),0.1,1)","v":3},{"$f":"IF(O36=\"P\",J36*S36*ROUND(N36/60,2),\"--\")","v":"--"},{"$f":"IF(O36=\"RP\",J36*S36*Q36/100*ROUND(N36/60,2),\"--\")","v":"--"},{"$f":"IF(AND(O36=\"F\",P36=\"NO\"),J36*S36,\"--\")","v":"--"},{"$f":"IF(O36=\"F\",J36*S36*ROUND(N36/60,2),\"--\")","v":"--"},{"$f":"IF(AND(O36=\"R\",P36=\"NO\"),J36*S36*Q36/100,\"--\")","v":"--"},{"$f":"IF(O36=\"R\",J36*S36*ROUND(N36/60,2)*Q36/100,\"--\")","v":"--"},{"$f":"IF(O36=\"RF\",J36*S36*ROUND(N36/60,2),\"--\")","v":"--"},{"$f":"IF(O36=\"RR\",J36*S36*ROUND(N36/60,2)*Q36/100,\"--\")","v":"--"},"",{"$f":"IF(F36=\"\",\"\",SUM(T36:AA36)*IF(AB36=\"SI\",1,2))","v":""}]
[null,null,null,null,null,null,null,null,null,0,null,null,{"$f":"IF(F37=\"\",\"\",(L37-K37)*24)","v":""},{"$f":"IF(F37=\"\",\"\",ROUND((L37-K37)*24*60,0))","v":""},null,"","",null,{"$f":"$I$19*IF(R37=\"SI\",1,0.1)*IF(OR(O37=\"P\",O37=\"RP\"),0.1,1)","v":3},{"$f":"IF(O37=\"P\",J37*S37*ROUND(N37/60,2),\"--\")","v":"--"},{"$f":"IF(O37=\"RP\",J37*S37*Q37/100*ROUND(N37/60,2),\"--\")","v":"--"},{"$f":"IF(AND(O37=\"F\",P37=\"NO\"),J37*S37,\"--\")","v":"--"},{"$f":"IF(O37=\"F\",J37*S37*ROUND(N37/60,2),\"--\")","v":"--"},{"$f":"IF(AND(O37=\"R\",P37=\"NO\"),J37*S37*Q37/100,\"--\")","v":"--"},{"$f":"IF(O37=\"R\",J37*S37*ROUND(N37/60,2)*Q37/100,\"--\")","v":"--"},{"$f":"IF(O37=\"RF\",J37*S37*ROUND(N37/60,2),\"--\")","v":"--"},{"$f":"IF(O37=\"RR\",J37*S37*ROUND(N37/60,2)*Q37/100,\"--\")","v":"--"},"",{"$f":"IF(F37=\"\",\"\",SUM(T37:AA37)*IF(AB37=\"SI\",1,2))","v":""}]
[]
[null,null,"(²)","P - PROGRAMADA  ; F - FORZADA  ; RP - REDUCCIÓN PROGRAMADA  ; R - REDUCCIÓN FORZADA",null,null,null,null,null,null,null,null,null,null,null,null,null,null,null,{"$f":"SUM(T22:T38)","v":76.694310000000002},321.14105099999995,945.94499999999994,7888.4536500000004,87.317999999999998,56.756700000000009,0,0,null,{"$f":"ROUND(SUM(AC22:AC38),2)","v":26587.25}]

{"sheet":"LI-RIOJA-04 (1)","index":6,"n_rows":42,"n_cols":27,"rows_kept":42,"cut":false,"hidden":false,"merged":[]}
[]
[null,"ANEXO I   al Memorandum  D.T.E.E. N°  526   / 2016"]
[]
[" ENTE NACIONAL REGULADOR "]
["       DE LA ELECTRICIDAD"]
[]
[]
[null,null,null,null,null,"SISTEMA DE TRANSPORTE DE ENERGÍA ELÉCTRICA POR DISTRIBUCIÓN TRONCAL - TRANSNOA S.A."]
[]
[null,null,null,null,null,"1.- LÍNEAS"]
[]
[null,null,null,null,null,"1.2.- Transportista Independiente TRANSPORTEL La Rioja Sur"]
[]
[null,{"$f":"'TOT-0415'!B14","v":"Desde el 01 al 30 de abril de 2015"}]
[]
[null,null,null,null,null,"$/100 km-h : LINEAS 132 kV ",62.8386,null,null,null,"FACTOR DE PENALIZACION  K =",{"$f":"30*'TOT-0415'!B13","v":30},{"$f":"IF(L16=30,\" \",IF(L16=60,\"Coeficiente duplicado por tasa de falla >4 Sal. x año/100 km.\",\"REVISAR COEFICIENTE\"))","v":" "}]
[null,null,3,4,5,6,7,8,9,10,11,12,13,14,15,16,17,18,19,20,21,22,23,24,25,26,27]
[null,null,"N°","INDISP","ID EQUIPO","LÍNEAS","U\n[kV]","Long.\n[km]","$/h","Salida","Entrada","Hs. \nIndisp","Minutos\nIndisp.","Tipo \nSal.(²)","C.R.\n%","PENALIZ.\nPROGRAM.","REDUCC.\nPROGRAM.","PENALIZACION FORZADA\nPor Salida    1ras. 3 hs.   hs. Restantes",null,null,"REDUCC. FORZADA\nPor Salida     1ras. 3 hs.     hs. Restantes",null,null,"RESTANTE\nFORZADA","REDUCC.\nRESTANTE","Informó\nen Térm.","TOTAL\nPENALIZAC."]
[]
[]
[null,null,63,287091,4942,"LA RIOJA SUR P.I.PATQUIA",132,40,{"$f":"$G$16/100*IF(H21>25,H21,25)","v":25.135439999999999},"2015-04-04T07:09:00","2015-04-04T09:20:00",{"$f":"IF(F21=\"\",\"\",(K21-J21)*24)","v":2.1833333332906477},{"$f":"IF(F21=\"\",\"\",ROUND((K21-J21)*24*60,0))","v":131},"F",{"$f":"IF(F21=\"\",\"\",\"--\")","v":"--"},{"$f":"IF(N21=\"P\",ROUND(M21/60,2)*I21*$L$16*0.01,\"--\")","v":"--"},{"$f":"IF(N21=\"RP\",I21*O21*ROUND(L21/60,2)*0.01*M21/100,\"--\")","v":"--"},{"$f":"IF(N21=\"F\",I21*$L$16,\"--\")","v":754.06319999999994},{"$f":"IF(AND(M21>10,N21=\"F\"),I21*$L$16*IF(M21>180,3,ROUND((M21)/60,2)),\"--\")","v":1643.8577760000001},{"$f":"IF(AND(M21>180,N21=\"F\"),(ROUND(M21/60,2)-3)*I21*$L$16*0.1,\"--\")","v":"--"},{"$f":"IF(N21=\"R\",I21*$L$16*O21/100,\"--\")","v":"--"},{"$f":"IF(AND(M21>10,N21=\"R\"),I21*$L$16*O21/100*IF(M21>180,3,ROUND(M21/60,2)),\"--\")","v":"--"},{"$f":"IF(AND(M21>180,N21=\"R\"),(ROUND(M21/60,2)-3)*I21*$L$16*0.1*O21/100,\"--\")","v":"--"},{"$f":"IF(N21=\"RF\",ROUND(M21/60,2)*I21*$L$16*0.1,\"--\")","v":"--"},{"$f":"IF(N21=\"RR\",ROUND(M21/60,2)*I21*$L$16*0.1*O21/100,\"--\")","v":"--"},"SI",{"$f":"IF(F21=\"\",\"\",SUM(P21:Y21)*IF(Z21=\"SI\",1,2))","v":2397.9209759999999}]
[null,null,64,287471,4942,"LA RIOJA SUR P.I.PATQUIA",132,40,25.135439999999999,"2015-04-14T11:45:00","2015-04-14T12:14:00",0.48333333333721384,29,"F","--","--","--",754.06319999999994,361.95033599999994,"--","--","--","--","--","--","SI",1116.0135359999999]
[null,null,null,null,null,null,null,null,15.70965,null,null,"","",null,"","--","--","--","--","--","--","--","--","--","--",{"$f":"IF(F23=\"\",\"\",\"SI\")","v":""},""]
[null,null,null,null,null,null,null,null,15.70965,null,null,"","",null,"","--","--","--","--","--","--","--","--","--","--","",""]
[null,null,null,null,null,null,null,null,15.70965,null,null,"","",null,"","--","--","--","--","--","--","--","--","--","--","",""]
[null,null,null,null,null,null,null,null,15.70965,null,null,"","",null,"","--","--","--","--","--","--","--","--","--","--","",""]
[null,null,null,null,null,null,null,null,15.70965,null,null,"","",null,"","--","--","--","--","--","--","--","--","--","--","",""]
[null,null,null,null,null,null,null,null,15.70965,null,null,"","",null,"","--","--","--","--","--","--","--","--","--","--","",""]
[null,null,null,null,null,null,null,null,15.70965,null,null,"","",null,"","--","--","--","--","--","--","--","--","--","--","",""]
[null,null,null,null,null,null,null,null,15.70965,null,null,"","",null,"","--","--","--","--","--","--","--","--","--","--","",""]
[null,null,null,null,null,null,null,null,15.70965,null,null,"","",null,"","--","--","--","--","--","--","--","--","--","--","",""]
[null,null,null,null,null,null,null,null,15.70965,null,null,"","",null,"","--","--","--","--","--","--","--","--","--","--","",""]
[null,null,null,null,null,null,null,null,15.70965,null,null,"","",null,"","--","--","--","--","--","--","--","--","--","--","",""]
[null,null,null,null,null,null,null,null,15.70965,null,null,"","",null,"","--","--","--","--","--","--","--","--","--","--","",""]
[null,null,null,null,null,null,null,null,15.70965,null,null,"","",null,"","--","--","--","--","--","--","--","--","--","--","",""]
[null,null,null,null,null,null,null,null,15.70965,null,null,"","",null,"","--","--","--","--","--","--","--","--","--","--","",""]
[null,null,null,null,null,null,null,null,15.70965,null,null,"","",null,"","--","--","--","--","--","--","--","--","--","--","",""]
[null,null,null,null,null,null,null,null,15.70965,null,null,"","",null,"","--","--","--","--","--","--","--","--","--","--","",""]
[null,null,null,null,null,null,null,null,15.70965,null,null,"","",null,"","--","--","--","--","--","--","--","--","--","--","",""]
[null,null,null,null,null,null,null,null,15.70965,null,null,"","",null,"","--","--","--","--","--","--","--","--","--","--","",""]
[]
[null,null,"(²)","F - FORZADA",null,null,null,null,null,null,null,null,null,null,null,{"$f":"SUM(P19:P41)","v":0},0,1508.1263999999999,2005.8081119999999,0,0,0,0,0,0,null,{"$f":"ROUND(SUM(AA19:AA41),2)","v":3513.93}]

{"sheet":"CAUSAS-VST-04 (1)","index":7,"n_rows":41,"n_cols":7,"rows_kept":41,"cut":false,"hidden":false,"merged":[]}
[]
[null,"ANEXO I   al Memorandum  D.T.E.E. N°  526  / 2016"]
[]
["ENTE NACIONAL REGULADOR "]
["        DE LA ELECTRICIDAD"]
[]
[]
[null,null,null,null,null,"SISTEMA DE TRANSPORTE DE ENERGÍA ELÉCTRICA POR DISTRIBUCIÓN TRONCAL - TRANSNOA S.A."]
[]
[]
[null,null,null,null,null,null,"Indisponibilidades Descartadas por Causa \"Vinculado y Sin Tensión\""]
[]
[]
[null,{"$f":"'TOT-0415'!B14","v":"Desde el 01 al 30 de abril de 2015"}]
[]
[]
[null,null,"Id","ID EQUIPO","INDISP","AGENTE","CAUSA"]
[]
[null,null,65,5444,287078,"TRANSNOA","VINCULADO Y SIN TENSION : Descarga atmosférica en cercanías de la ET La Rioja Norte"]
[null,null,66,5445,287079,"TRANSNOA","VINCULADO Y SIN TENSION : Descarga atmosférica en cercanías de la ET La Rioja Norte"]
[null,null,67,5451,287080,"TRANSNOA","VINCULADO Y SIN TENSION : Descarga atmosférica en cercanías de la ET La Rioja Norte"]
[null,null,68,5452,287081,"TRANSNOA","VINCULADO Y SIN TENSION : Descarga atmosférica en cercanías de la ET La Rioja Norte"]
[null,null,69,5437,287082,"TRANSNOA","VINCULADO Y SIN TENSION : Descarga atmosférica en cercanías de la ET La Rioja Norte"]
[null,null,70,5442,287084,"TRANSNOA","VINCULADO Y SIN TENSION : Falla de aislación debido a fuerte tormenta en la zona"]
[null,null,71,5441,287085,"TRANSNOA","VINCULADO Y SIN TENSION : Falla de aislación debido a fuerte tormenta en la zona"]
[null,null,72,5446,287086,"TRANSNOA","VINCULADO Y SIN TENSION : Falla de aislación debido a fuerte tormenta en la zona"]
[null,null,73,5447,287087,"TRANSNOA","VINCULADO Y SIN TENSION : Falla de aislación debido a fuerte tormenta en la zona"]
[null,null,74,5448,287088,"TRANSNOA","VINCULADO Y SIN TENSION : Falla de aislación debido a fuerte tormenta en la zona"]
[null,null,75,5449,287089,"TRANSNOA","VINCULADO Y SIN TENSION : Falla de aislación debido a fuerte tormenta en la zona"]
[null,null,76,5443,287090,"TRANSNOA","VINCULADO Y SIN TENSION : Falla de aislación debido a fuerte tormenta en la zona"]
[null,null,77,5450,287092,"TRANSNOA","VINCULADO Y SIN TENSION : Falla de aislación debido a fuerte tormenta en la zona"]
[null,null,78,339,287194,"TRANSNOA","VINCULADO Y SIN TENSION: Actuación de respaldo ante falla en el distribuidor Mota Botello en 13.2 Kv"]
[null,null,79,335,287195,"TRANSNOA","VINCULADO Y SIN TENSION: Actuación de respaldo ante falla en el distribuidor Mota Botello en 13.2 Kv"]
[null,null,80,334,287196,"TRANSNOA","VINCULADO Y SIN TENSION: Actuación de respaldo ante falla en el distribuidor Mota Botello en 13.2 Kv"]
[null,null,81,342,287197,"TRANSNOA","VINCULADO Y SIN TENSION: Actuación de respaldo ante falla en el distribuidor Mota Botello en 13.2 Kv"]
[null,null,82,336,287198,"TRANSNOA","VINCULADO Y SIN TENSION: Actuación de respaldo ante falla en el distribuidor Mota Botello en 13.2 Kv"]
[null,null,83,534,287203,"TRANSNOA","VINCULADO Y SIN TENSION :Ruptura del guardamotor del interruptor de 132 kV salida Villa Quinteros"]
[null,null,84,5140,287204,"TRANSNOA","VINCULADO Y SIN TENSION :Ruptura del guardamotor del interruptor de 132 kV salida Villa Quinteros"]
[null,null,85,323,287205,"TRANSNOA","VINCULADO Y SIN TENSION :Ruptura del guardamotor del interruptor de 132 kV salida Villa Quinteros"]
[null,null,86,322,287206,"TRANSNOA","VINCULADO Y SIN TENSION :Ruptura del guardamotor del interruptor de 132 kV salida Villa Quinteros"]
[null,null,87,326,287207,"TRANSNOA","VINCULADO Y SIN TENSION :Ruptura del guardamotor del interruptor de 132 kV salida Villa Quinteros"]

{"sheet":"CAUSAS-VST-04 (2)","index":8,"n_rows":42,"n_cols":7,"rows_kept":42,"cut":false,"hidden":false,"merged":[]}
[]
[null,"ANEXO I   al Memorandum  D.T.E.E. N°  526  / 2016"]
[]
["ENTE NACIONAL REGULADOR "]
["        DE LA ELECTRICIDAD"]
[]
[]
[null,null,null,null,null,"SISTEMA DE TRANSPORTE DE ENERGÍA ELÉCTRICA POR DISTRIBUCIÓN TRONCAL - TRANSNOA S.A."]
[]
[]
[null,null,null,null,null,null,"Indisponibilidades Descartadas por Causa \"Vinculado y Sin Tensión\""]
[]
[]
[null,{"$f":"'TOT-0415'!B14","v":"Desde el 01 al 30 de abril de 2015"}]
[]
[]
[null,null,"Id","ID EQUIPO","INDISP","AGENTE","CAUSA"]
[]
[null,null,88,327,287208,"TRANSNOA","VINCULADO Y SIN TENSION :Ruptura del guardamotor del interruptor de 132 kV salida Villa Quinteros"]
[null,null,89,324,287209,"TRANSNOA","VINCULADO Y SIN TENSION :Ruptura del guardamotor del interruptor de 132 kV salida Villa Quinteros"]
[null,null,90,325,287210,"TRANSNOA","VINCULADO Y SIN TENSION :Ruptura del guardamotor del interruptor de 132 kV salida Villa Quinteros"]
[null,null,91,321,287211,"TRANSNOA","VINCULADO Y SIN TENSION :Ruptura del guardamotor del interruptor de 132 kV salida Villa Quinteros"]
[null,null,92,3600,287212,"TRANSNOA","VINCULADO Y SIN TENSION :Ruptura del guardamotor del interruptor de 132 kV salida Villa Quinteros"]
[null,null,93,320,287213,"TRANSNOA","VINCULADO Y SIN TENSION :Ruptura del guardamotor del interruptor de 132 kV salida Villa Quinteros"]
[null,null,94,5131,287218,"TRANSNOA","VINCULADO Y SIN TENSION :  Descarga atmosférica en LAT 132 kV Huacra – Catamarca."]
[null,null,95,5132,287219,"TRANSNOA","VINCULADO Y SIN TENSION :  Descarga atmosférica en LAT 132 kV Huacra – Catamarca."]
[null,null,96,3620,287223,"TRANSNOA","VINCULADO Y SIN TENSION :  Aún se investigan."]
[null,null,97,2736,287225,"TRANSNOA","VINCULADO Y SIN TENSION : Falla de aislación en aislador soporte a barras en 13.2 kV."]
[null,null,98,2733,287226,"TRANSNOA","VINCULADO Y SIN TENSION : Falla de aislación en aislador soporte a barras en 13.2 kV."]
[null,null,99,3835,287227,"TRANSNOA","VINCULADO Y SIN TENSION : Falla de aislación en aislador soporte a barras en 13.2 kV."]
[null,null,100,2743,287228,"TRANSNOA","VINCULADO Y SIN TENSION : Falla de aislación en aislador soporte a barras en 13.2 kV."]
[null,null,101,2732,287229,"TRANSNOA","VINCULADO Y SIN TENSION : Falla de aislación en aislador soporte a barras en 13.2 kV."]
[null,null,102,4987,287230,"TRANSNOA","VINCULADO Y SIN TENSION : Falla de aislación en aislador soporte a barras en 13.2 kV."]
[null,null,103,4850,287231,"TRANSNOA","VINCULADO Y SIN TENSION : Falla de aislación en aislador soporte a barras en 13.2 kV."]
[null,null,104,5446,287472,"TRANSNOA","VINCULADO Y SIN TENSION : Ruptura dieléctrica de aislador orgánico en playa de 132 kV de ET Chamical"]
[null,null,105,5447,287473,"TRANSNOA","VINCULADO Y SIN TENSION : Ruptura dieléctrica de aislador orgánico en playa de 132 kV de ET Chamical"]
[null,null,106,5448,287474,"TRANSNOA","VINCULADO Y SIN TENSION : Ruptura dieléctrica de aislador orgánico en playa de 132 kV de ET Chamical"]
[null,null,107,5449,287475,"TRANSNOA","VINCULADO Y SIN TENSION : Ruptura dieléctrica de aislador orgánico en playa de 132 kV de ET Chamical"]
[null,null,108,5442,287476,"TRANSNOA","VINCULADO Y SIN TENSION : Ruptura dieléctrica de aislador orgánico en playa de 132 kV de ET Chamical"]
[null,null,109,5441,287477,"TRANSNOA","VINCULADO Y SIN TENSION : Ruptura dieléctrica de aislador orgánico en playa de 132 kV de ET Chamical"]
[null,null,110,5443,287478,"TRANSNOA","VINCULADO Y SIN TENSION : Ruptura dieléctrica de aislador orgánico en playa de 132 kV de ET Chamical"]
[null,null,111,5450,287479,"TRANSNOA","VINCULADO Y SIN TENSION : Ruptura dieléctrica de aislador orgánico en playa de 132 kV de ET Chamical"]

{"sheet":"CAUSAS-VST-04 (3)","index":9,"n_rows":42,"n_cols":7,"rows_kept":42,"cut":false,"hidden":false,"merged":[]}
[]
[null,"ANEXO I   al Memorandum  D.T.E.E. N°  526  / 2016"]
[]
["ENTE NACIONAL REGULADOR "]
["        DE LA ELECTRICIDAD"]
[]
[]
[null,null,null,null,null,"SISTEMA DE TRANSPORTE DE ENERGÍA ELÉCTRICA POR DISTRIBUCIÓN TRONCAL - TRANSNOA S.A."]
[]
[]
[null,null,null,null,null,null,"Indisponibilidades Descartadas por Causa \"Vinculado y Sin Tensión\""]
[]
[]
[null,{"$f":"'TOT-0415'!B14","v":"Desde el 01 al 30 de abril de 2015"}]
[]
[]
[null,null,"Id","ID EQUIPO","INDISP","AGENTE","CAUSA"]
[]
[null,null,112,5131,287480,"TRANSNOA","VINCULADO Y SIN TENSION : Falla fugitiva de aislación en LAT 132 kV Huacra – Catamarca."]
[null,null,113,5132,287481,"TRANSNOA","VINCULADO Y SIN TENSION : Falla fugitiva de aislación en LAT 132 kV Huacra – Catamarca."]
[null,null,114,5130,287483,"TRANSNOA","VINCULADO Y SIN TENSION : Falla fugitiva de aislación en LAT 132 kV Huacra – Catamarca."]
[null,null,115,3620,287484,"TRANSNOA","VINCULADO Y SIN TENSION :  Actuación de respaldo ante falla de aislación en el distribuidor Fiambalá 33 kV."]
[null,null,116,339,287488,"TRANSNOA","VINCULADO Y SIN TENSION : Actuación de respaldo ante conductor cortado en el distribuidor Esquiú en 13.2 kV"]
[null,null,117,335,287489,"TRANSNOA","VINCULADO Y SIN TENSION : Actuación de respaldo ante conductor cortado en el distribuidor Esquiú en 13.2 kV"]
[null,null,118,334,287490,"TRANSNOA","VINCULADO Y SIN TENSION : Actuación de respaldo ante conductor cortado en el distribuidor Esquiú en 13.2 kV"]
[null,null,119,342,287491,"TRANSNOA","VINCULADO Y SIN TENSION : Actuación de respaldo ante conductor cortado en el distribuidor Esquiú en 13.2 kV"]
[null,null,120,336,287492,"TRANSNOA","VINCULADO Y SIN TENSION : Actuación de respaldo ante conductor cortado en el distribuidor Esquiú en 13.2 kV"]
[null,null,121,346,287494,"TRANSNOA","VINCULADO Y SIN TENSION : Actuación del relé de flujo de RBC del Trafo Nº 1"]
[null,null,122,347,287495,"TRANSNOA","VINCULADO Y SIN TENSION : Actuación del relé de flujo de RBC del Trafo Nº 1"]
[null,null,123,348,287496,"TRANSNOA","VINCULADO Y SIN TENSION : Actuación del relé de flujo de RBC del Trafo Nº 1"]
[null,null,124,450,287501,"TRANSNOA","VINCULADO Y SIN TENSION :Aislador orgánico deteriorado en el piquete Nº 166"]
[null,null,125,451,287502,"TRANSNOA","VINCULADO Y SIN TENSION :Aislador orgánico deteriorado en el piquete Nº 166"]
[null,null,126,449,287505,"TRANSNOA","VINCULADO Y SIN TENSION :Aislador orgánico deteriorado en el piquete Nº 166"]
[null,null,127,447,287506,"TRANSNOA","VINCULADO Y SIN TENSION :Aislador orgánico deteriorado en el piquete Nº 166"]
[null,null,128,448,287507,"TRANSNOA","VINCULADO Y SIN TENSION :Aislador orgánico deteriorado en el piquete Nº 166"]
[null,null,129,3731,287508,"TRANSNOA","VINCULADO Y SIN TENSION :Aislador orgánico deteriorado en el piquete Nº 166"]
[null,null,130,3729,287509,"TRANSNOA","VINCULADO Y SIN TENSION :Aislador orgánico deteriorado en el piquete Nº 166"]
[null,null,131,3730,287510,"TRANSNOA","VINCULADO Y SIN TENSION :Aislador orgánico deteriorado en el piquete Nº 166"]
[null,null,132,4993,287511,"TRANSNOA","VINCULADO Y SIN TENSION :Aislador orgánico deteriorado en el piquete Nº 166"]
[null,null,133,565,287512,"TRANSNOA","VINCULADO Y SIN TENSION :Aislador orgánico deteriorado en el piquete Nº 166"]
[null,null,134,2735,287717,"TRANSNOA","VINCULADO Y SIN TENSION : Falla de aislación en aislador soporte a barras en 13.2 kV"]
[null,null,135,2744,287718,"TRANSNOA","VINCULADO Y SIN TENSION : Falla de aislación en aislador soporte a barras en 13.2 kV"]

{"sheet":"CAUSAS-VST-04 (4)","index":10,"n_rows":28,"n_cols":7,"rows_kept":28,"cut":false,"hidden":false,"merged":[]}
[]
[null,"ANEXO I   al Memorandum  D.T.E.E. N°  526  / 2016"]
[]
["ENTE NACIONAL REGULADOR "]
["        DE LA ELECTRICIDAD"]
[]
[]
[null,null,null,null,null,"SISTEMA DE TRANSPORTE DE ENERGÍA ELÉCTRICA POR DISTRIBUCIÓN TRONCAL - TRANSNOA S.A."]
[]
[]
[null,null,null,null,null,null,"Indisponibilidades Descartadas por Causa \"Vinculado y Sin Tensión\""]
[]
[]
[null,{"$f":"'TOT-0415'!B14","v":"Desde el 01 al 30 de abril de 2015"}]
[]
[]
[null,null,"Id","ID EQUIPO","INDISP","AGENTE","CAUSA"]
[]
[null,null,136,4274,287719,"TRANSNOA","VINCULADO Y SIN TENSION : Falla de aislación en aislador soporte a barras en 13.2 kV"]
[null,null,137,2745,287720,"TRANSNOA","VINCULADO Y SIN TENSION : Falla de aislación en aislador soporte a barras en 13.2 kV"]
[null,null,138,2734,287721,"TRANSNOA","VINCULADO Y SIN TENSION : Falla de aislación en aislador soporte a barras en 13.2 kV"]
[null,null,139,4857,287722,"TRANSNOA","VINCULADO Y SIN TENSION : Falla de aislación en aislador soporte a barras en 13.2 kV"]
[null,null,140,1844,287723,"TRANSNOA","VINCULADO Y SIN TENSION : Falla de aislación en aislador soporte a barras en 13.2 kV"]
[null,null,141,5265,287726,"TRANSNOA","VINCULADO Y SIN TENSION : Falla de aislación en aislador soporte a barras en 13.2 kV"]
[null,null,142,5297,287727,"TRANSNOA","VINCULADO Y SIN TENSION : Falla de aislación en aislador soporte a barras en 13.2 kV"]
[null,null,143,5298,287728,"TRANSNOA","VINCULADO Y SIN TENSION : Falla de aislación en aislador soporte a barras en 13.2 kV"]
[null,null,144,5334,287741,"TRANSNOA","VINCULADO Y SIN TENSION :  Disparo de protección de cuba del reactor de neutro (reactor rígido a bornes de Trafo Nº 2)"]
[null,null,145,5335,287742,"TRANSNOA","VINCULADO Y SIN TENSION :  Disparo de protección de cuba del reactor de neutro (reactor rígido a bornes de Trafo Nº 2)"]

{"sheet":"SUP-TRANSPORTEL","index":11,"n_rows":44,"n_cols":13,"rows_kept":44,"cut":false,"hidden":false,"merged":[]}
[]
[null,"ANEXO I   al Memorandum  D.T.E.E. N° 526 / 2016"]
["ENTE NACIONAL REGULADOR "]
["DE LA ELECTRICIDAD"]
[]
[]
[null,null,null,"SISTEMA DE TRANSPORTE DE ENERGÍA ELÉCTRICA POR DISTRIBUCIÓN TRONCAL - TRANSNOA S.A."]
[]
[null,null,null,"3.1- SUPERVISIÓN - Transportista Independiente TRANSPORTEL La Rioja Sur"]
[]
[null,{"$f":"'TOT-0415'!B14","v":"Desde el 01 al 30 de abril de 2015"}]
[]
[]
[]
[null,null,"a) Datos"]
[null,null,null,null,null,null,null,null,null,null,null,"Salida en 132 kV o 66 kV = ",2.4140000000000001]
[null,null,null,"Tiempo de servicio =",{"$f":"MID(B11,16,2)*24","v":720},"hs",null,null,"$/100 km-h : LÍNEAS 132 kV ",381.23899999999998,null,"Salida en 33 kV ",1.8109999999999999]
[null,null,null,"Porcentaje por Supervisión  =",0.04,null,null,null,null,null,null,"Salida en 13,2 kV =",1.8109999999999999]
[]
[null,null,"b) SM:  es la suma de las sanciones a que en cada mes se hiciere pasible el Transportista Independiente, valorizadas con idénticos criterios que los que se aplican a la Concesionaria."]
[]
[]
[null,null,null,"SANCIÓN al T.I.",null,"LÍNEAS",null,"SM =",21318.880000000001,null,null,"SEGÚN 1.2."]
[]
[null,null,"c) RM : es la remuneración que mensualmente recibiría el Transportista Independiente, si su servicio fuera valorizado conforme al régimen remuneratorio que se aplica a la Concesionaria."]
[]
[null,null,null,"Cargo por Capacidad de Transporte","U [kV]","Long [km]",null,"Cargo por C. T.",{"$f":"\"Cargo por E.E.T.\"","v":"Cargo por E.E.T."},null,null,"TOTAL"]
[null,null,null,"LA RIOJA SUR P.I.LA RIOJA",132,40,null,{"$f":"F28*$J$17*$E$17/100","v":109796.83199999999},0,{"$f":"\"(DTE \"&DATO!$G$14&DATO!$H$14&\")\"","v":"(DTE 0415)"},null,{"$f":"SUM(H28:K28)","v":109796.83199999999}]
[null,null,null,"LA RIOJA SUR P.I.PATQUIA",132,40,null,{"$f":"F29*$J$17*$E$17/100","v":109796.83199999999},0,{"$f":"\"(DTE \"&DATO!$G$14&DATO!$H$14&\")\"","v":"(DTE 0415)"},null,{"$f":"SUM(H29:K29)","v":109796.83199999999}]
[null,null,null,null,null,null,null,null,null,null,null,{"$f":"SUM(L28:L29)","v":219593.66399999999}]
[]
[]
[null,null,null,null,null,null,null,"RM =",{"$f":"+L30","v":219593.66399999999},null,"RM * =",36195.033599999995]
[]
[null,null,"d) CS: Es el cargo por Supervisión de la Operación que la Transportista percibe por supervisar la operación y mantenimiento del Transportista Independiente."]
[]
[null,null,null,"Cargo por Supervisión afectado a la sanción ",null,null,null,"CS =",{"$f":"E18*L33","v":1447.8013439999997}]
[]
[null,null,"e) SANCIÓN"]
[null,null,null,"Sanción Calculada",{"$f":"10*I23*I37/I33","v":1405.5734830570848}]
[]
[null,null,null,"TOTAL A PENALIZAR A TRANSNOA S.A. POR SUPERVISIÓN A  SU TI"]
[]
[null,null,null,null,null,null,null,"SANCIÓN  =",{"$f":"IF($E$40>3*I37,3*I37,$E$40)","v":1405.5734830570848},null,"RM * = VALOR EMPLEADO PARA CALCULAR CS"]

{"sheet":"Tasa de Falla","index":12,"n_rows":146,"n_cols":19,"rows_kept":146,"cut":false,"hidden":false,"merged":[[2,0,2,2],[3,0,3,2]]}
[]
[null,"ANEXO I   al Memorandum  D.T.E.E. N° 526  / 2016"]
["ENTE NACIONAL REGULADOR "]
["DE LA ELECTRICIDAD"]
[]
[null,"SISTEMA DE TRANSPORTE DE ENERGÍA ELÉCTRICA POR DISTRIBUCIÓN TRONCAL "]
[]
[null,"TRANSNOA S.A."]
[]
[null,"INDISPONIBILIDADES FORZADAS DE LÍNEAS - TASA DE FALLA"]
[]
[]
[null,"y",null,"Correspondiente al mes abril de 2015"]
[]
[null,null,"N°","LÍNEAS","U\n[kV]","Long.\n[km]","2014-04-01","2014-05-01","2014-06-01","2014-07-01","2014-08-01","2014-09-01","2014-10-01","2014-11-01","2014-12-01","2015-01-01","2015-02-01","2015-03-01","2015-04-01"]
[]
[null,null,{"$f":"'[1]Tasa de Falla'!C17","v":1},{"$f":"'[1]Tasa de Falla'!D17","v":"AGUA BLANCA - VILLA QUINTEROS"},{"$f":"'[1]Tasa de Falla'!E17","v":132},{"$f":"'[1]Tasa de Falla'!F17","v":23.8},{"$f":"IF('[1]Tasa de Falla'!IK17=0,\"\",'[1]Tasa de Falla'!IK17)","v":""},{"$f":"IF('[1]Tasa de Falla'!IL17=0,\"\",'[1]Tasa de Falla'!IL17)","v":""},{"$f":"IF('[1]Tasa de Falla'!IM17=0,\"\",'[1]Tasa de Falla'!IM17)","v":""},{"$f":"IF('[1]Tasa de Falla'!IN17=0,\"\",'[1]Tasa de Falla'!IN17)","v":""},{"$f":"IF('[1]Tasa de Falla'!IO17=0,\"\",'[1]Tasa de Falla'!IO17)","v":""},{"$f":"IF('[1]Tasa de Falla'!IP17=0,\"\",'[1]Tasa de Falla'!IP17)","v":""},{"$f":"IF('[1]Tasa de Falla'!IQ17=0,\"\",'[1]Tasa de Falla'!IQ17)","v":""},{"$f":"IF('[1]Tasa de Falla'!IR17=0,\"\",'[1]Tasa de Falla'!IR17)","v":""},{"$f":"IF('[1]Tasa de Falla'!IS17=0,\"\",'[1]Tasa de Falla'!IS17)","v":""},{"$f":"IF('[1]Tasa de Falla'!IT17=0,\"\",'[1]Tasa de Falla'!IT17)","v":""},{"$f":"IF('[1]Tasa de Falla'!IU17=0,\"\",'[1]Tasa de Falla'!IU17)","v":""},{"$f":"IF('[1]Tasa de Falla'!IV17=0,\"\",'[1]Tasa de Falla'!IV17)","v":""}]
[null,null,{"$f":"'[1]Tasa de Falla'!C18","v":2},{"$f":"'[1]Tasa de Falla'!D18","v":"AGUILARES - ESCABA"},{"$f":"'[1]Tasa de Falla'!E18","v":132},{"$f":"'[1]Tasa de Falla'!F18","v":27},{"$f":"IF('[1]Tasa de Falla'!IK18=0,\"\",'[1]Tasa de Falla'!IK18)","v":""},{"$f":"IF('[1]Tasa de Falla'!IL18=0,\"\",'[1]Tasa de Falla'!IL18)","v":""},{"$f":"IF('[1]Tasa de Falla'!IM18=0,\"\",'[1]Tasa de Falla'!IM18)","v":""},{"$f":"IF('[1]Tasa de Falla'!IN18=0,\"\",'[1]Tasa de Falla'!IN18)","v":""},{"$f":"IF('[1]Tasa de Falla'!IO18=0,\"\",'[1]Tasa de Falla'!IO18)","v":""},{"$f":"IF('[1]Tasa de Falla'!IP18=0,\"\",'[1]Tasa de Falla'!IP18)","v":1},{"$f":"IF('[1]Tasa de Falla'!IQ18=0,\"\",'[1]Tasa de Falla'!IQ18)","v":""},{"$f":"IF('[1]Tasa de Falla'!IR18=0,\"\",'[1]Tasa de Falla'!IR18)","v":""},{"$f":"IF('[1]Tasa de Falla'!IS18=0,\"\",'[1]Tasa de Falla'!IS18)","v":""},{"$f":"IF('[1]Tasa de Falla'!IT18=0,\"\",'[1]Tasa de Falla'!IT18)","v":""},{"$f":"IF('[1]Tasa de Falla'!IU18=0,\"\",'[1]Tasa de Falla'!IU18)","v":""},{"$f":"IF('[1]Tasa de Falla'!IV18=0,\"\",'[1]Tasa de Falla'!IV18)","v":""}]
[null,null,{"$f":"'[1]Tasa de Falla'!C19","v":3},{"$f":"'[1]Tasa de Falla'!D19","v":"CABRA CORRAL - SALTA SUR"},{"$f":"'[1]Tasa de Falla'!E19","v":132},{"$f":"'[1]Tasa de Falla'!F19","v":62},{"$f":"IF('[1]Tasa de Falla'!IK19=0,\"\",'[1]Tasa de Falla'!IK19)","v":"XXXX"},{"$f":"IF('[1]Tasa de Falla'!IL19=0,\"\",'[1]Tasa de Falla'!IL19)","v":"XXXX"},{"$f":"IF('[1]Tasa de Falla'!IM19=0,\"\",'[1]Tasa de Falla'!IM19)","v":"XXXX"},{"$f":"IF('[1]Tasa de Falla'!IN19=0,\"\",'[1]Tasa de Falla'!IN19)","v":"XXXX"},{"$f":"IF('[1]Tasa de Falla'!IO19=0,\"\",'[1]Tasa de Falla'!IO19)","v":"XXXX"},{"$f":"IF('[1]Tasa de Falla'!IP19=0,\"\",'[1]Tasa de Falla'!IP19)","v":"XXXX"},{"$f":"IF('[1]Tasa de Falla'!IQ19=0,\"\",'[1]Tasa de Falla'!IQ19)","v":"XXXX"},{"$f":"IF('[1]Tasa de Falla'!IR19=0,\"\",'[1]Tasa de Falla'!IR19)","v":"XXXX"},{"$f":"IF('[1]Tasa de Falla'!IS19=0,\"\",'[1]Tasa de Falla'!IS19)","v":"XXXX"},{"$f":"IF('[1]Tasa de Falla'!IT19=0,\"\",'[1]Tasa de Falla'!IT19)","v":"XXXX"},{"$f":"IF('[1]Tasa de Falla'!IU19=0,\"\",'[1]Tasa de Falla'!IU19)","v":"XXXX"},{"$f":"IF('[1]Tasa de Falla'!IV19=0,\"\",'[1]Tasa de Falla'!IV19)","v":"XXXX"}]
[null,null,{"$f":"'[1]Tasa de Falla'!C20","v":4},{"$f":"'[1]Tasa de Falla'!D20","v":"CEVIL POZO - TUCUMAN NORTE"},{"$f":"'[1]Tasa de Falla'!E20","v":132},{"$f":"'[1]Tasa de Falla'!F20","v":14.5},{"$f":"IF('[1]Tasa de Falla'!IK20=0,\"\",'[1]Tasa de Falla'!IK20)","v":""},{"$f":"IF('[1]Tasa de Falla'!IL20=0,\"\",'[1]Tasa de Falla'!IL20)","v":""},{"$f":"IF('[1]Tasa de Falla'!IM20=0,\"\",'[1]Tasa de Falla'!IM20)","v":""},{"$f":"IF('[1]Tasa de Falla'!IN20=0,\"\",'[1]Tasa de Falla'!IN20)","v":""},{"$f":"IF('[1]Tasa de Falla'!IO20=0,\"\",'[1]Tasa de Falla'!IO20)","v":""},{"$f":"IF('[1]Tasa de Falla'!IP20=0,\"\",'[1]Tasa de Falla'!IP20)","v":""},{"$f":"IF('[1]Tasa de Falla'!IQ20=0,\"\",'[1]Tasa de Falla'!IQ20)","v":""},{"$f":"IF('[1]Tasa de Falla'!IR20=0,\"\",'[1]Tasa de Falla'!IR20)","v":""},{"$f":"IF('[1]Tasa de Falla'!IS20=0,\"\",'[1]Tasa de Falla'!IS20)","v":""},{"$f":"IF('[1]Tasa de Falla'!IT20=0,\"\",'[1]Tasa de Falla'!IT20)","v":""},{"$f":"IF('[1]Tasa de Falla'!IU20=0,\"\",'[1]Tasa de Falla'!IU20)","v":""},{"$f":"IF('[1]Tasa de Falla'!IV20=0,\"\",'[1]Tasa de Falla'!IV20)","v":""}]
[null,null,{"$f":"'[1]Tasa de Falla'!C21","v":5},{"$f":"'[1]Tasa de Falla'!D21","v":"CAMPO SANTO - MINETTI"},{"$f":"'[1]Tasa de Falla'!E21","v":132},{"$f":"'[1]Tasa de Falla'!F21","v":29.9},{"$f":"IF('[1]Tasa de Falla'!IK21=0,\"\",'[1]Tasa de Falla'!IK21)","v":"XXXX"},{"$f":"IF('[1]Tasa de Falla'!IL21=0,\"\",'[1]Tasa de Falla'!IL21)","v":"XXXX"},{"$f":"IF('[1]Tasa de Falla'!IM21=0,\"\",'[1]Tasa de Falla'!IM21)","v":"XXXX"},{"$f":"IF('[1]Tasa de Falla'!IN21=0,\"\",'[1]Tasa de Falla'!IN21)","v":"XXXX"},{"$f":"IF('[1]Tasa de Falla'!IO21=0,\"\",'[1]Tasa de Falla'!IO21)","v":"XXXX"},{"$f":"IF('[1]Tasa de Falla'!IP21=0,\"\",'[1]Tasa de Falla'!IP21)","v":"XXXX"},{"$f":"IF('[1]Tasa de Falla'!IQ21=0,\"\",'[1]Tasa de Falla'!IQ21)","v":"XXXX"},{"$f":"IF('[1]Tasa de Falla'!IR21=0,\"\",'[1]Tasa de Falla'!IR21)","v":"XXXX"},{"$f":"IF('[1]Tasa de Falla'!IS21=0,\"\",'[1]Tasa de Falla'!IS21)","v":"XXXX"},{"$f":"IF('[1]Tasa de Falla'!IT21=0,\"\",'[1]Tasa de Falla'!IT21)","v":"XXXX"},{"$f":"IF('[1]Tasa de Falla'!IU21=0,\"\",'[1]Tasa de Falla'!IU21)","v":"XXXX"},{"$f":"IF('[1]Tasa de Falla'!IV21=0,\"\",'[1]Tasa de Falla'!IV21)","v":"XXXX"}]
[null,null,{"$f":"'[1]Tasa de Falla'!C22","v":6},{"$f":"'[1]Tasa de Falla'!D22","v":"ESCABA - HUACRA"},{"$f":"'[1]Tasa de Falla'!E22","v":132},{"$f":"'[1]Tasa de Falla'!F22","v":49.9},{"$f":"IF('[1]Tasa de Falla'!IK22=0,\"\",'[1]Tasa de Falla'!IK22)","v":"XXXX"},{"$f":"IF('[1]Tasa de Falla'!IL22=0,\"\",'[1]Tasa de Falla'!IL22)","v":"XXXX"},{"$f":"IF('[1]Tasa de Falla'!IM22=0,\"\",'[1]Tasa de Falla'!IM22)","v":"XXXX"},{"$f":"IF('[1]Tasa de Falla'!IN22=0,\"\",'[1]Tasa de Falla'!IN22)","v":"XXXX"},{"$f":"IF('[1]Tasa de Falla'!IO22=0,\"\",'[1]Tasa de Falla'!IO22)","v":"XXXX"},{"$f":"IF('[1]Tasa de Falla'!IP22=0,\"\",'[1]Tasa de Falla'!IP22)","v":"XXXX"},{"$f":"IF('[1]Tasa de Falla'!IQ22=0,\"\",'[1]Tasa de Falla'!IQ22)","v":"XXXX"},{"$f":"IF('[1]Tasa de Falla'!IR22=0,\"\",'[1]Tasa de Falla'!IR22)","v":"XXXX"},{"$f":"IF('[1]Tasa de Falla'!IS22=0,\"\",'[1]Tasa de Falla'!IS22)","v":"XXXX"},{"$f":"IF('[1]Tasa de Falla'!IT22=0,\"\",'[1]Tasa de Falla'!IT22)","v":"XXXX"},{"$f":"IF('[1]Tasa de Falla'!IU22=0,\"\",'[1]Tasa de Falla'!IU22)","v":"XXXX"},{"$f":"IF('[1]Tasa de Falla'!IV22=0,\"\",'[1]Tasa de Falla'!IV22)","v":"XXXX"}]
[null,null,{"$f":"'[1]Tasa de Falla'!C23","v":7},{"$f":"'[1]Tasa de Falla'!D23","v":"ESTATICA SUR - EL BRACHO"},{"$f":"'[1]Tasa de Falla'!E23","v":132},{"$f":"'[1]Tasa de Falla'!F23","v":19.600000000000001},{"$f":"IF('[1]Tasa de Falla'!IK23=0,\"\",'[1]Tasa de Falla'!IK23)","v":""},{"$f":"IF('[1]Tasa de Falla'!IL23=0,\"\",'[1]Tasa de Falla'!IL23)","v":""},{"$f":"IF('[1]Tasa de Falla'!IM23=0,\"\",'[1]Tasa de Falla'!IM23)","v":""},{"$f":"IF('[1]Tasa de Falla'!IN23=0,\"\",'[1]Tasa de Falla'!IN23)","v":""},{"$f":"IF('[1]Tasa de Falla'!IO23=0,\"\",'[1]Tasa de Falla'!IO23)","v":""},{"$f":"IF('[1]Tasa de Falla'!IP23=0,\"\",'[1]Tasa de Falla'!IP23)","v":""},{"$f":"IF('[1]Tasa de Falla'!IQ23=0,\"\",'[1]Tasa de Falla'!IQ23)","v":""},{"$f":"IF('[1]Tasa de Falla'!IR23=0,\"\",'[1]Tasa de Falla'!IR23)","v":""},{"$f":"IF('[1]Tasa de Falla'!IS23=0,\"\",'[1]Tasa de Falla'!IS23)","v":""},{"$f":"IF('[1]Tasa de Falla'!IT23=0,\"\",'[1]Tasa de Falla'!IT23)","v":""},{"$f":"IF('[1]Tasa de Falla'!IU23=0,\"\",'[1]Tasa de Falla'!IU23)","v":""},{"$f":"IF('[1]Tasa de Falla'!IV23=0,\"\",'[1]Tasa de Falla'!IV23)","v":"XXXX"}]
[null,null,{"$f":"'[1]Tasa de Falla'!C24","v":8},{"$f":"'[1]Tasa de Falla'!D24","v":"ESTATICA SUR - INDEPENDENCIA 1 (O.F.)"},{"$f":"'[1]Tasa de Falla'!E24","v":132},{"$f":"'[1]Tasa de Falla'!F24","v":2.6},{"$f":"IF('[1]Tasa de Falla'!IK24=0,\"\",'[1]Tasa de Falla'!IK24)","v":""},{"$f":"IF('[1]Tasa de Falla'!IL24=0,\"\",'[1]Tasa de Falla'!IL24)","v":""},{"$f":"IF('[1]Tasa de Falla'!IM24=0,\"\",'[1]Tasa de Falla'!IM24)","v":""},{"$f":"IF('[1]Tasa de Falla'!IN24=0,\"\",'[1]Tasa de Falla'!IN24)","v":""},{"$f":"IF('[1]Tasa de Falla'!IO24=0,\"\",'[1]Tasa de Falla'!IO24)","v":""},{"$f":"IF('[1]Tasa de Falla'!IP24=0,\"\",'[1]Tasa de Falla'!IP24)","v":""},{"$f":"IF('[1]Tasa de Falla'!IQ24=0,\"\",'[1]Tasa de Falla'!IQ24)","v":""},{"$f":"IF('[1]Tasa de Falla'!IR24=0,\"\",'[1]Tasa de Falla'!IR24)","v":""},{"$f":"IF('[1]Tasa de Falla'!IS24=0,\"\",'[1]Tasa de Falla'!IS24)","v":""},{"$f":"IF('[1]Tasa de Falla'!IT24=0,\"\",'[1]Tasa de Falla'!IT24)","v":""},{"$f":"IF('[1]Tasa de Falla'!IU24=0,\"\",'[1]Tasa de Falla'!IU24)","v":""},{"$f":"IF('[1]Tasa de Falla'!IV24=0,\"\",'[1]Tasa de Falla'!IV24)","v":""}]
[null,null,{"$f":"'[1]Tasa de Falla'!C25","v":9},{"$f":"'[1]Tasa de Falla'!D25","v":"ESTATICA SUR - SARMIENTO \"TRANSNOA S.A.\""},{"$f":"'[1]Tasa de Falla'!E25","v":132},{"$f":"'[1]Tasa de Falla'!F25","v":4.4000000000000004},{"$f":"IF('[1]Tasa de Falla'!IK25=0,\"\",'[1]Tasa de Falla'!IK25)","v":""},{"$f":"IF('[1]Tasa de Falla'!IL25=0,\"\",'[1]Tasa de Falla'!IL25)","v":""},{"$f":"IF('[1]Tasa de Falla'!IM25=0,\"\",'[1]Tasa de Falla'!IM25)","v":""},{"$f":"IF('[1]Tasa de Falla'!IN25=0,\"\",'[1]Tasa de Falla'!IN25)","v":""},{"$f":"IF('[1]Tasa de Falla'!IO25=0,\"\",'[1]Tasa de Falla'!IO25)","v":""},{"$f":"IF('[1]Tasa de Falla'!IP25=0,\"\",'[1]Tasa de Falla'!IP25)","v":""},{"$f":"IF('[1]Tasa de Falla'!IQ25=0,\"\",'[1]Tasa de Falla'!IQ25)","v":""},{"$f":"IF('[1]Tasa de Falla'!IR25=0,\"\",'[1]Tasa de Falla'!IR25)","v":""},{"$f":"IF('[1]Tasa de Falla'!IS25=0,\"\",'[1]Tasa de Falla'!IS25)","v":""},{"$f":"IF('[1]Tasa de Falla'!IT25=0,\"\",'[1]Tasa de Falla'!IT25)","v":""},{"$f":"IF('[1]Tasa de Falla'!IU25=0,\"\",'[1]Tasa de Falla'!IU25)","v":""},{"$f":"IF('[1]Tasa de Falla'!IV25=0,\"\",'[1]Tasa de Falla'!IV25)","v":""}]
[null,null,{"$f":"'[1]Tasa de Falla'!C26","v":10},{"$f":"'[1]Tasa de Falla'!D26","v":"GÜEMES - EL BRACHO"},{"$f":"'[1]Tasa de Falla'!E26","v":132},{"$f":"'[1]Tasa de Falla'!F26","v":308},{"$f":"IF('[1]Tasa de Falla'!IK26=0,\"\",'[1]Tasa de Falla'!IK26)","v":"XXXX"},{"$f":"IF('[1]Tasa de Falla'!IL26=0,\"\",'[1]Tasa de Falla'!IL26)","v":"XXXX"},{"$f":"IF('[1]Tasa de Falla'!IM26=0,\"\",'[1]Tasa de Falla'!IM26)","v":"XXXX"},{"$f":"IF('[1]Tasa de Falla'!IN26=0,\"\",'[1]Tasa de Falla'!IN26)","v":"XXXX"},{"$f":"IF('[1]Tasa de Falla'!IO26=0,\"\",'[1]Tasa de Falla'!IO26)","v":"XXXX"},{"$f":"IF('[1]Tasa de Falla'!IP26=0,\"\",'[1]Tasa de Falla'!IP26)","v":"XXXX"},{"$f":"IF('[1]Tasa de Falla'!IQ26=0,\"\",'[1]Tasa de Falla'!IQ26)","v":"XXXX"},{"$f":"IF('[1]Tasa de Falla'!IR26=0,\"\",'[1]Tasa de Falla'!IR26)","v":"XXXX"},{"$f":"IF('[1]Tasa de Falla'!IS26=0,\"\",'[1]Tasa de Falla'!IS26)","v":"XXXX"},{"$f":"IF('[1]Tasa de Falla'!IT26=0,\"\",'[1]Tasa de Falla'!IT26)","v":"XXXX"},{"$f":"IF('[1]Tasa de Falla'!IU26=0,\"\",'[1]Tasa de Falla'!IU26)","v":"XXXX"},{"$f":"IF('[1]Tasa de Falla'!IV26=0,\"\",'[1]Tasa de Falla'!IV26)","v":"XXXX"}]
[null,null,{"$f":"'[1]Tasa de Falla'!C27","v":11},{"$f":"'[1]Tasa de Falla'!D27","v":"CAMPO SANTO - GÜEMES"},{"$f":"'[1]Tasa de Falla'!E27","v":132},{"$f":"'[1]Tasa de Falla'!F27","v":6.2},{"$f":"IF('[1]Tasa de Falla'!IK27=0,\"\",'[1]Tasa de Falla'!IK27)","v":"XXXX"},{"$f":"IF('[1]Tasa de Falla'!IL27=0,\"\",'[1]Tasa de Falla'!IL27)","v":"XXXX"},{"$f":"IF('[1]Tasa de Falla'!IM27=0,\"\",'[1]Tasa de Falla'!IM27)","v":"XXXX"},{"$f":"IF('[1]Tasa de Falla'!IN27=0,\"\",'[1]Tasa de Falla'!IN27)","v":"XXXX"},{"$f":"IF('[1]Tasa de Falla'!IO27=0,\"\",'[1]Tasa de Falla'!IO27)","v":"XXXX"},{"$f":"IF('[1]Tasa de Falla'!IP27=0,\"\",'[1]Tasa de Falla'!IP27)","v":"XXXX"},{"$f":"IF('[1]Tasa de Falla'!IQ27=0,\"\",'[1]Tasa de Falla'!IQ27)","v":"XXXX"},{"$f":"IF('[1]Tasa de Falla'!IR27=0,\"\",'[1]Tasa de Falla'!IR27)","v":"XXXX"},{"$f":"IF('[1]Tasa de Falla'!IS27=0,\"\",'[1]Tasa de Falla'!IS27)","v":"XXXX"},{"$f":"IF('[1]Tasa de Falla'!IT27=0,\"\",'[1]Tasa de Falla'!IT27)","v":"XXXX"},{"$f":"IF('[1]Tasa de Falla'!IU27=0,\"\",'[1]Tasa de Falla'!IU27)","v":"XXXX"},{"$f":"IF('[1]Tasa de Falla'!IV27=0,\"\",'[1]Tasa de Falla'!IV27)","v":"XXXX"}]
[null,null,{"$f":"'[1]Tasa de Falla'!C28","v":12},{"$f":"'[1]Tasa de Falla'!D28","v":"GÜEMES - SAN JUANCITO"},{"$f":"'[1]Tasa de Falla'!E28","v":132},{"$f":"'[1]Tasa de Falla'!F28","v":36.24},{"$f":"IF('[1]Tasa de Falla'!IK28=0,\"\",'[1]Tasa de Falla'!IK28)","v":1},{"$f":"IF('[1]Tasa de Falla'!IL28=0,\"\",'[1]Tasa de Falla'!IL28)","v":""},{"$f":"IF('[1]Tasa de Falla'!IM28=0,\"\",'[1]Tasa de Falla'!IM28)","v":""},{"$f":"IF('[1]Tasa de Falla'!IN28=0,\"\",'[1]Tasa de Falla'!IN28)","v":""},{"$f":"IF('[1]Tasa de Falla'!IO28=0,\"\",'[1]Tasa de Falla'!IO28)","v":""},{"$f":"IF('[1]Tasa de Falla'!IP28=0,\"\",'[1]Tasa de Falla'!IP28)","v":""},{"$f":"IF('[1]Tasa de Falla'!IQ28=0,\"\",'[1]Tasa de Falla'!IQ28)","v":""},{"$f":"IF('[1]Tasa de Falla'!IR28=0,\"\",'[1]Tasa de Falla'!IR28)","v":""},{"$f":"IF('[1]Tasa de Falla'!IS28=0,\"\",'[1]Tasa de Falla'!IS28)","v":""},{"$f":"IF('[1]Tasa de Falla'!IT28=0,\"\",'[1]Tasa de Falla'!IT28)","v":""},{"$f":"IF('[1]Tasa de Falla'!IU28=0,\"\",'[1]Tasa de Falla'!IU28)","v":""},{"$f":"IF('[1]Tasa de Falla'!IV28=0,\"\",'[1]Tasa de Falla'!IV28)","v":""}]
[null,null,{"$f":"'[1]Tasa de Falla'!C29","v":13},{"$f":"'[1]Tasa de Falla'!D29","v":"CATAMARCA - HUACRA"},{"$f":"'[1]Tasa de Falla'!E29","v":132},{"$f":"'[1]Tasa de Falla'!F29","v":67.3},{"$f":"IF('[1]Tasa de Falla'!IK29=0,\"\",'[1]Tasa de Falla'!IK29)","v":""},{"$f":"IF('[1]Tasa de Falla'!IL29=0,\"\",'[1]Tasa de Falla'!IL29)","v":""},{"$f":"IF('[1]Tasa de Falla'!IM29=0,\"\",'[1]Tasa de Falla'!IM29)","v":""},{"$f":"IF('[1]Tasa de Falla'!IN29=0,\"\",'[1]Tasa de Falla'!IN29)","v":""},{"$f":"IF('[1]Tasa de Falla'!IO29=0,\"\",'[1]Tasa de Falla'!IO29)","v":""},{"$f":"IF('[1]Tasa de Falla'!IP29=0,\"\",'[1]Tasa de Falla'!IP29)","v":""},{"$f":"IF('[1]Tasa de Falla'!IQ29=0,\"\",'[1]Tasa de Falla'!IQ29)","v":""},{"$f":"IF('[1]Tasa de Falla'!IR29=0,\"\",'[1]Tasa de Falla'!IR29)","v":""},{"$f":"IF('[1]Tasa de Falla'!IS29=0,\"\",'[1]Tasa de Falla'!IS29)","v":""},{"$f":"IF('[1]Tasa de Falla'!IT29=0,\"\",'[1]Tasa de Falla'!IT29)","v":""},{"$f":"IF('[1]Tasa de Falla'!IU29=0,\"\",'[1]Tasa de Falla'!IU29)","v":""},{"$f":"IF('[1]Tasa de Falla'!IV29=0,\"\",'[1]Tasa de Falla'!IV29)","v":""}]
[null,null,{"$f":"'[1]Tasa de Falla'!C30","v":14},{"$f":"'[1]Tasa de Falla'!D30","v":"HUACRA - LA CALERA"},{"$f":"'[1]Tasa de Falla'!E30","v":132},{"$f":"'[1]Tasa de Falla'!F30","v":91.2},{"$f":"IF('[1]Tasa de Falla'!IK30=0,\"\",'[1]Tasa de Falla'!IK30)","v":1},{"$f":"IF('[1]Tasa de Falla'!IL30=0,\"\",'[1]Tasa de Falla'!IL30)","v":""},{"$f":"IF('[1]Tasa de Falla'!IM30=0,\"\",'[1]Tasa de Falla'!IM30)","v":""},{"$f":"IF('[1]Tasa de Falla'!IN30=0,\"\",'[1]Tasa de Falla'!IN30)","v":""},{"$f":"IF('[1]Tasa de Falla'!IO30=0,\"\",'[1]Tasa de Falla'!IO30)","v":""},{"$f":"IF('[1]Tasa de Falla'!IP30=0,\"\",'[1]Tasa de Falla'!IP30)","v":""},{"$f":"IF('[1]Tasa de Falla'!IQ30=0,\"\",'[1]Tasa de Falla'!IQ30)","v":""},{"$f":"IF('[1]Tasa de Falla'!IR30=0,\"\",'[1]Tasa de Falla'!IR30)","v":""},{"$f":"IF('[1]Tasa de Falla'!IS30=0,\"\",'[1]Tasa de Falla'!IS30)","v":""},{"$f":"IF('[1]Tasa de Falla'!IT30=0,\"\",'[1]Tasa de Falla'!IT30)","v":""},{"$f":"IF('[1]Tasa de Falla'!IU30=0,\"\",'[1]Tasa de Falla'!IU30)","v":""},{"$f":"IF('[1]Tasa de Falla'!IV30=0,\"\",'[1]Tasa de Falla'!IV30)","v":""}]
[null,null,{"$f":"'[1]Tasa de Falla'!C31","v":15},{"$f":"'[1]Tasa de Falla'!D31","v":"AGUA BLANCA - INDEPENDENCIA"},{"$f":"'[1]Tasa de Falla'!E31","v":132},{"$f":"'[1]Tasa de Falla'!F31","v":34.14},{"$f":"IF('[1]Tasa de Falla'!IK31=0,\"\",'[1]Tasa de Falla'!IK31)","v":""},{"$f":"IF('[1]Tasa de Falla'!IL31=0,\"\",'[1]Tasa de Falla'!IL31)","v":""},{"$f":"IF('[1]Tasa de Falla'!IM31=0,\"\",'[1]Tasa de Falla'!IM31)","v":""},{"$f":"IF('[1]Tasa de Falla'!IN31=0,\"\",'[1]Tasa de Falla'!IN31)","v":""},{"$f":"IF('[1]Tasa de Falla'!IO31=0,\"\",'[1]Tasa de Falla'!IO31)","v":""},{"$f":"IF('[1]Tasa de Falla'!IP31=0,\"\",'[1]Tasa de Falla'!IP31)","v":""},{"$f":"IF('[1]Tasa de Falla'!IQ31=0,\"\",'[1]Tasa de Falla'!IQ31)","v":1},{"$f":"IF('[1]Tasa de Falla'!IR31=0,\"\",'[1]Tasa de Falla'!IR31)","v":""},{"$f":"IF('[1]Tasa de Falla'!IS31=0,\"\",'[1]Tasa de Falla'!IS31)","v":""},{"$f":"IF('[1]Tasa de Falla'!IT31=0,\"\",'[1]Tasa de Falla'!IT31)","v":1},{"$f":"IF('[1]Tasa de Falla'!IU31=0,\"\",'[1]Tasa de Falla'!IU31)","v":""},{"$f":"IF('[1]Tasa de Falla'!IV31=0,\"\",'[1]Tasa de Falla'!IV31)","v":""}]
[null,null,{"$f":"'[1]Tasa de Falla'!C32","v":16},{"$f":"'[1]Tasa de Falla'!D32","v":"INDEPENDENCIA - EL BRACHO 1"},{"$f":"'[1]Tasa de Falla'!E32","v":132},{"$f":"'[1]Tasa de Falla'!F32","v":17.100000000000001},{"$f":"IF('[1]Tasa de Falla'!IK32=0,\"\",'[1]Tasa de Falla'!IK32)","v":""},{"$f":"IF('[1]Tasa de Falla'!IL32=0,\"\",'[1]Tasa de Falla'!IL32)","v":""},{"$f":"IF('[1]Tasa de Falla'!IM32=0,\"\",'[1]Tasa de Falla'!IM32)","v":""},{"$f":"IF('[1]Tasa de Falla'!IN32=0,\"\",'[1]Tasa de Falla'!IN32)","v":""},{"$f":"IF('[1]Tasa de Falla'!IO32=0,\"\",'[1]Tasa de Falla'!IO32)","v":""},{"$f":"IF('[1]Tasa de Falla'!IP32=0,\"\",'[1]Tasa de Falla'!IP32)","v":""},{"$f":"IF('[1]Tasa de Falla'!IQ32=0,\"\",'[1]Tasa de Falla'!IQ32)","v":""},{"$f":"IF('[1]Tasa de Falla'!IR32=0,\"\",'[1]Tasa de Falla'!IR32)","v":""},{"$f":"IF('[1]Tasa de Falla'!IS32=0,\"\",'[1]Tasa de Falla'!IS32)","v":""},{"$f":"IF('[1]Tasa de Falla'!IT32=0,\"\",'[1]Tasa de Falla'!IT32)","v":1},{"$f":"IF('[1]Tasa de Falla'!IU32=0,\"\",'[1]Tasa de Falla'!IU32)","v":""},{"$f":"IF('[1]Tasa de Falla'!IV32=0,\"\",'[1]Tasa de Falla'!IV32)","v":""}]
[null,null,{"$f":"'[1]Tasa de Falla'!C33","v":17},{"$f":"'[1]Tasa de Falla'!D33","v":"INDEPENDENCIA - LULES - PAPEL TUCUMAN"},{"$f":"'[1]Tasa de Falla'!E33","v":132},{"$f":"'[1]Tasa de Falla'!F33","v":19.3},{"$f":"IF('[1]Tasa de Falla'!IK33=0,\"\",'[1]Tasa de Falla'!IK33)","v":""},{"$f":"IF('[1]Tasa de Falla'!IL33=0,\"\",'[1]Tasa de Falla'!IL33)","v":""},{"$f":"IF('[1]Tasa de Falla'!IM33=0,\"\",'[1]Tasa de Falla'!IM33)","v":""},{"$f":"IF('[1]Tasa de Falla'!IN33=0,\"\",'[1]Tasa de Falla'!IN33)","v":""},{"$f":"IF('[1]Tasa de Falla'!IO33=0,\"\",'[1]Tasa de Falla'!IO33)","v":""},{"$f":"IF('[1]Tasa de Falla'!IP33=0,\"\",'[1]Tasa de Falla'!IP33)","v":""},{"$f":"IF('[1]Tasa de Falla'!IQ33=0,\"\",'[1]Tasa de Falla'!IQ33)","v":""},{"$f":"IF('[1]Tasa de Falla'!IR33=0,\"\",'[1]Tasa de Falla'!IR33)","v":""},{"$f":"IF('[1]Tasa de Falla'!IS33=0,\"\",'[1]Tasa de Falla'!IS33)","v":""},{"$f":"IF('[1]Tasa de Falla'!IT33=0,\"\",'[1]Tasa de Falla'!IT33)","v":""},{"$f":"IF('[1]Tasa de Falla'!IU33=0,\"\",'[1]Tasa de Falla'!IU33)","v":""},{"$f":"IF('[1]Tasa de Falla'!IV33=0,\"\",'[1]Tasa de Falla'!IV33)","v":""}]
[null,null,{"$f":"'[1]Tasa de Falla'!C34","v":18},{"$f":"'[1]Tasa de Falla'!D34","v":"FRIAS - LA CALERA NOA."},{"$f":"'[1]Tasa de Falla'!E34","v":132},{"$f":"'[1]Tasa de Falla'!F34","v":27.3},{"$f":"IF('[1]Tasa de Falla'!IK34=0,\"\",'[1]Tasa de Falla'!IK34)","v":1},{"$f":"IF('[1]Tasa de Falla'!IL34=0,\"\",'[1]Tasa de Falla'!IL34)","v":""},{"$f":"IF('[1]Tasa de Falla'!IM34=0,\"\",'[1]Tasa de Falla'!IM34)","v":""},{"$f":"IF('[1]Tasa de Falla'!IN34=0,\"\",'[1]Tasa de Falla'!IN34)","v":""},{"$f":"IF('[1]Tasa de Falla'!IO34=0,\"\",'[1]Tasa de Falla'!IO34)","v":""},{"$f":"IF('[1]Tasa de Falla'!IP34=0,\"\",'[1]Tasa de Falla'!IP34)","v":""},{"$f":"IF('[1]Tasa de Falla'!IQ34=0,\"\",'[1]Tasa de Falla'!IQ34)","v":""},{"$f":"IF('[1]Tasa de Falla'!IR34=0,\"\",'[1]Tasa de Falla'!IR34)","v":""},{"$f":"IF('[1]Tasa de Falla'!IS34=0,\"\",'[1]Tasa de Falla'!IS34)","v":1},{"$f":"IF('[1]Tasa de Falla'!IT34=0,\"\",'[1]Tasa de Falla'!IT34)","v":""},{"$f":"IF('[1]Tasa de Falla'!IU34=0,\"\",'[1]Tasa de Falla'!IU34)","v":""},{"$f":"IF('[1]Tasa de Falla'!IV34=0,\"\",'[1]Tasa de Falla'!IV34)","v":""}]
[null,null,{"$f":"'[1]Tasa de Falla'!C35","v":19},{"$f":"'[1]Tasa de Falla'!D35","v":"LA BANDA - SANTIAGO CENTRO"},{"$f":"'[1]Tasa de Falla'!E35","v":132},{"$f":"'[1]Tasa de Falla'!F35","v":10.91},{"$f":"IF('[1]Tasa de Falla'!IK35=0,\"\",'[1]Tasa de Falla'!IK35)","v":""},{"$f":"IF('[1]Tasa de Falla'!IL35=0,\"\",'[1]Tasa de Falla'!IL35)","v":""},{"$f":"IF('[1]Tasa de Falla'!IM35=0,\"\",'[1]Tasa de Falla'!IM35)","v":""},{"$f":"IF('[1]Tasa de Falla'!IN35=0,\"\",'[1]Tasa de Falla'!IN35)","v":""},{"$f":"IF('[1]Tasa de Falla'!IO35=0,\"\",'[1]Tasa de Falla'!IO35)","v":""},{"$f":"IF('[1]Tasa de Falla'!IP35=0,\"\",'[1]Tasa de Falla'!IP35)","v":""},{"$f":"IF('[1]Tasa de Falla'!IQ35=0,\"\",'[1]Tasa de Falla'!IQ35)","v":""},{"$f":"IF('[1]Tasa de Falla'!IR35=0,\"\",'[1]Tasa de Falla'!IR35)","v":""},{"$f":"IF('[1]Tasa de Falla'!IS35=0,\"\",'[1]Tasa de Falla'!IS35)","v":""},{"$f":"IF('[1]Tasa de Falla'!IT35=0,\"\",'[1]Tasa de Falla'!IT35)","v":""},{"$f":"IF('[1]Tasa de Falla'!IU35=0,\"\",'[1]Tasa de Falla'!IU35)","v":""},{"$f":"IF('[1]Tasa de Falla'!IV35=0,\"\",'[1]Tasa de Falla'!IV35)","v":1}]
[null,null,{"$f":"'[1]Tasa de Falla'!C36","v":20},{"$f":"'[1]Tasa de Falla'!D36","v":"LIBERTADOR NOA. - PICHANAL"},{"$f":"'[1]Tasa de Falla'!E36","v":132},{"$f":"'[1]Tasa de Falla'!F36","v":76},{"$f":"IF('[1]Tasa de Falla'!IK36=0,\"\",'[1]Tasa de Falla'!IK36)","v":2},{"$f":"IF('[1]Tasa de Falla'!IL36=0,\"\",'[1]Tasa de Falla'!IL36)","v":""},{"$f":"IF('[1]Tasa de Falla'!IM36=0,\"\",'[1]Tasa de Falla'!IM36)","v":3},{"$f":"IF('[1]Tasa de Falla'!IN36=0,\"\",'[1]Tasa de Falla'!IN36)","v":""},{"$f":"IF('[1]Tasa de Falla'!IO36=0,\"\",'[1]Tasa de Falla'!IO36)","v":1},{"$f":"IF('[1]Tasa de Falla'!IP36=0,\"\",'[1]Tasa de Falla'!IP36)","v":""},{"$f":"IF('[1]Tasa de Falla'!IQ36=0,\"\",'[1]Tasa de Falla'!IQ36)","v":""},{"$f":"IF('[1]Tasa de Falla'!IR36=0,\"\",'[1]Tasa de Falla'!IR36)","v":2},{"$f":"IF('[1]Tasa de Falla'!IS36=0,\"\",'[1]Tasa de Falla'!IS36)","v":""},{"$f":"IF('[1]Tasa de Falla'!IT36=0,\"\",'[1]Tasa de Falla'!IT36)","v":1},{"$f":"IF('[1]Tasa de Falla'!IU36=0,\"\",'[1]Tasa de Falla'!IU36)","v":1},{"$f":"IF('[1]Tasa de Falla'!IV36=0,\"\",'[1]Tasa de Falla'!IV36)","v":4}]
[null,null,{"$f":"'[1]Tasa de Falla'!C37","v":21},{"$f":"'[1]Tasa de Falla'!D37","v":"GÜEMES - METAN"},{"$f":"'[1]Tasa de Falla'!E37","v":132},{"$f":"'[1]Tasa de Falla'!F37","v":97.13},{"$f":"IF('[1]Tasa de Falla'!IK37=0,\"\",'[1]Tasa de Falla'!IK37)","v":"XXXX"},{"$f":"IF('[1]Tasa de Falla'!IL37=0,\"\",'[1]Tasa de Falla'!IL37)","v":"XXXX"},{"$f":"IF('[1]Tasa de Falla'!IM37=0,\"\",'[1]Tasa de Falla'!IM37)","v":"XXXX"},{"$f":"IF('[1]Tasa de Falla'!IN37=0,\"\",'[1]Tasa de Falla'!IN37)","v":"XXXX"},{"$f":"IF('[1]Tasa de Falla'!IO37=0,\"\",'[1]Tasa de Falla'!IO37)","v":"XXXX"},{"$f":"IF('[1]Tasa de Falla'!IP37=0,\"\",'[1]Tasa de Falla'!IP37)","v":"XXXX"},{"$f":"IF('[1]Tasa de Falla'!IQ37=0,\"\",'[1]Tasa de Falla'!IQ37)","v":"XXXX"},{"$f":"IF('[1]Tasa de Falla'!IR37=0,\"\",'[1]Tasa de Falla'!IR37)","v":"XXXX"},{"$f":"IF('[1]Tasa de Falla'!IS37=0,\"\",'[1]Tasa de Falla'!IS37)","v":"XXXX"},{"$f":"IF('[1]Tasa de Falla'!IT37=0,\"\",'[1]Tasa de Falla'!IT37)","v":"XXXX"},{"$f":"IF('[1]Tasa de Falla'!IU37=0,\"\",'[1]Tasa de Falla'!IU37)","v":"XXXX"},{"$f":"IF('[1]Tasa de Falla'!IV37=0,\"\",'[1]Tasa de Falla'!IV37)","v":"XXXX"}]
[null,null,{"$f":"'[1]Tasa de Falla'!C38","v":22},{"$f":"'[1]Tasa de Falla'!D38","v":"MINETTI - SAN JUANCITO"},{"$f":"'[1]Tasa de Falla'!E38","v":132},{"$f":"'[1]Tasa de Falla'!F38","v":26},{"$f":"IF('[1]Tasa de Falla'!IK38=0,\"\",'[1]Tasa de Falla'!IK38)","v":1},{"$f":"IF('[1]Tasa de Falla'!IL38=0,\"\",'[1]Tasa de Falla'!IL38)","v":""},{"$f":"IF('[1]Tasa de Falla'!IM38=0,\"\",'[1]Tasa de Falla'!IM38)","v":""},{"$f":"IF('[1]Tasa de Falla'!IN38=0,\"\",'[1]Tasa de Falla'!IN38)","v":""},{"$f":"IF('[1]Tasa de Falla'!IO38=0,\"\",'[1]Tasa de Falla'!IO38)","v":""},{"$f":"IF('[1]Tasa de Falla'!IP38=0,\"\",'[1]Tasa de Falla'!IP38)","v":""},{"$f":"IF('[1]Tasa de Falla'!IQ38=0,\"\",'[1]Tasa de Falla'!IQ38)","v":""},{"$f":"IF('[1]Tasa de Falla'!IR38=0,\"\",'[1]Tasa de Falla'!IR38)","v":""},{"$f":"IF('[1]Tasa de Falla'!IS38=0,\"\",'[1]Tasa de Falla'!IS38)","v":""},{"$f":"IF('[1]Tasa de Falla'!IT38=0,\"\",'[1]Tasa de Falla'!IT38)","v":""},{"$f":"IF('[1]Tasa de Falla'!IU38=0,\"\",'[1]Tasa de Falla'!IU38)","v":""},{"$f":"IF('[1]Tasa de Falla'!IV38=0,\"\",'[1]Tasa de Falla'!IV38)","v":""}]
[null,null,{"$f":"'[1]Tasa de Falla'!C39","v":23},{"$f":"'[1]Tasa de Falla'!D39","v":"PALPALA - JUJUY SUR"},{"$f":"'[1]Tasa de Falla'!E39","v":132},{"$f":"'[1]Tasa de Falla'!F39","v":14},{"$f":"IF('[1]Tasa de Falla'!IK39=0,\"\",'[1]Tasa de Falla'!IK39)","v":"XXXX"},{"$f":"IF('[1]Tasa de Falla'!IL39=0,\"\",'[1]Tasa de Falla'!IL39)","v":"XXXX"},{"$f":"IF('[1]Tasa de Falla'!IM39=0,\"\",'[1]Tasa de Falla'!IM39)","v":"XXXX"},{"$f":"IF('[1]Tasa de Falla'!IN39=0,\"\",'[1]Tasa de Falla'!IN39)","v":"XXXX"},{"$f":"IF('[1]Tasa de Falla'!IO39=0,\"\",'[1]Tasa de Falla'!IO39)","v":"XXXX"},{"$f":"IF('[1]Tasa de Falla'!IP39=0,\"\",'[1]Tasa de Falla'!IP39)","v":"XXXX"},{"$f":"IF('[1]Tasa de Falla'!IQ39=0,\"\",'[1]Tasa de Falla'!IQ39)","v":"XXXX"},{"$f":"IF('[1]Tasa de Falla'!IR39=0,\"\",'[1]Tasa de Falla'!IR39)","v":"XXXX"},{"$f":"IF('[1]Tasa de Falla'!IS39=0,\"\",'[1]Tasa de Falla'!IS39)","v":"XXXX"},{"$f":"IF('[1]Tasa de Falla'!IT39=0,\"\",'[1]Tasa de Falla'!IT39)","v":"XXXX"},{"$f":"IF('[1]Tasa de Falla'!IU39=0,\"\",'[1]Tasa de Falla'!IU39)","v":"XXXX"},{"$f":"IF('[1]Tasa de Falla'!IV39=0,\"\",'[1]Tasa de Falla'!IV39)","v":"XXXX"}]
[null,null,{"$f":"'[1]Tasa de Falla'!C40","v":24},{"$f":"'[1]Tasa de Falla'!D40","v":"ORAN - PICHANAL"},{"$f":"'[1]Tasa de Falla'!E40","v":132},{"$f":"'[1]Tasa de Falla'!F40","v":17},{"$f":"IF('[1]Tasa de Falla'!IK40=0,\"\",'[1]Tasa de Falla'!IK40)","v":"XXXX"},{"$f":"IF('[1]Tasa de Falla'!IL40=0,\"\",'[1]Tasa de Falla'!IL40)","v":"XXXX"},{"$f":"IF('[1]Tasa de Falla'!IM40=0,\"\",'[1]Tasa de Falla'!IM40)","v":"XXXX"},{"$f":"IF('[1]Tasa de Falla'!IN40=0,\"\",'[1]Tasa de Falla'!IN40)","v":"XXXX"},{"$f":"IF('[1]Tasa de Falla'!IO40=0,\"\",'[1]Tasa de Falla'!IO40)","v":"XXXX"},{"$f":"IF('[1]Tasa de Falla'!IP40=0,\"\",'[1]Tasa de Falla'!IP40)","v":"XXXX"},{"$f":"IF('[1]Tasa de Falla'!IQ40=0,\"\",'[1]Tasa de Falla'!IQ40)","v":"XXXX"},{"$f":"IF('[1]Tasa de Falla'!IR40=0,\"\",'[1]Tasa de Falla'!IR40)","v":"XXXX"},{"$f":"IF('[1]Tasa de Falla'!IS40=0,\"\",'[1]Tasa de Falla'!IS40)","v":"XXXX"},{"$f":"IF('[1]Tasa de Falla'!IT40=0,\"\",'[1]Tasa de Falla'!IT40)","v":"XXXX"},{"$f":"IF('[1]Tasa de Falla'!IU40=0,\"\",'[1]Tasa de Falla'!IU40)","v":"XXXX"},{"$f":"IF('[1]Tasa de Falla'!IV40=0,\"\",'[1]Tasa de Falla'!IV40)","v":"XXXX"}]
[null,null,{"$f":"'[1]Tasa de Falla'!C41","v":25},{"$f":"'[1]Tasa de Falla'!D41","v":"PICHANAL - TARTAGAL"},{"$f":"'[1]Tasa de Falla'!E41","v":132},{"$f":"'[1]Tasa de Falla'!F41","v":105},{"$f":"IF('[1]Tasa de Falla'!IK41=0,\"\",'[1]Tasa de Falla'!IK41)","v":""},{"$f":"IF('[1]Tasa de Falla'!IL41=0,\"\",'[1]Tasa de Falla'!IL41)","v":""},{"$f":"IF('[1]Tasa de Falla'!IM41=0,\"\",'[1]Tasa de Falla'!IM41)","v":""},{"$f":"IF('[1]Tasa de Falla'!IN41=0,\"\",'[1]Tasa de Falla'!IN41)","v":""},{"$f":"IF('[1]Tasa de Falla'!IO41=0,\"\",'[1]Tasa de Falla'!IO41)","v":""},{"$f":"IF('[1]Tasa de Falla'!IP41=0,\"\",'[1]Tasa de Falla'!IP41)","v":""},{"$f":"IF('[1]Tasa de Falla'!IQ41=0,\"\",'[1]Tasa de Falla'!IQ41)","v":1},{"$f":"IF('[1]Tasa de Falla'!IR41=0,\"\",'[1]Tasa de Falla'!IR41)","v":1},{"$f":"IF('[1]Tasa de Falla'!IS41=0,\"\",'[1]Tasa de Falla'!IS41)","v":""},{"$f":"IF('[1]Tasa de Falla'!IT41=0,\"\",'[1]Tasa de Falla'!IT41)","v":""},{"$f":"IF('[1]Tasa de Falla'!IU41=0,\"\",'[1]Tasa de Falla'!IU41)","v":""},{"$f":"IF('[1]Tasa de Falla'!IV41=0,\"\",'[1]Tasa de Falla'!IV41)","v":"XXXX"}]
[null,null,{"$f":"'[1]Tasa de Falla'!C42","v":26},{"$f":"'[1]Tasa de Falla'!D42","v":"C.H. RIO HONDO - LA BANDA"},{"$f":"'[1]Tasa de Falla'!E42","v":132},{"$f":"'[1]Tasa de Falla'!F42","v":76.5},{"$f":"IF('[1]Tasa de Falla'!IK42=0,\"\",'[1]Tasa de Falla'!IK42)","v":1},{"$f":"IF('[1]Tasa de Falla'!IL42=0,\"\",'[1]Tasa de Falla'!IL42)","v":1},{"$f":"IF('[1]Tasa de Falla'!IM42=0,\"\",'[1]Tasa de Falla'!IM42)","v":""},{"$f":"IF('[1]Tasa de Falla'!IN42=0,\"\",'[1]Tasa de Falla'!IN42)","v":""},{"$f":"IF('[1]Tasa de Falla'!IO42=0,\"\",'[1]Tasa de Falla'!IO42)","v":1},{"$f":"IF('[1]Tasa de Falla'!IP42=0,\"\",'[1]Tasa de Falla'!IP42)","v":1},{"$f":"IF('[1]Tasa de Falla'!IQ42=0,\"\",'[1]Tasa de Falla'!IQ42)","v":""},{"$f":"IF('[1]Tasa de Falla'!IR42=0,\"\",'[1]Tasa de Falla'!IR42)","v":""},{"$f":"IF('[1]Tasa de Falla'!IS42=0,\"\",'[1]Tasa de Falla'!IS42)","v":""},{"$f":"IF('[1]Tasa de Falla'!IT42=0,\"\",'[1]Tasa de Falla'!IT42)","v":2},{"$f":"IF('[1]Tasa de Falla'!IU42=0,\"\",'[1]Tasa de Falla'!IU42)","v":""},{"$f":"IF('[1]Tasa de Falla'!IV42=0,\"\",'[1]Tasa de Falla'!IV42)","v":1}]
[null,null,{"$f":"'[1]Tasa de Falla'!C43","v":27},{"$f":"'[1]Tasa de Falla'!D43","v":"LA RIOJA - RECREO  2"},{"$f":"'[1]Tasa de Falla'!E43","v":132},{"$f":"'[1]Tasa de Falla'!F43","v":220},{"$f":"IF('[1]Tasa de Falla'!IK43=0,\"\",'[1]Tasa de Falla'!IK43)","v":"XXXX"},{"$f":"IF('[1]Tasa de Falla'!IL43=0,\"\",'[1]Tasa de Falla'!IL43)","v":"XXXX"},{"$f":"IF('[1]Tasa de Falla'!IM43=0,\"\",'[1]Tasa de Falla'!IM43)","v":"XXXX"},{"$f":"IF('[1]Tasa de Falla'!IN43=0,\"\",'[1]Tasa de Falla'!IN43)","v":"XXXX"},{"$f":"IF('[1]Tasa de Falla'!IO43=0,\"\",'[1]Tasa de Falla'!IO43)","v":"XXXX"},{"$f":"IF('[1]Tasa de Falla'!IP43=0,\"\",'[1]Tasa de Falla'!IP43)","v":"XXXX"},{"$f":"IF('[1]Tasa de Falla'!IQ43=0,\"\",'[1]Tasa de Falla'!IQ43)","v":"XXXX"},{"$f":"IF('[1]Tasa de Falla'!IR43=0,\"\",'[1]Tasa de Falla'!IR43)","v":"XXXX"},{"$f":"IF('[1]Tasa de Falla'!IS43=0,\"\",'[1]Tasa de Falla'!IS43)","v":"XXXX"},{"$f":"IF('[1]Tasa de Falla'!IT43=0,\"\",'[1]Tasa de Falla'!IT43)","v":"XXXX"},{"$f":"IF('[1]Tasa de Falla'!IU43=0,\"\",'[1]Tasa de Falla'!IU43)","v":"XXXX"},{"$f":"IF('[1]Tasa de Falla'!IV43=0,\"\",'[1]Tasa de Falla'!IV43)","v":"XXXX"}]
[null,null,{"$f":"'[1]Tasa de Falla'!C44","v":28},{"$f":"'[1]Tasa de Falla'!D44","v":"CAMPO SANTO - SALTA SUR"},{"$f":"'[1]Tasa de Falla'!E44","v":132},{"$f":"'[1]Tasa de Falla'!F44","v":40.92},{"$f":"IF('[1]Tasa de Falla'!IK44=0,\"\",'[1]Tasa de Falla'!IK44)","v":"XXXX"},{"$f":"IF('[1]Tasa de Falla'!IL44=0,\"\",'[1]Tasa de Falla'!IL44)","v":"XXXX"},{"$f":"IF('[1]Tasa de Falla'!IM44=0,\"\",'[1]Tasa de Falla'!IM44)","v":"XXXX"},{"$f":"IF('[1]Tasa de Falla'!IN44=0,\"\",'[1]Tasa de Falla'!IN44)","v":"XXXX"},{"$f":"IF('[1]Tasa de Falla'!IO44=0,\"\",'[1]Tasa de Falla'!IO44)","v":"XXXX"},{"$f":"IF('[1]Tasa de Falla'!IP44=0,\"\",'[1]Tasa de Falla'!IP44)","v":"XXXX"},{"$f":"IF('[1]Tasa de Falla'!IQ44=0,\"\",'[1]Tasa de Falla'!IQ44)","v":"XXXX"},{"$f":"IF('[1]Tasa de Falla'!IR44=0,\"\",'[1]Tasa de Falla'!IR44)","v":"XXXX"},{"$f":"IF('[1]Tasa de Falla'!IS44=0,\"\",'[1]Tasa de Falla'!IS44)","v":"XXXX"},{"$f":"IF('[1]Tasa de Falla'!IT44=0,\"\",'[1]Tasa de Falla'!IT44)","v":"XXXX"},{"$f":"IF('[1]Tasa de Falla'!IU44=0,\"\",'[1]Tasa de Falla'!IU44)","v":"XXXX"},{"$f":"IF('[1]Tasa de Falla'!IV44=0,\"\",'[1]Tasa de Falla'!IV44)","v":"XXXX"}]
[null,null,{"$f":"'[1]Tasa de Falla'!C45","v":29},{"$f":"'[1]Tasa de Falla'!D45","v":"PALPALA - SAN JUANCITO"},{"$f":"'[1]Tasa de Falla'!E45","v":132},{"$f":"'[1]Tasa de Falla'!F45","v":23.9},{"$f":"IF('[1]Tasa de Falla'!IK45=0,\"\",'[1]Tasa de Falla'!IK45)","v":""},{"$f":"IF('[1]Tasa de Falla'!IL45=0,\"\",'[1]Tasa de Falla'!IL45)","v":""},{"$f":"IF('[1]Tasa de Falla'!IM45=0,\"\",'[1]Tasa de Falla'!IM45)","v":""},{"$f":"IF('[1]Tasa de Falla'!IN45=0,\"\",'[1]Tasa de Falla'!IN45)","v":""},{"$f":"IF('[1]Tasa de Falla'!IO45=0,\"\",'[1]Tasa de Falla'!IO45)","v":""},{"$f":"IF('[1]Tasa de Falla'!IP45=0,\"\",'[1]Tasa de Falla'!IP45)","v":""},{"$f":"IF('[1]Tasa de Falla'!IQ45=0,\"\",'[1]Tasa de Falla'!IQ45)","v":""},{"$f":"IF('[1]Tasa de Falla'!IR45=0,\"\",'[1]Tasa de Falla'!IR45)","v":""},{"$f":"IF('[1]Tasa de Falla'!IS45=0,\"\",'[1]Tasa de Falla'!IS45)","v":""},{"$f":"IF('[1]Tasa de Falla'!IT45=0,\"\",'[1]Tasa de Falla'!IT45)","v":2},{"$f":"IF('[1]Tasa de Falla'!IU45=0,\"\",'[1]Tasa de Falla'!IU45)","v":""},{"$f":"IF('[1]Tasa de Falla'!IV45=0,\"\",'[1]Tasa de Falla'!IV45)","v":""}]
[null,null,{"$f":"'[1]Tasa de Falla'!C46","v":30},{"$f":"'[1]Tasa de Falla'!D46","v":"SAN JUANCITO - SAN PEDRO JUJUY"},{"$f":"'[1]Tasa de Falla'!E46","v":132},{"$f":"'[1]Tasa de Falla'!F46","v":27},{"$f":"IF('[1]Tasa de Falla'!IK46=0,\"\",'[1]Tasa de Falla'!IK46)","v":""},{"$f":"IF('[1]Tasa de Falla'!IL46=0,\"\",'[1]Tasa de Falla'!IL46)","v":""},{"$f":"IF('[1]Tasa de Falla'!IM46=0,\"\",'[1]Tasa de Falla'!IM46)","v":""},{"$f":"IF('[1]Tasa de Falla'!IN46=0,\"\",'[1]Tasa de Falla'!IN46)","v":""},{"$f":"IF('[1]Tasa de Falla'!IO46=0,\"\",'[1]Tasa de Falla'!IO46)","v":""},{"$f":"IF('[1]Tasa de Falla'!IP46=0,\"\",'[1]Tasa de Falla'!IP46)","v":""},{"$f":"IF('[1]Tasa de Falla'!IQ46=0,\"\",'[1]Tasa de Falla'!IQ46)","v":""},{"$f":"IF('[1]Tasa de Falla'!IR46=0,\"\",'[1]Tasa de Falla'!IR46)","v":""},{"$f":"IF('[1]Tasa de Falla'!IS46=0,\"\",'[1]Tasa de Falla'!IS46)","v":""},{"$f":"IF('[1]Tasa de Falla'!IT46=0,\"\",'[1]Tasa de Falla'!IT46)","v":""},{"$f":"IF('[1]Tasa de Falla'!IU46=0,\"\",'[1]Tasa de Falla'!IU46)","v":""},{"$f":"IF('[1]Tasa de Falla'!IV46=0,\"\",'[1]Tasa de Falla'!IV46)","v":""}]
[null,null,{"$f":"'[1]Tasa de Falla'!C47","v":31},{"$f":"'[1]Tasa de Falla'!D47","v":"SAN MARTIN - CATAMARCA"},{"$f":"'[1]Tasa de Falla'!E47","v":132},{"$f":"'[1]Tasa de Falla'!F47","v":88},{"$f":"IF('[1]Tasa de Falla'!IK47=0,\"\",'[1]Tasa de Falla'!IK47)","v":"XXXX"},{"$f":"IF('[1]Tasa de Falla'!IL47=0,\"\",'[1]Tasa de Falla'!IL47)","v":"XXXX"},{"$f":"IF('[1]Tasa de Falla'!IM47=0,\"\",'[1]Tasa de Falla'!IM47)","v":"XXXX"},{"$f":"IF('[1]Tasa de Falla'!IN47=0,\"\",'[1]Tasa de Falla'!IN47)","v":"XXXX"},{"$f":"IF('[1]Tasa de Falla'!IO47=0,\"\",'[1]Tasa de Falla'!IO47)","v":"XXXX"},{"$f":"IF('[1]Tasa de Falla'!IP47=0,\"\",'[1]Tasa de Falla'!IP47)","v":"XXXX"},{"$f":"IF('[1]Tasa de Falla'!IQ47=0,\"\",'[1]Tasa de Falla'!IQ47)","v":"XXXX"},{"$f":"IF('[1]Tasa de Falla'!IR47=0,\"\",'[1]Tasa de Falla'!IR47)","v":"XXXX"},{"$f":"IF('[1]Tasa de Falla'!IS47=0,\"\",'[1]Tasa de Falla'!IS47)","v":"XXXX"},{"$f":"IF('[1]Tasa de Falla'!IT47=0,\"\",'[1]Tasa de Falla'!IT47)","v":"XXXX"},{"$f":"IF('[1]Tasa de Falla'!IU47=0,\"\",'[1]Tasa de Falla'!IU47)","v":"XXXX"},{"$f":"IF('[1]Tasa de Falla'!IV47=0,\"\",'[1]Tasa de Falla'!IV47)","v":"XXXX"}]
[null,null,{"$f":"'[1]Tasa de Falla'!C48","v":32},{"$f":"'[1]Tasa de Falla'!D48","v":"SAN MARTIN - RECREO"},{"$f":"'[1]Tasa de Falla'!E48","v":132},{"$f":"'[1]Tasa de Falla'!F48","v":115},{"$f":"IF('[1]Tasa de Falla'!IK48=0,\"\",'[1]Tasa de Falla'!IK48)","v":"XXXX"},{"$f":"IF('[1]Tasa de Falla'!IL48=0,\"\",'[1]Tasa de Falla'!IL48)","v":"XXXX"},{"$f":"IF('[1]Tasa de Falla'!IM48=0,\"\",'[1]Tasa de Falla'!IM48)","v":"XXXX"},{"$f":"IF('[1]Tasa de Falla'!IN48=0,\"\",'[1]Tasa de Falla'!IN48)","v":"XXXX"},{"$f":"IF('[1]Tasa de Falla'!IO48=0,\"\",'[1]Tasa de Falla'!IO48)","v":"XXXX"},{"$f":"IF('[1]Tasa de Falla'!IP48=0,\"\",'[1]Tasa de Falla'!IP48)","v":"XXXX"},{"$f":"IF('[1]Tasa de Falla'!IQ48=0,\"\",'[1]Tasa de Falla'!IQ48)","v":"XXXX"},{"$f":"IF('[1]Tasa de Falla'!IR48=0,\"\",'[1]Tasa de Falla'!IR48)","v":"XXXX"},{"$f":"IF('[1]Tasa de Falla'!IS48=0,\"\",'[1]Tasa de Falla'!IS48)","v":"XXXX"},{"$f":"IF('[1]Tasa de Falla'!IT48=0,\"\",'[1]Tasa de Falla'!IT48)","v":"XXXX"},{"$f":"IF('[1]Tasa de Falla'!IU48=0,\"\",'[1]Tasa de Falla'!IU48)","v":"XXXX"},{"$f":"IF('[1]Tasa de Falla'!IV48=0,\"\",'[1]Tasa de Falla'!IV48)","v":"XXXX"}]
[null,null,{"$f":"'[1]Tasa de Falla'!C49","v":33},{"$f":"'[1]Tasa de Falla'!D49","v":"SAN MARTIN C. - LA RIOJA"},{"$f":"'[1]Tasa de Falla'!E49","v":132},{"$f":"'[1]Tasa de Falla'!F49","v":105},{"$f":"IF('[1]Tasa de Falla'!IK49=0,\"\",'[1]Tasa de Falla'!IK49)","v":"XXXX"},{"$f":"IF('[1]Tasa de Falla'!IL49=0,\"\",'[1]Tasa de Falla'!IL49)","v":"XXXX"},{"$f":"IF('[1]Tasa de Falla'!IM49=0,\"\",'[1]Tasa de Falla'!IM49)","v":"XXXX"},{"$f":"IF('[1]Tasa de Falla'!IN49=0,\"\",'[1]Tasa de Falla'!IN49)","v":"XXXX"},{"$f":"IF('[1]Tasa de Falla'!IO49=0,\"\",'[1]Tasa de Falla'!IO49)","v":"XXXX"},{"$f":"IF('[1]Tasa de Falla'!IP49=0,\"\",'[1]Tasa de Falla'!IP49)","v":"XXXX"},{"$f":"IF('[1]Tasa de Falla'!IQ49=0,\"\",'[1]Tasa de Falla'!IQ49)","v":"XXXX"},{"$f":"IF('[1]Tasa de Falla'!IR49=0,\"\",'[1]Tasa de Falla'!IR49)","v":"XXXX"},{"$f":"IF('[1]Tasa de Falla'!IS49=0,\"\",'[1]Tasa de Falla'!IS49)","v":"XXXX"},{"$f":"IF('[1]Tasa de Falla'!IT49=0,\"\",'[1]Tasa de Falla'!IT49)","v":"XXXX"},{"$f":"IF('[1]Tasa de Falla'!IU49=0,\"\",'[1]Tasa de Falla'!IU49)","v":"XXXX"},{"$f":"IF('[1]Tasa de Falla'!IV49=0,\"\",'[1]Tasa de Falla'!IV49)","v":"XXXX"}]
[null,null,{"$f":"'[1]Tasa de Falla'!C50","v":34},{"$f":"'[1]Tasa de Falla'!D50","v":"SAN PEDRO JUJUY - LIBERTADOR NOA."},{"$f":"'[1]Tasa de Falla'!E50","v":132},{"$f":"'[1]Tasa de Falla'!F50","v":49},{"$f":"IF('[1]Tasa de Falla'!IK50=0,\"\",'[1]Tasa de Falla'!IK50)","v":""},{"$f":"IF('[1]Tasa de Falla'!IL50=0,\"\",'[1]Tasa de Falla'!IL50)","v":""},{"$f":"IF('[1]Tasa de Falla'!IM50=0,\"\",'[1]Tasa de Falla'!IM50)","v":""},{"$f":"IF('[1]Tasa de Falla'!IN50=0,\"\",'[1]Tasa de Falla'!IN50)","v":""},{"$f":"IF('[1]Tasa de Falla'!IO50=0,\"\",'[1]Tasa de Falla'!IO50)","v":""},{"$f":"IF('[1]Tasa de Falla'!IP50=0,\"\",'[1]Tasa de Falla'!IP50)","v":""},{"$f":"IF('[1]Tasa de Falla'!IQ50=0,\"\",'[1]Tasa de Falla'!IQ50)","v":""},{"$f":"IF('[1]Tasa de Falla'!IR50=0,\"\",'[1]Tasa de Falla'!IR50)","v":1},{"$f":"IF('[1]Tasa de Falla'!IS50=0,\"\",'[1]Tasa de Falla'!IS50)","v":""},{"$f":"IF('[1]Tasa de Falla'!IT50=0,\"\",'[1]Tasa de Falla'!IT50)","v":""},{"$f":"IF('[1]Tasa de Falla'!IU50=0,\"\",'[1]Tasa de Falla'!IU50)","v":""},{"$f":"IF('[1]Tasa de Falla'!IV50=0,\"\",'[1]Tasa de Falla'!IV50)","v":""}]
[null,null,{"$f":"'[1]Tasa de Falla'!C51","v":35},{"$f":"'[1]Tasa de Falla'!D51","v":"TUCUMAN NORTE - EL BRACHO"},{"$f":"'[1]Tasa de Falla'!E51","v":132},{"$f":"'[1]Tasa de Falla'!F51","v":31.5},{"$f":"IF('[1]Tasa de Falla'!IK51=0,\"\",'[1]Tasa de Falla'!IK51)","v":""},{"$f":"IF('[1]Tasa de Falla'!IL51=0,\"\",'[1]Tasa de Falla'!IL51)","v":""},{"$f":"IF('[1]Tasa de Falla'!IM51=0,\"\",'[1]Tasa de Falla'!IM51)","v":""},{"$f":"IF('[1]Tasa de Falla'!IN51=0,\"\",'[1]Tasa de Falla'!IN51)","v":""},{"$f":"IF('[1]Tasa de Falla'!IO51=0,\"\",'[1]Tasa de Falla'!IO51)","v":""},{"$f":"IF('[1]Tasa de Falla'!IP51=0,\"\",'[1]Tasa de Falla'!IP51)","v":""},{"$f":"IF('[1]Tasa de Falla'!IQ51=0,\"\",'[1]Tasa de Falla'!IQ51)","v":""},{"$f":"IF('[1]Tasa de Falla'!IR51=0,\"\",'[1]Tasa de Falla'!IR51)","v":1},{"$f":"IF('[1]Tasa de Falla'!IS51=0,\"\",'[1]Tasa de Falla'!IS51)","v":""},{"$f":"IF('[1]Tasa de Falla'!IT51=0,\"\",'[1]Tasa de Falla'!IT51)","v":""},{"$f":"IF('[1]Tasa de Falla'!IU51=0,\"\",'[1]Tasa de Falla'!IU51)","v":""},{"$f":"IF('[1]Tasa de Falla'!IV51=0,\"\",'[1]Tasa de Falla'!IV51)","v":""}]
[null,null,{"$f":"'[1]Tasa de Falla'!C52","v":36},{"$f":"'[1]Tasa de Falla'!D52","v":"C.H. EL CADILLAL - TUCUMAN NORTE"},{"$f":"'[1]Tasa de Falla'!E52","v":132},{"$f":"'[1]Tasa de Falla'!F52","v":21.8},{"$f":"IF('[1]Tasa de Falla'!IK52=0,\"\",'[1]Tasa de Falla'!IK52)","v":1},{"$f":"IF('[1]Tasa de Falla'!IL52=0,\"\",'[1]Tasa de Falla'!IL52)","v":""},{"$f":"IF('[1]Tasa de Falla'!IM52=0,\"\",'[1]Tasa de Falla'!IM52)","v":""},{"$f":"IF('[1]Tasa de Falla'!IN52=0,\"\",'[1]Tasa de Falla'!IN52)","v":""},{"$f":"IF('[1]Tasa de Falla'!IO52=0,\"\",'[1]Tasa de Falla'!IO52)","v":""},{"$f":"IF('[1]Tasa de Falla'!IP52=0,\"\",'[1]Tasa de Falla'!IP52)","v":""},{"$f":"IF('[1]Tasa de Falla'!IQ52=0,\"\",'[1]Tasa de Falla'!IQ52)","v":""},{"$f":"IF('[1]Tasa de Falla'!IR52=0,\"\",'[1]Tasa de Falla'!IR52)","v":""},{"$f":"IF('[1]Tasa de Falla'!IS52=0,\"\",'[1]Tasa de Falla'!IS52)","v":""},{"$f":"IF('[1]Tasa de Falla'!IT52=0,\"\",'[1]Tasa de Falla'!IT52)","v":1},{"$f":"IF('[1]Tasa de Falla'!IU52=0,\"\",'[1]Tasa de Falla'!IU52)","v":2},{"$f":"IF('[1]Tasa de Falla'!IV52=0,\"\",'[1]Tasa de Falla'!IV52)","v":""}]
[null,null,{"$f":"'[1]Tasa de Falla'!C53","v":37},{"$f":"'[1]Tasa de Falla'!D53","v":"TUCUMAN NORTE - CABRA CORRAL"},{"$f":"'[1]Tasa de Falla'!E53","v":132},{"$f":"'[1]Tasa de Falla'!F53","v":190},{"$f":"IF('[1]Tasa de Falla'!IK53=0,\"\",'[1]Tasa de Falla'!IK53)","v":"XXXX"},{"$f":"IF('[1]Tasa de Falla'!IL53=0,\"\",'[1]Tasa de Falla'!IL53)","v":"XXXX"},{"$f":"IF('[1]Tasa de Falla'!IM53=0,\"\",'[1]Tasa de Falla'!IM53)","v":"XXXX"},{"$f":"IF('[1]Tasa de Falla'!IN53=0,\"\",'[1]Tasa de Falla'!IN53)","v":"XXXX"},{"$f":"IF('[1]Tasa de Falla'!IO53=0,\"\",'[1]Tasa de Falla'!IO53)","v":"XXXX"},{"$f":"IF('[1]Tasa de Falla'!IP53=0,\"\",'[1]Tasa de Falla'!IP53)","v":"XXXX"},{"$f":"IF('[1]Tasa de Falla'!IQ53=0,\"\",'[1]Tasa de Falla'!IQ53)","v":"XXXX"},{"$f":"IF('[1]Tasa de Falla'!IR53=0,\"\",'[1]Tasa de Falla'!IR53)","v":"XXXX"},{"$f":"IF('[1]Tasa de Falla'!IS53=0,\"\",'[1]Tasa de Falla'!IS53)","v":"XXXX"},{"$f":"IF('[1]Tasa de Falla'!IT53=0,\"\",'[1]Tasa de Falla'!IT53)","v":"XXXX"},{"$f":"IF('[1]Tasa de Falla'!IU53=0,\"\",'[1]Tasa de Falla'!IU53)","v":"XXXX"},{"$f":"IF('[1]Tasa de Falla'!IV53=0,\"\",'[1]Tasa de Falla'!IV53)","v":"XXXX"}]
[null,null,{"$f":"'[1]Tasa de Falla'!C54","v":38},{"$f":"'[1]Tasa de Falla'!D54","v":"METAN - TUCUMAN NORTE"},{"$f":"'[1]Tasa de Falla'!E54","v":132},{"$f":"'[1]Tasa de Falla'!F54","v":155.6},{"$f":"IF('[1]Tasa de Falla'!IK54=0,\"\",'[1]Tasa de Falla'!IK54)","v":""},{"$f":"IF('[1]Tasa de Falla'!IL54=0,\"\",'[1]Tasa de Falla'!IL54)","v":""},{"$f":"IF('[1]Tasa de Falla'!IM54=0,\"\",'[1]Tasa de Falla'!IM54)","v":""},{"$f":"IF('[1]Tasa de Falla'!IN54=0,\"\",'[1]Tasa de Falla'!IN54)","v":""},{"$f":"IF('[1]Tasa de Falla'!IO54=0,\"\",'[1]Tasa de Falla'!IO54)","v":""},{"$f":"IF('[1]Tasa de Falla'!IP54=0,\"\",'[1]Tasa de Falla'!IP54)","v":""},{"$f":"IF('[1]Tasa de Falla'!IQ54=0,\"\",'[1]Tasa de Falla'!IQ54)","v":""},{"$f":"IF('[1]Tasa de Falla'!IR54=0,\"\",'[1]Tasa de Falla'!IR54)","v":1},{"$f":"IF('[1]Tasa de Falla'!IS54=0,\"\",'[1]Tasa de Falla'!IS54)","v":1},{"$f":"IF('[1]Tasa de Falla'!IT54=0,\"\",'[1]Tasa de Falla'!IT54)","v":1},{"$f":"IF('[1]Tasa de Falla'!IU54=0,\"\",'[1]Tasa de Falla'!IU54)","v":""},{"$f":"IF('[1]Tasa de Falla'!IV54=0,\"\",'[1]Tasa de Falla'!IV54)","v":""}]
[null,null,{"$f":"'[1]Tasa de Falla'!C55","v":39},{"$f":"'[1]Tasa de Falla'!D55","v":"SARMIENTO - TUCUMAN NORTE (O.F.)"},{"$f":"'[1]Tasa de Falla'!E55","v":132},{"$f":"'[1]Tasa de Falla'!F55","v":3.3},{"$f":"IF('[1]Tasa de Falla'!IK55=0,\"\",'[1]Tasa de Falla'!IK55)","v":""},{"$f":"IF('[1]Tasa de Falla'!IL55=0,\"\",'[1]Tasa de Falla'!IL55)","v":""},{"$f":"IF('[1]Tasa de Falla'!IM55=0,\"\",'[1]Tasa de Falla'!IM55)","v":""},{"$f":"IF('[1]Tasa de Falla'!IN55=0,\"\",'[1]Tasa de Falla'!IN55)","v":""},{"$f":"IF('[1]Tasa de Falla'!IO55=0,\"\",'[1]Tasa de Falla'!IO55)","v":""},{"$f":"IF('[1]Tasa de Falla'!IP55=0,\"\",'[1]Tasa de Falla'!IP55)","v":""},{"$f":"IF('[1]Tasa de Falla'!IQ55=0,\"\",'[1]Tasa de Falla'!IQ55)","v":""},{"$f":"IF('[1]Tasa de Falla'!IR55=0,\"\",'[1]Tasa de Falla'!IR55)","v":""},{"$f":"IF('[1]Tasa de Falla'!IS55=0,\"\",'[1]Tasa de Falla'!IS55)","v":""},{"$f":"IF('[1]Tasa de Falla'!IT55=0,\"\",'[1]Tasa de Falla'!IT55)","v":""},{"$f":"IF('[1]Tasa de Falla'!IU55=0,\"\",'[1]Tasa de Falla'!IU55)","v":""},{"$f":"IF('[1]Tasa de Falla'!IV55=0,\"\",'[1]Tasa de Falla'!IV55)","v":""}]
[null,null,{"$f":"'[1]Tasa de Falla'!C56","v":40},{"$f":"'[1]Tasa de Falla'!D56","v":"TUCUMAN OESTE - TUCUMAN NORTE"},{"$f":"'[1]Tasa de Falla'!E56","v":132},{"$f":"'[1]Tasa de Falla'!F56","v":7},{"$f":"IF('[1]Tasa de Falla'!IK56=0,\"\",'[1]Tasa de Falla'!IK56)","v":""},{"$f":"IF('[1]Tasa de Falla'!IL56=0,\"\",'[1]Tasa de Falla'!IL56)","v":""},{"$f":"IF('[1]Tasa de Falla'!IM56=0,\"\",'[1]Tasa de Falla'!IM56)","v":2},{"$f":"IF('[1]Tasa de Falla'!IN56=0,\"\",'[1]Tasa de Falla'!IN56)","v":""},{"$f":"IF('[1]Tasa de Falla'!IO56=0,\"\",'[1]Tasa de Falla'!IO56)","v":1},{"$f":"IF('[1]Tasa de Falla'!IP56=0,\"\",'[1]Tasa de Falla'!IP56)","v":""},{"$f":"IF('[1]Tasa de Falla'!IQ56=0,\"\",'[1]Tasa de Falla'!IQ56)","v":""},{"$f":"IF('[1]Tasa de Falla'!IR56=0,\"\",'[1]Tasa de Falla'!IR56)","v":1},{"$f":"IF('[1]Tasa de Falla'!IS56=0,\"\",'[1]Tasa de Falla'!IS56)","v":""},{"$f":"IF('[1]Tasa de Falla'!IT56=0,\"\",'[1]Tasa de Falla'!IT56)","v":""},{"$f":"IF('[1]Tasa de Falla'!IU56=0,\"\",'[1]Tasa de Falla'!IU56)","v":""},{"$f":"IF('[1]Tasa de Falla'!IV56=0,\"\",'[1]Tasa de Falla'!IV56)","v":""}]
[null,null,{"$f":"'[1]Tasa de Falla'!C57","v":41},{"$f":"'[1]Tasa de Falla'!D57","v":"AGUILARES - VILLA QUINTEROS"},{"$f":"'[1]Tasa de Falla'!E57","v":132},{"$f":"'[1]Tasa de Falla'!F57","v":21},{"$f":"IF('[1]Tasa de Falla'!IK57=0,\"\",'[1]Tasa de Falla'!IK57)","v":""},{"$f":"IF('[1]Tasa de Falla'!IL57=0,\"\",'[1]Tasa de Falla'!IL57)","v":""},{"$f":"IF('[1]Tasa de Falla'!IM57=0,\"\",'[1]Tasa de Falla'!IM57)","v":""},{"$f":"IF('[1]Tasa de Falla'!IN57=0,\"\",'[1]Tasa de Falla'!IN57)","v":""},{"$f":"IF('[1]Tasa de Falla'!IO57=0,\"\",'[1]Tasa de Falla'!IO57)","v":""},{"$f":"IF('[1]Tasa de Falla'!IP57=0,\"\",'[1]Tasa de Falla'!IP57)","v":""},{"$f":"IF('[1]Tasa de Falla'!IQ57=0,\"\",'[1]Tasa de Falla'!IQ57)","v":""},{"$f":"IF('[1]Tasa de Falla'!IR57=0,\"\",'[1]Tasa de Falla'!IR57)","v":""},{"$f":"IF('[1]Tasa de Falla'!IS57=0,\"\",'[1]Tasa de Falla'!IS57)","v":""},{"$f":"IF('[1]Tasa de Falla'!IT57=0,\"\",'[1]Tasa de Falla'!IT57)","v":""},{"$f":"IF('[1]Tasa de Falla'!IU57=0,\"\",'[1]Tasa de Falla'!IU57)","v":""},{"$f":"IF('[1]Tasa de Falla'!IV57=0,\"\",'[1]Tasa de Falla'!IV57)","v":""}]
[null,null,{"$f":"'[1]Tasa de Falla'!C58","v":42},{"$f":"'[1]Tasa de Falla'!D58","v":"C.H. PUEBLO VIEJO - VILLA QUINTEROS "},{"$f":"'[1]Tasa de Falla'!E58","v":132},{"$f":"'[1]Tasa de Falla'!F58","v":24.5},{"$f":"IF('[1]Tasa de Falla'!IK58=0,\"\",'[1]Tasa de Falla'!IK58)","v":""},{"$f":"IF('[1]Tasa de Falla'!IL58=0,\"\",'[1]Tasa de Falla'!IL58)","v":""},{"$f":"IF('[1]Tasa de Falla'!IM58=0,\"\",'[1]Tasa de Falla'!IM58)","v":""},{"$f":"IF('[1]Tasa de Falla'!IN58=0,\"\",'[1]Tasa de Falla'!IN58)","v":1},{"$f":"IF('[1]Tasa de Falla'!IO58=0,\"\",'[1]Tasa de Falla'!IO58)","v":""},{"$f":"IF('[1]Tasa de Falla'!IP58=0,\"\",'[1]Tasa de Falla'!IP58)","v":""},{"$f":"IF('[1]Tasa de Falla'!IQ58=0,\"\",'[1]Tasa de Falla'!IQ58)","v":""},{"$f":"IF('[1]Tasa de Falla'!IR58=0,\"\",'[1]Tasa de Falla'!IR58)","v":3},{"$f":"IF('[1]Tasa de Falla'!IS58=0,\"\",'[1]Tasa de Falla'!IS58)","v":""},{"$f":"IF('[1]Tasa de Falla'!IT58=0,\"\",'[1]Tasa de Falla'!IT58)","v":""},{"$f":"IF('[1]Tasa de Falla'!IU58=0,\"\",'[1]Tasa de Falla'!IU58)","v":""},{"$f":"IF('[1]Tasa de Falla'!IV58=0,\"\",'[1]Tasa de Falla'!IV58)","v":1}]
[null,null,{"$f":"'[1]Tasa de Falla'!C59","v":43},{"$f":"'[1]Tasa de Falla'!D59","v":"C.H. RIO HONDO - VILLA QUINTEROS"},{"$f":"'[1]Tasa de Falla'!E59","v":132},{"$f":"'[1]Tasa de Falla'!F59","v":75.400000000000006},{"$f":"IF('[1]Tasa de Falla'!IK59=0,\"\",'[1]Tasa de Falla'!IK59)","v":""},{"$f":"IF('[1]Tasa de Falla'!IL59=0,\"\",'[1]Tasa de Falla'!IL59)","v":""},{"$f":"IF('[1]Tasa de Falla'!IM59=0,\"\",'[1]Tasa de Falla'!IM59)","v":""},{"$f":"IF('[1]Tasa de Falla'!IN59=0,\"\",'[1]Tasa de Falla'!IN59)","v":""},{"$f":"IF('[1]Tasa de Falla'!IO59=0,\"\",'[1]Tasa de Falla'!IO59)","v":""},{"$f":"IF('[1]Tasa de Falla'!IP59=0,\"\",'[1]Tasa de Falla'!IP59)","v":""},{"$f":"IF('[1]Tasa de Falla'!IQ59=0,\"\",'[1]Tasa de Falla'!IQ59)","v":""},{"$f":"IF('[1]Tasa de Falla'!IR59=0,\"\",'[1]Tasa de Falla'!IR59)","v":""},{"$f":"IF('[1]Tasa de Falla'!IS59=0,\"\",'[1]Tasa de Falla'!IS59)","v":""},{"$f":"IF('[1]Tasa de Falla'!IT59=0,\"\",'[1]Tasa de Falla'!IT59)","v":""},{"$f":"IF('[1]Tasa de Falla'!IU59=0,\"\",'[1]Tasa de Falla'!IU59)","v":""},{"$f":"IF('[1]Tasa de Falla'!IV59=0,\"\",'[1]Tasa de Falla'!IV59)","v":""}]
[null,null,{"$f":"'[1]Tasa de Falla'!C60","v":44},{"$f":"'[1]Tasa de Falla'!D60","v":"C.H. RIO HONDO - SANTIAGO CENTRO"},{"$f":"'[1]Tasa de Falla'!E60","v":132},{"$f":"'[1]Tasa de Falla'!F60","v":79},{"$f":"IF('[1]Tasa de Falla'!IK60=0,\"\",'[1]Tasa de Falla'!IK60)","v":"XXXX"},{"$f":"IF('[1]Tasa de Falla'!IL60=0,\"\",'[1]Tasa de Falla'!IL60)","v":"XXXX"},{"$f":"IF('[1]Tasa de Falla'!IM60=0,\"\",'[1]Tasa de Falla'!IM60)","v":"XXXX"},{"$f":"IF('[1]Tasa de Falla'!IN60=0,\"\",'[1]Tasa de Falla'!IN60)","v":"XXXX"},{"$f":"IF('[1]Tasa de Falla'!IO60=0,\"\",'[1]Tasa de Falla'!IO60)","v":"XXXX"},{"$f":"IF('[1]Tasa de Falla'!IP60=0,\"\",'[1]Tasa de Falla'!IP60)","v":"XXXX"},{"$f":"IF('[1]Tasa de Falla'!IQ60=0,\"\",'[1]Tasa de Falla'!IQ60)","v":"XXXX"},{"$f":"IF('[1]Tasa de Falla'!IR60=0,\"\",'[1]Tasa de Falla'!IR60)","v":"XXXX"},{"$f":"IF('[1]Tasa de Falla'!IS60=0,\"\",'[1]Tasa de Falla'!IS60)","v":"XXXX"},{"$f":"IF('[1]Tasa de Falla'!IT60=0,\"\",'[1]Tasa de Falla'!IT60)","v":"XXXX"},{"$f":"IF('[1]Tasa de Falla'!IU60=0,\"\",'[1]Tasa de Falla'!IU60)","v":"XXXX"},{"$f":"IF('[1]Tasa de Falla'!IV60=0,\"\",'[1]Tasa de Falla'!IV60)","v":"XXXX"}]
[null,null,{"$f":"'[1]Tasa de Falla'!C61","v":45},{"$f":"'[1]Tasa de Falla'!D61","v":"C.H. RIO HONDO - EL BRACHO"},{"$f":"'[1]Tasa de Falla'!E61","v":132},{"$f":"'[1]Tasa de Falla'!F61","v":80.66},{"$f":"IF('[1]Tasa de Falla'!IK61=0,\"\",'[1]Tasa de Falla'!IK61)","v":""},{"$f":"IF('[1]Tasa de Falla'!IL61=0,\"\",'[1]Tasa de Falla'!IL61)","v":""},{"$f":"IF('[1]Tasa de Falla'!IM61=0,\"\",'[1]Tasa de Falla'!IM61)","v":""},{"$f":"IF('[1]Tasa de Falla'!IN61=0,\"\",'[1]Tasa de Falla'!IN61)","v":""},{"$f":"IF('[1]Tasa de Falla'!IO61=0,\"\",'[1]Tasa de Falla'!IO61)","v":""},{"$f":"IF('[1]Tasa de Falla'!IP61=0,\"\",'[1]Tasa de Falla'!IP61)","v":""},{"$f":"IF('[1]Tasa de Falla'!IQ61=0,\"\",'[1]Tasa de Falla'!IQ61)","v":""},{"$f":"IF('[1]Tasa de Falla'!IR61=0,\"\",'[1]Tasa de Falla'!IR61)","v":""},{"$f":"IF('[1]Tasa de Falla'!IS61=0,\"\",'[1]Tasa de Falla'!IS61)","v":"XXXX"},{"$f":"IF('[1]Tasa de Falla'!IT61=0,\"\",'[1]Tasa de Falla'!IT61)","v":"XXXX"},{"$f":"IF('[1]Tasa de Falla'!IU61=0,\"\",'[1]Tasa de Falla'!IU61)","v":"XXXX"},{"$f":"IF('[1]Tasa de Falla'!IV61=0,\"\",'[1]Tasa de Falla'!IV61)","v":"XXXX"}]
[null,null,{"$f":"'[1]Tasa de Falla'!C62","v":46},{"$f":"'[1]Tasa de Falla'!D62","v":"SALTA SUR - SALTA NORTE"},{"$f":"'[1]Tasa de Falla'!E62","v":132},{"$f":"'[1]Tasa de Falla'!F62","v":10},{"$f":"IF('[1]Tasa de Falla'!IK62=0,\"\",'[1]Tasa de Falla'!IK62)","v":""},{"$f":"IF('[1]Tasa de Falla'!IL62=0,\"\",'[1]Tasa de Falla'!IL62)","v":""},{"$f":"IF('[1]Tasa de Falla'!IM62=0,\"\",'[1]Tasa de Falla'!IM62)","v":""},{"$f":"IF('[1]Tasa de Falla'!IN62=0,\"\",'[1]Tasa de Falla'!IN62)","v":""},{"$f":"IF('[1]Tasa de Falla'!IO62=0,\"\",'[1]Tasa de Falla'!IO62)","v":""},{"$f":"IF('[1]Tasa de Falla'!IP62=0,\"\",'[1]Tasa de Falla'!IP62)","v":""},{"$f":"IF('[1]Tasa de Falla'!IQ62=0,\"\",'[1]Tasa de Falla'!IQ62)","v":""},{"$f":"IF('[1]Tasa de Falla'!IR62=0,\"\",'[1]Tasa de Falla'!IR62)","v":""},{"$f":"IF('[1]Tasa de Falla'!IS62=0,\"\",'[1]Tasa de Falla'!IS62)","v":""},{"$f":"IF('[1]Tasa de Falla'!IT62=0,\"\",'[1]Tasa de Falla'!IT62)","v":""},{"$f":"IF('[1]Tasa de Falla'!IU62=0,\"\",'[1]Tasa de Falla'!IU62)","v":""},{"$f":"IF('[1]Tasa de Falla'!IV62=0,\"\",'[1]Tasa de Falla'!IV62)","v":""}]
[null,null,{"$f":"'[1]Tasa de Falla'!C63","v":47},{"$f":"'[1]Tasa de Falla'!D63","v":"PALPALA - JUJUY ESTE"},{"$f":"'[1]Tasa de Falla'!E63","v":132},{"$f":"'[1]Tasa de Falla'!F63","v":12.3},{"$f":"IF('[1]Tasa de Falla'!IK63=0,\"\",'[1]Tasa de Falla'!IK63)","v":""},{"$f":"IF('[1]Tasa de Falla'!IL63=0,\"\",'[1]Tasa de Falla'!IL63)","v":""},{"$f":"IF('[1]Tasa de Falla'!IM63=0,\"\",'[1]Tasa de Falla'!IM63)","v":""},{"$f":"IF('[1]Tasa de Falla'!IN63=0,\"\",'[1]Tasa de Falla'!IN63)","v":""},{"$f":"IF('[1]Tasa de Falla'!IO63=0,\"\",'[1]Tasa de Falla'!IO63)","v":""},{"$f":"IF('[1]Tasa de Falla'!IP63=0,\"\",'[1]Tasa de Falla'!IP63)","v":""},{"$f":"IF('[1]Tasa de Falla'!IQ63=0,\"\",'[1]Tasa de Falla'!IQ63)","v":""},{"$f":"IF('[1]Tasa de Falla'!IR63=0,\"\",'[1]Tasa de Falla'!IR63)","v":""},{"$f":"IF('[1]Tasa de Falla'!IS63=0,\"\",'[1]Tasa de Falla'!IS63)","v":""},{"$f":"IF('[1]Tasa de Falla'!IT63=0,\"\",'[1]Tasa de Falla'!IT63)","v":1},{"$f":"IF('[1]Tasa de Falla'!IU63=0,\"\",'[1]Tasa de Falla'!IU63)","v":""},{"$f":"IF('[1]Tasa de Falla'!IV63=0,\"\",'[1]Tasa de Falla'!IV63)","v":""}]
[null,null,{"$f":"'[1]Tasa de Falla'!C64","v":48},{"$f":"'[1]Tasa de Falla'!D64","v":"JUJUY ESTE - JUJUY SUR"},{"$f":"'[1]Tasa de Falla'!E64","v":132},{"$f":"'[1]Tasa de Falla'!F64","v":4.3},{"$f":"IF('[1]Tasa de Falla'!IK64=0,\"\",'[1]Tasa de Falla'!IK64)","v":""},{"$f":"IF('[1]Tasa de Falla'!IL64=0,\"\",'[1]Tasa de Falla'!IL64)","v":1},{"$f":"IF('[1]Tasa de Falla'!IM64=0,\"\",'[1]Tasa de Falla'!IM64)","v":""},{"$f":"IF('[1]Tasa de Falla'!IN64=0,\"\",'[1]Tasa de Falla'!IN64)","v":""},{"$f":"IF('[1]Tasa de Falla'!IO64=0,\"\",'[1]Tasa de Falla'!IO64)","v":""},{"$f":"IF('[1]Tasa de Falla'!IP64=0,\"\",'[1]Tasa de Falla'!IP64)","v":""},{"$f":"IF('[1]Tasa de Falla'!IQ64=0,\"\",'[1]Tasa de Falla'!IQ64)","v":""},{"$f":"IF('[1]Tasa de Falla'!IR64=0,\"\",'[1]Tasa de Falla'!IR64)","v":""},{"$f":"IF('[1]Tasa de Falla'!IS64=0,\"\",'[1]Tasa de Falla'!IS64)","v":""},{"$f":"IF('[1]Tasa de Falla'!IT64=0,\"\",'[1]Tasa de Falla'!IT64)","v":""},{"$f":"IF('[1]Tasa de Falla'!IU64=0,\"\",'[1]Tasa de Falla'!IU64)","v":""},{"$f":"IF('[1]Tasa de Falla'!IV64=0,\"\",'[1]Tasa de Falla'!IV64)","v":""}]
[null,null,{"$f":"'[1]Tasa de Falla'!C65","v":49},{"$f":"'[1]Tasa de Falla'!D65","v":"CEVIL POZO - GUEMES"},{"$f":"'[1]Tasa de Falla'!E65","v":132},{"$f":"'[1]Tasa de Falla'!F65","v":291},{"$f":"IF('[1]Tasa de Falla'!IK65=0,\"\",'[1]Tasa de Falla'!IK65)","v":"XXXX"},{"$f":"IF('[1]Tasa de Falla'!IL65=0,\"\",'[1]Tasa de Falla'!IL65)","v":"XXXX"},{"$f":"IF('[1]Tasa de Falla'!IM65=0,\"\",'[1]Tasa de Falla'!IM65)","v":"XXXX"},{"$f":"IF('[1]Tasa de Falla'!IN65=0,\"\",'[1]Tasa de Falla'!IN65)","v":"XXXX"},{"$f":"IF('[1]Tasa de Falla'!IO65=0,\"\",'[1]Tasa de Falla'!IO65)","v":"XXXX"},{"$f":"IF('[1]Tasa de Falla'!IP65=0,\"\",'[1]Tasa de Falla'!IP65)","v":"XXXX"},{"$f":"IF('[1]Tasa de Falla'!IQ65=0,\"\",'[1]Tasa de Falla'!IQ65)","v":"XXXX"},{"$f":"IF('[1]Tasa de Falla'!IR65=0,\"\",'[1]Tasa de Falla'!IR65)","v":"XXXX"},{"$f":"IF('[1]Tasa de Falla'!IS65=0,\"\",'[1]Tasa de Falla'!IS65)","v":"XXXX"},{"$f":"IF('[1]Tasa de Falla'!IT65=0,\"\",'[1]Tasa de Falla'!IT65)","v":"XXXX"},{"$f":"IF('[1]Tasa de Falla'!IU65=0,\"\",'[1]Tasa de Falla'!IU65)","v":"XXXX"},{"$f":"IF('[1]Tasa de Falla'!IV65=0,\"\",'[1]Tasa de Falla'!IV65)","v":"XXXX"}]
[null,null,{"$f":"'[1]Tasa de Falla'!C66","v":50},{"$f":"'[1]Tasa de Falla'!D66","v":"CEVIL POZO - EL BRACHO"},{"$f":"'[1]Tasa de Falla'!E66","v":132},{"$f":"'[1]Tasa de Falla'!F66","v":17},{"$f":"IF('[1]Tasa de Falla'!IK66=0,\"\",'[1]Tasa de Falla'!IK66)","v":""},{"$f":"IF('[1]Tasa de Falla'!IL66=0,\"\",'[1]Tasa de Falla'!IL66)","v":""},{"$f":"IF('[1]Tasa de Falla'!IM66=0,\"\",'[1]Tasa de Falla'!IM66)","v":""},{"$f":"IF('[1]Tasa de Falla'!IN66=0,\"\",'[1]Tasa de Falla'!IN66)","v":""},{"$f":"IF('[1]Tasa de Falla'!IO66=0,\"\",'[1]Tasa de Falla'!IO66)","v":""},{"$f":"IF('[1]Tasa de Falla'!IP66=0,\"\",'[1]Tasa de Falla'!IP66)","v":""},{"$f":"IF('[1]Tasa de Falla'!IQ66=0,\"\",'[1]Tasa de Falla'!IQ66)","v":""},{"$f":"IF('[1]Tasa de Falla'!IR66=0,\"\",'[1]Tasa de Falla'!IR66)","v":""},{"$f":"IF('[1]Tasa de Falla'!IS66=0,\"\",'[1]Tasa de Falla'!IS66)","v":""},{"$f":"IF('[1]Tasa de Falla'!IT66=0,\"\",'[1]Tasa de Falla'!IT66)","v":""},{"$f":"IF('[1]Tasa de Falla'!IU66=0,\"\",'[1]Tasa de Falla'!IU66)","v":""},{"$f":"IF('[1]Tasa de Falla'!IV66=0,\"\",'[1]Tasa de Falla'!IV66)","v":""}]
[null,null,{"$f":"'[1]Tasa de Falla'!C67","v":0},{"$f":"'[1]Tasa de Falla'!D67","v":0},{"$f":"'[1]Tasa de Falla'!E67","v":0},{"$f":"'[1]Tasa de Falla'!F67","v":0},{"$f":"IF('[1]Tasa de Falla'!IK67=0,\"\",'[1]Tasa de Falla'!IK67)","v":""},{"$f":"IF('[1]Tasa de Falla'!IL67=0,\"\",'[1]Tasa de Falla'!IL67)","v":""},{"$f":"IF('[1]Tasa de Falla'!IM67=0,\"\",'[1]Tasa de Falla'!IM67)","v":""},{"$f":"IF('[1]Tasa de Falla'!IN67=0,\"\",'[1]Tasa de Falla'!IN67)","v":""},{"$f":"IF('[1]Tasa de Falla'!IO67=0,\"\",'[1]Tasa de Falla'!IO67)","v":""},{"$f":"IF('[1]Tasa de Falla'!IP67=0,\"\",'[1]Tasa de Falla'!IP67)","v":""},{"$f":"IF('[1]Tasa de Falla'!IQ67=0,\"\",'[1]Tasa de Falla'!IQ67)","v":""},{"$f":"IF('[1]Tasa de Falla'!IR67=0,\"\",'[1]Tasa de Falla'!IR67)","v":""},{"$f":"IF('[1]Tasa de Falla'!IS67=0,\"\",'[1]Tasa de Falla'!IS67)","v":""},{"$f":"IF('[1]Tasa de Falla'!IT67=0,\"\",'[1]Tasa de Falla'!IT67)","v":""},{"$f":"IF('[1]Tasa de Falla'!IU67=0,\"\",'[1]Tasa de Falla'!IU67)","v":""},{"$f":"IF('[1]Tasa de Falla'!IV67=0,\"\",'[1]Tasa de Falla'!IV67)","v":""}]
[null,null,{"$f":"'[1]Tasa de Falla'!C68","v":51},{"$f":"'[1]Tasa de Falla'!D68","v":"METAN - EL TUNAL"},{"$f":"'[1]Tasa de Falla'!E68","v":132},{"$f":"'[1]Tasa de Falla'!F68","v":75.599999999999994},{"$f":"IF('[1]Tasa de Falla'!IK68=0,\"\",'[1]Tasa de Falla'!IK68)","v":""},{"$f":"IF('[1]Tasa de Falla'!IL68=0,\"\",'[1]Tasa de Falla'!IL68)","v":""},{"$f":"IF('[1]Tasa de Falla'!IM68=0,\"\",'[1]Tasa de Falla'!IM68)","v":""},{"$f":"IF('[1]Tasa de Falla'!IN68=0,\"\",'[1]Tasa de Falla'!IN68)","v":""},{"$f":"IF('[1]Tasa de Falla'!IO68=0,\"\",'[1]Tasa de Falla'!IO68)","v":""},{"$f":"IF('[1]Tasa de Falla'!IP68=0,\"\",'[1]Tasa de Falla'!IP68)","v":""},{"$f":"IF('[1]Tasa de Falla'!IQ68=0,\"\",'[1]Tasa de Falla'!IQ68)","v":""},{"$f":"IF('[1]Tasa de Falla'!IR68=0,\"\",'[1]Tasa de Falla'!IR68)","v":""},{"$f":"IF('[1]Tasa de Falla'!IS68=0,\"\",'[1]Tasa de Falla'!IS68)","v":""},{"$f":"IF('[1]Tasa de Falla'!IT68=0,\"\",'[1]Tasa de Falla'!IT68)","v":""},{"$f":"IF('[1]Tasa de Falla'!IU68=0,\"\",'[1]Tasa de Falla'!IU68)","v":""},{"$f":"IF('[1]Tasa de Falla'!IV68=0,\"\",'[1]Tasa de Falla'!IV68)","v":""}]
[null,null,{"$f":"'[1]Tasa de Falla'!C69","v":52},{"$f":"'[1]Tasa de Falla'!D69","v":"EL TUNAL - J.V. GONZALEZ"},{"$f":"'[1]Tasa de Falla'!E69","v":132},{"$f":"'[1]Tasa de Falla'!F69","v":41.4},{"$f":"IF('[1]Tasa de Falla'!IK69=0,\"\",'[1]Tasa de Falla'!IK69)","v":""},{"$f":"IF('[1]Tasa de Falla'!IL69=0,\"\",'[1]Tasa de Falla'!IL69)","v":""},{"$f":"IF('[1]Tasa de Falla'!IM69=0,\"\",'[1]Tasa de Falla'!IM69)","v":""},{"$f":"IF('[1]Tasa de Falla'!IN69=0,\"\",'[1]Tasa de Falla'!IN69)","v":""},{"$f":"IF('[1]Tasa de Falla'!IO69=0,\"\",'[1]Tasa de Falla'!IO69)","v":""},{"$f":"IF('[1]Tasa de Falla'!IP69=0,\"\",'[1]Tasa de Falla'!IP69)","v":""},{"$f":"IF('[1]Tasa de Falla'!IQ69=0,\"\",'[1]Tasa de Falla'!IQ69)","v":""},{"$f":"IF('[1]Tasa de Falla'!IR69=0,\"\",'[1]Tasa de Falla'!IR69)","v":""},{"$f":"IF('[1]Tasa de Falla'!IS69=0,\"\",'[1]Tasa de Falla'!IS69)","v":""},{"$f":"IF('[1]Tasa de Falla'!IT69=0,\"\",'[1]Tasa de Falla'!IT69)","v":""},{"$f":"IF('[1]Tasa de Falla'!IU69=0,\"\",'[1]Tasa de Falla'!IU69)","v":""},{"$f":"IF('[1]Tasa de Falla'!IV69=0,\"\",'[1]Tasa de Falla'!IV69)","v":""}]
[null,null,{"$f":"'[1]Tasa de Falla'!C70","v":0},{"$f":"'[1]Tasa de Falla'!D70","v":0},{"$f":"'[1]Tasa de Falla'!E70","v":0},{"$f":"'[1]Tasa de Falla'!F70","v":0},{"$f":"IF('[1]Tasa de Falla'!IK70=0,\"\",'[1]Tasa de Falla'!IK70)","v":""},{"$f":"IF('[1]Tasa de Falla'!IL70=0,\"\",'[1]Tasa de Falla'!IL70)","v":""},{"$f":"IF('[1]Tasa de Falla'!IM70=0,\"\",'[1]Tasa de Falla'!IM70)","v":""},{"$f":"IF('[1]Tasa de Falla'!IN70=0,\"\",'[1]Tasa de Falla'!IN70)","v":""},{"$f":"IF('[1]Tasa de Falla'!IO70=0,\"\",'[1]Tasa de Falla'!IO70)","v":""},{"$f":"IF('[1]Tasa de Falla'!IP70=0,\"\",'[1]Tasa de Falla'!IP70)","v":""},{"$f":"IF('[1]Tasa de Falla'!IQ70=0,\"\",'[1]Tasa de Falla'!IQ70)","v":""},{"$f":"IF('[1]Tasa de Falla'!IR70=0,\"\",'[1]Tasa de Falla'!IR70)","v":""},{"$f":"IF('[1]Tasa de Falla'!IS70=0,\"\",'[1]Tasa de Falla'!IS70)","v":""},{"$f":"IF('[1]Tasa de Falla'!IT70=0,\"\",'[1]Tasa de Falla'!IT70)","v":""},{"$f":"IF('[1]Tasa de Falla'!IU70=0,\"\",'[1]Tasa de Falla'!IU70)","v":""},{"$f":"IF('[1]Tasa de Falla'!IV70=0,\"\",'[1]Tasa de Falla'!IV70)","v":""}]
[null,null,{"$f":"'[1]Tasa de Falla'!C71","v":53},{"$f":"'[1]Tasa de Falla'!D71","v":"LOS PIZARROS - ESCABA"},{"$f":"'[1]Tasa de Falla'!E71","v":132},{"$f":"'[1]Tasa de Falla'!F71","v":21.4},{"$f":"IF('[1]Tasa de Falla'!IK71=0,\"\",'[1]Tasa de Falla'!IK71)","v":""},{"$f":"IF('[1]Tasa de Falla'!IL71=0,\"\",'[1]Tasa de Falla'!IL71)","v":""},{"$f":"IF('[1]Tasa de Falla'!IM71=0,\"\",'[1]Tasa de Falla'!IM71)","v":""},{"$f":"IF('[1]Tasa de Falla'!IN71=0,\"\",'[1]Tasa de Falla'!IN71)","v":""},{"$f":"IF('[1]Tasa de Falla'!IO71=0,\"\",'[1]Tasa de Falla'!IO71)","v":""},{"$f":"IF('[1]Tasa de Falla'!IP71=0,\"\",'[1]Tasa de Falla'!IP71)","v":""},{"$f":"IF('[1]Tasa de Falla'!IQ71=0,\"\",'[1]Tasa de Falla'!IQ71)","v":""},{"$f":"IF('[1]Tasa de Falla'!IR71=0,\"\",'[1]Tasa de Falla'!IR71)","v":1},{"$f":"IF('[1]Tasa de Falla'!IS71=0,\"\",'[1]Tasa de Falla'!IS71)","v":""},{"$f":"IF('[1]Tasa de Falla'!IT71=0,\"\",'[1]Tasa de Falla'!IT71)","v":1},{"$f":"IF('[1]Tasa de Falla'!IU71=0,\"\",'[1]Tasa de Falla'!IU71)","v":""},{"$f":"IF('[1]Tasa de Falla'!IV71=0,\"\",'[1]Tasa de Falla'!IV71)","v":1}]
[null,null,{"$f":"'[1]Tasa de Falla'!C72","v":54},{"$f":"'[1]Tasa de Falla'!D72","v":"LOS PIZARROS - LA COCHA"},{"$f":"'[1]Tasa de Falla'!E72","v":132},{"$f":"'[1]Tasa de Falla'!F72","v":6.5},{"$f":"IF('[1]Tasa de Falla'!IK72=0,\"\",'[1]Tasa de Falla'!IK72)","v":""},{"$f":"IF('[1]Tasa de Falla'!IL72=0,\"\",'[1]Tasa de Falla'!IL72)","v":""},{"$f":"IF('[1]Tasa de Falla'!IM72=0,\"\",'[1]Tasa de Falla'!IM72)","v":""},{"$f":"IF('[1]Tasa de Falla'!IN72=0,\"\",'[1]Tasa de Falla'!IN72)","v":""},{"$f":"IF('[1]Tasa de Falla'!IO72=0,\"\",'[1]Tasa de Falla'!IO72)","v":""},{"$f":"IF('[1]Tasa de Falla'!IP72=0,\"\",'[1]Tasa de Falla'!IP72)","v":""},{"$f":"IF('[1]Tasa de Falla'!IQ72=0,\"\",'[1]Tasa de Falla'!IQ72)","v":""},{"$f":"IF('[1]Tasa de Falla'!IR72=0,\"\",'[1]Tasa de Falla'!IR72)","v":""},{"$f":"IF('[1]Tasa de Falla'!IS72=0,\"\",'[1]Tasa de Falla'!IS72)","v":""},{"$f":"IF('[1]Tasa de Falla'!IT72=0,\"\",'[1]Tasa de Falla'!IT72)","v":""},{"$f":"IF('[1]Tasa de Falla'!IU72=0,\"\",'[1]Tasa de Falla'!IU72)","v":""},{"$f":"IF('[1]Tasa de Falla'!IV72=0,\"\",'[1]Tasa de Falla'!IV72)","v":""}]
[null,null,{"$f":"'[1]Tasa de Falla'!C73","v":55},{"$f":"'[1]Tasa de Falla'!D73","v":"HUACRA - LOS PIZARROS"},{"$f":"'[1]Tasa de Falla'!E73","v":132},{"$f":"'[1]Tasa de Falla'!F73","v":28.5},{"$f":"IF('[1]Tasa de Falla'!IK73=0,\"\",'[1]Tasa de Falla'!IK73)","v":""},{"$f":"IF('[1]Tasa de Falla'!IL73=0,\"\",'[1]Tasa de Falla'!IL73)","v":""},{"$f":"IF('[1]Tasa de Falla'!IM73=0,\"\",'[1]Tasa de Falla'!IM73)","v":""},{"$f":"IF('[1]Tasa de Falla'!IN73=0,\"\",'[1]Tasa de Falla'!IN73)","v":""},{"$f":"IF('[1]Tasa de Falla'!IO73=0,\"\",'[1]Tasa de Falla'!IO73)","v":""},{"$f":"IF('[1]Tasa de Falla'!IP73=0,\"\",'[1]Tasa de Falla'!IP73)","v":""},{"$f":"IF('[1]Tasa de Falla'!IQ73=0,\"\",'[1]Tasa de Falla'!IQ73)","v":""},{"$f":"IF('[1]Tasa de Falla'!IR73=0,\"\",'[1]Tasa de Falla'!IR73)","v":""},{"$f":"IF('[1]Tasa de Falla'!IS73=0,\"\",'[1]Tasa de Falla'!IS73)","v":""},{"$f":"IF('[1]Tasa de Falla'!IT73=0,\"\",'[1]Tasa de Falla'!IT73)","v":1},{"$f":"IF('[1]Tasa de Falla'!IU73=0,\"\",'[1]Tasa de Falla'!IU73)","v":1},{"$f":"IF('[1]Tasa de Falla'!IV73=0,\"\",'[1]Tasa de Falla'!IV73)","v":""}]
[null,null,{"$f":"'[1]Tasa de Falla'!C74","v":56},{"$f":"'[1]Tasa de Falla'!D74","v":"CEVIL POZO - AVELLANEDA"},{"$f":"'[1]Tasa de Falla'!E74","v":132},{"$f":"'[1]Tasa de Falla'!F74","v":8},{"$f":"IF('[1]Tasa de Falla'!IK74=0,\"\",'[1]Tasa de Falla'!IK74)","v":""},{"$f":"IF('[1]Tasa de Falla'!IL74=0,\"\",'[1]Tasa de Falla'!IL74)","v":""},{"$f":"IF('[1]Tasa de Falla'!IM74=0,\"\",'[1]Tasa de Falla'!IM74)","v":""},{"$f":"IF('[1]Tasa de Falla'!IN74=0,\"\",'[1]Tasa de Falla'!IN74)","v":""},{"$f":"IF('[1]Tasa de Falla'!IO74=0,\"\",'[1]Tasa de Falla'!IO74)","v":""},{"$f":"IF('[1]Tasa de Falla'!IP74=0,\"\",'[1]Tasa de Falla'!IP74)","v":""},{"$f":"IF('[1]Tasa de Falla'!IQ74=0,\"\",'[1]Tasa de Falla'!IQ74)","v":""},{"$f":"IF('[1]Tasa de Falla'!IR74=0,\"\",'[1]Tasa de Falla'!IR74)","v":""},{"$f":"IF('[1]Tasa de Falla'!IS74=0,\"\",'[1]Tasa de Falla'!IS74)","v":""},{"$f":"IF('[1]Tasa de Falla'!IT74=0,\"\",'[1]Tasa de Falla'!IT74)","v":""},{"$f":"IF('[1]Tasa de Falla'!IU74=0,\"\",'[1]Tasa de Falla'!IU74)","v":""},{"$f":"IF('[1]Tasa de Falla'!IV74=0,\"\",'[1]Tasa de Falla'!IV74)","v":""}]
[null,null,{"$f":"'[1]Tasa de Falla'!C75","v":57},{"$f":"'[1]Tasa de Falla'!D75","v":"CABRA CORRAL - SALTA ESTE"},{"$f":"'[1]Tasa de Falla'!E75","v":132},{"$f":"'[1]Tasa de Falla'!F75","v":55},{"$f":"IF('[1]Tasa de Falla'!IK75=0,\"\",'[1]Tasa de Falla'!IK75)","v":1},{"$f":"IF('[1]Tasa de Falla'!IL75=0,\"\",'[1]Tasa de Falla'!IL75)","v":""},{"$f":"IF('[1]Tasa de Falla'!IM75=0,\"\",'[1]Tasa de Falla'!IM75)","v":2},{"$f":"IF('[1]Tasa de Falla'!IN75=0,\"\",'[1]Tasa de Falla'!IN75)","v":""},{"$f":"IF('[1]Tasa de Falla'!IO75=0,\"\",'[1]Tasa de Falla'!IO75)","v":""},{"$f":"IF('[1]Tasa de Falla'!IP75=0,\"\",'[1]Tasa de Falla'!IP75)","v":""},{"$f":"IF('[1]Tasa de Falla'!IQ75=0,\"\",'[1]Tasa de Falla'!IQ75)","v":""},{"$f":"IF('[1]Tasa de Falla'!IR75=0,\"\",'[1]Tasa de Falla'!IR75)","v":1},{"$f":"IF('[1]Tasa de Falla'!IS75=0,\"\",'[1]Tasa de Falla'!IS75)","v":""},{"$f":"IF('[1]Tasa de Falla'!IT75=0,\"\",'[1]Tasa de Falla'!IT75)","v":""},{"$f":"IF('[1]Tasa de Falla'!IU75=0,\"\",'[1]Tasa de Falla'!IU75)","v":1},{"$f":"IF('[1]Tasa de Falla'!IV75=0,\"\",'[1]Tasa de Falla'!IV75)","v":""}]
[null,null,{"$f":"'[1]Tasa de Falla'!C76","v":58},{"$f":"'[1]Tasa de Falla'!D76","v":"SALTA ESTE - SALTA SUR"},{"$f":"'[1]Tasa de Falla'!E76","v":132},{"$f":"'[1]Tasa de Falla'!F76","v":7},{"$f":"IF('[1]Tasa de Falla'!IK76=0,\"\",'[1]Tasa de Falla'!IK76)","v":""},{"$f":"IF('[1]Tasa de Falla'!IL76=0,\"\",'[1]Tasa de Falla'!IL76)","v":""},{"$f":"IF('[1]Tasa de Falla'!IM76=0,\"\",'[1]Tasa de Falla'!IM76)","v":""},{"$f":"IF('[1]Tasa de Falla'!IN76=0,\"\",'[1]Tasa de Falla'!IN76)","v":""},{"$f":"IF('[1]Tasa de Falla'!IO76=0,\"\",'[1]Tasa de Falla'!IO76)","v":""},{"$f":"IF('[1]Tasa de Falla'!IP76=0,\"\",'[1]Tasa de Falla'!IP76)","v":""},{"$f":"IF('[1]Tasa de Falla'!IQ76=0,\"\",'[1]Tasa de Falla'!IQ76)","v":""},{"$f":"IF('[1]Tasa de Falla'!IR76=0,\"\",'[1]Tasa de Falla'!IR76)","v":""},{"$f":"IF('[1]Tasa de Falla'!IS76=0,\"\",'[1]Tasa de Falla'!IS76)","v":""},{"$f":"IF('[1]Tasa de Falla'!IT76=0,\"\",'[1]Tasa de Falla'!IT76)","v":""},{"$f":"IF('[1]Tasa de Falla'!IU76=0,\"\",'[1]Tasa de Falla'!IU76)","v":""},{"$f":"IF('[1]Tasa de Falla'!IV76=0,\"\",'[1]Tasa de Falla'!IV76)","v":""}]
[null,null,{"$f":"'[1]Tasa de Falla'!C77","v":59},{"$f":"'[1]Tasa de Falla'!D77","v":"V. QUINTEROS - ACONQUIJA - ANDALGALA"},{"$f":"'[1]Tasa de Falla'!E77","v":132},{"$f":"'[1]Tasa de Falla'!F77","v":102},{"$f":"IF('[1]Tasa de Falla'!IK77=0,\"\",'[1]Tasa de Falla'!IK77)","v":""},{"$f":"IF('[1]Tasa de Falla'!IL77=0,\"\",'[1]Tasa de Falla'!IL77)","v":""},{"$f":"IF('[1]Tasa de Falla'!IM77=0,\"\",'[1]Tasa de Falla'!IM77)","v":""},{"$f":"IF('[1]Tasa de Falla'!IN77=0,\"\",'[1]Tasa de Falla'!IN77)","v":""},{"$f":"IF('[1]Tasa de Falla'!IO77=0,\"\",'[1]Tasa de Falla'!IO77)","v":""},{"$f":"IF('[1]Tasa de Falla'!IP77=0,\"\",'[1]Tasa de Falla'!IP77)","v":""},{"$f":"IF('[1]Tasa de Falla'!IQ77=0,\"\",'[1]Tasa de Falla'!IQ77)","v":1},{"$f":"IF('[1]Tasa de Falla'!IR77=0,\"\",'[1]Tasa de Falla'!IR77)","v":""},{"$f":"IF('[1]Tasa de Falla'!IS77=0,\"\",'[1]Tasa de Falla'!IS77)","v":""},{"$f":"IF('[1]Tasa de Falla'!IT77=0,\"\",'[1]Tasa de Falla'!IT77)","v":""},{"$f":"IF('[1]Tasa de Falla'!IU77=0,\"\",'[1]Tasa de Falla'!IU77)","v":2},{"$f":"IF('[1]Tasa de Falla'!IV77=0,\"\",'[1]Tasa de Falla'!IV77)","v":1}]
[null,null,{"$f":"'[1]Tasa de Falla'!C78","v":60},{"$f":"'[1]Tasa de Falla'!D78","v":"ANDALGALA - BELEN"},{"$f":"'[1]Tasa de Falla'!E78","v":132},{"$f":"'[1]Tasa de Falla'!F78","v":80.3},{"$f":"IF('[1]Tasa de Falla'!IK78=0,\"\",'[1]Tasa de Falla'!IK78)","v":""},{"$f":"IF('[1]Tasa de Falla'!IL78=0,\"\",'[1]Tasa de Falla'!IL78)","v":""},{"$f":"IF('[1]Tasa de Falla'!IM78=0,\"\",'[1]Tasa de Falla'!IM78)","v":""},{"$f":"IF('[1]Tasa de Falla'!IN78=0,\"\",'[1]Tasa de Falla'!IN78)","v":""},{"$f":"IF('[1]Tasa de Falla'!IO78=0,\"\",'[1]Tasa de Falla'!IO78)","v":""},{"$f":"IF('[1]Tasa de Falla'!IP78=0,\"\",'[1]Tasa de Falla'!IP78)","v":""},{"$f":"IF('[1]Tasa de Falla'!IQ78=0,\"\",'[1]Tasa de Falla'!IQ78)","v":""},{"$f":"IF('[1]Tasa de Falla'!IR78=0,\"\",'[1]Tasa de Falla'!IR78)","v":""},{"$f":"IF('[1]Tasa de Falla'!IS78=0,\"\",'[1]Tasa de Falla'!IS78)","v":""},{"$f":"IF('[1]Tasa de Falla'!IT78=0,\"\",'[1]Tasa de Falla'!IT78)","v":""},{"$f":"IF('[1]Tasa de Falla'!IU78=0,\"\",'[1]Tasa de Falla'!IU78)","v":1},{"$f":"IF('[1]Tasa de Falla'!IV78=0,\"\",'[1]Tasa de Falla'!IV78)","v":""}]
[null,null,{"$f":"'[1]Tasa de Falla'!C79","v":61},{"$f":"'[1]Tasa de Falla'!D79","v":"TUCUMAN NORTE - TRANCAS"},{"$f":"'[1]Tasa de Falla'!E79","v":132},{"$f":"'[1]Tasa de Falla'!F79","v":75},{"$f":"IF('[1]Tasa de Falla'!IK79=0,\"\",'[1]Tasa de Falla'!IK79)","v":""},{"$f":"IF('[1]Tasa de Falla'!IL79=0,\"\",'[1]Tasa de Falla'!IL79)","v":""},{"$f":"IF('[1]Tasa de Falla'!IM79=0,\"\",'[1]Tasa de Falla'!IM79)","v":""},{"$f":"IF('[1]Tasa de Falla'!IN79=0,\"\",'[1]Tasa de Falla'!IN79)","v":""},{"$f":"IF('[1]Tasa de Falla'!IO79=0,\"\",'[1]Tasa de Falla'!IO79)","v":""},{"$f":"IF('[1]Tasa de Falla'!IP79=0,\"\",'[1]Tasa de Falla'!IP79)","v":""},{"$f":"IF('[1]Tasa de Falla'!IQ79=0,\"\",'[1]Tasa de Falla'!IQ79)","v":""},{"$f":"IF('[1]Tasa de Falla'!IR79=0,\"\",'[1]Tasa de Falla'!IR79)","v":""},{"$f":"IF('[1]Tasa de Falla'!IS79=0,\"\",'[1]Tasa de Falla'!IS79)","v":""},{"$f":"IF('[1]Tasa de Falla'!IT79=0,\"\",'[1]Tasa de Falla'!IT79)","v":""},{"$f":"IF('[1]Tasa de Falla'!IU79=0,\"\",'[1]Tasa de Falla'!IU79)","v":""},{"$f":"IF('[1]Tasa de Falla'!IV79=0,\"\",'[1]Tasa de Falla'!IV79)","v":""}]
[null,null,{"$f":"'[1]Tasa de Falla'!C80","v":62},{"$f":"'[1]Tasa de Falla'!D80","v":"CABRA CORRAL - TRANCAS"},{"$f":"'[1]Tasa de Falla'!E80","v":132},{"$f":"'[1]Tasa de Falla'!F80","v":115},{"$f":"IF('[1]Tasa de Falla'!IK80=0,\"\",'[1]Tasa de Falla'!IK80)","v":"XXXX"},{"$f":"IF('[1]Tasa de Falla'!IL80=0,\"\",'[1]Tasa de Falla'!IL80)","v":"XXXX"},{"$f":"IF('[1]Tasa de Falla'!IM80=0,\"\",'[1]Tasa de Falla'!IM80)","v":"XXXX"},{"$f":"IF('[1]Tasa de Falla'!IN80=0,\"\",'[1]Tasa de Falla'!IN80)","v":"XXXX"},{"$f":"IF('[1]Tasa de Falla'!IO80=0,\"\",'[1]Tasa de Falla'!IO80)","v":"XXXX"},{"$f":"IF('[1]Tasa de Falla'!IP80=0,\"\",'[1]Tasa de Falla'!IP80)","v":"XXXX"},{"$f":"IF('[1]Tasa de Falla'!IQ80=0,\"\",'[1]Tasa de Falla'!IQ80)","v":"XXXX"},{"$f":"IF('[1]Tasa de Falla'!IR80=0,\"\",'[1]Tasa de Falla'!IR80)","v":"XXXX"},{"$f":"IF('[1]Tasa de Falla'!IS80=0,\"\",'[1]Tasa de Falla'!IS80)","v":"XXXX"},{"$f":"IF('[1]Tasa de Falla'!IT80=0,\"\",'[1]Tasa de Falla'!IT80)","v":"XXXX"},{"$f":"IF('[1]Tasa de Falla'!IU80=0,\"\",'[1]Tasa de Falla'!IU80)","v":"XXXX"},{"$f":"IF('[1]Tasa de Falla'!IV80=0,\"\",'[1]Tasa de Falla'!IV80)","v":"XXXX"}]
[null,null,{"$f":"'[1]Tasa de Falla'!C81","v":63},{"$f":"'[1]Tasa de Falla'!D81","v":"LAS MADERAS - JUJUY SUR"},{"$f":"'[1]Tasa de Falla'!E81","v":132},{"$f":"'[1]Tasa de Falla'!F81","v":27.6},{"$f":"IF('[1]Tasa de Falla'!IK81=0,\"\",'[1]Tasa de Falla'!IK81)","v":""},{"$f":"IF('[1]Tasa de Falla'!IL81=0,\"\",'[1]Tasa de Falla'!IL81)","v":""},{"$f":"IF('[1]Tasa de Falla'!IM81=0,\"\",'[1]Tasa de Falla'!IM81)","v":""},{"$f":"IF('[1]Tasa de Falla'!IN81=0,\"\",'[1]Tasa de Falla'!IN81)","v":""},{"$f":"IF('[1]Tasa de Falla'!IO81=0,\"\",'[1]Tasa de Falla'!IO81)","v":""},{"$f":"IF('[1]Tasa de Falla'!IP81=0,\"\",'[1]Tasa de Falla'!IP81)","v":""},{"$f":"IF('[1]Tasa de Falla'!IQ81=0,\"\",'[1]Tasa de Falla'!IQ81)","v":""},{"$f":"IF('[1]Tasa de Falla'!IR81=0,\"\",'[1]Tasa de Falla'!IR81)","v":""},{"$f":"IF('[1]Tasa de Falla'!IS81=0,\"\",'[1]Tasa de Falla'!IS81)","v":""},{"$f":"IF('[1]Tasa de Falla'!IT81=0,\"\",'[1]Tasa de Falla'!IT81)","v":1},{"$f":"IF('[1]Tasa de Falla'!IU81=0,\"\",'[1]Tasa de Falla'!IU81)","v":""},{"$f":"IF('[1]Tasa de Falla'!IV81=0,\"\",'[1]Tasa de Falla'!IV81)","v":""}]
[null,null,{"$f":"'[1]Tasa de Falla'!C82","v":64},{"$f":"'[1]Tasa de Falla'!D82","v":"BELEN - TINOGASTA"},{"$f":"'[1]Tasa de Falla'!E82","v":132},{"$f":"'[1]Tasa de Falla'!F82","v":72},{"$f":"IF('[1]Tasa de Falla'!IK82=0,\"\",'[1]Tasa de Falla'!IK82)","v":""},{"$f":"IF('[1]Tasa de Falla'!IL82=0,\"\",'[1]Tasa de Falla'!IL82)","v":""},{"$f":"IF('[1]Tasa de Falla'!IM82=0,\"\",'[1]Tasa de Falla'!IM82)","v":""},{"$f":"IF('[1]Tasa de Falla'!IN82=0,\"\",'[1]Tasa de Falla'!IN82)","v":""},{"$f":"IF('[1]Tasa de Falla'!IO82=0,\"\",'[1]Tasa de Falla'!IO82)","v":""},{"$f":"IF('[1]Tasa de Falla'!IP82=0,\"\",'[1]Tasa de Falla'!IP82)","v":""},{"$f":"IF('[1]Tasa de Falla'!IQ82=0,\"\",'[1]Tasa de Falla'!IQ82)","v":""},{"$f":"IF('[1]Tasa de Falla'!IR82=0,\"\",'[1]Tasa de Falla'!IR82)","v":""},{"$f":"IF('[1]Tasa de Falla'!IS82=0,\"\",'[1]Tasa de Falla'!IS82)","v":1},{"$f":"IF('[1]Tasa de Falla'!IT82=0,\"\",'[1]Tasa de Falla'!IT82)","v":""},{"$f":"IF('[1]Tasa de Falla'!IU82=0,\"\",'[1]Tasa de Falla'!IU82)","v":""},{"$f":"IF('[1]Tasa de Falla'!IV82=0,\"\",'[1]Tasa de Falla'!IV82)","v":""}]
[null,null,{"$f":"'[1]Tasa de Falla'!C83","v":65},{"$f":"'[1]Tasa de Falla'!D83","v":"BURRUYACU - CEVIL POZO"},{"$f":"'[1]Tasa de Falla'!E83","v":132},{"$f":"'[1]Tasa de Falla'!F83","v":56},{"$f":"IF('[1]Tasa de Falla'!IK83=0,\"\",'[1]Tasa de Falla'!IK83)","v":""},{"$f":"IF('[1]Tasa de Falla'!IL83=0,\"\",'[1]Tasa de Falla'!IL83)","v":""},{"$f":"IF('[1]Tasa de Falla'!IM83=0,\"\",'[1]Tasa de Falla'!IM83)","v":""},{"$f":"IF('[1]Tasa de Falla'!IN83=0,\"\",'[1]Tasa de Falla'!IN83)","v":""},{"$f":"IF('[1]Tasa de Falla'!IO83=0,\"\",'[1]Tasa de Falla'!IO83)","v":""},{"$f":"IF('[1]Tasa de Falla'!IP83=0,\"\",'[1]Tasa de Falla'!IP83)","v":""},{"$f":"IF('[1]Tasa de Falla'!IQ83=0,\"\",'[1]Tasa de Falla'!IQ83)","v":""},{"$f":"IF('[1]Tasa de Falla'!IR83=0,\"\",'[1]Tasa de Falla'!IR83)","v":1},{"$f":"IF('[1]Tasa de Falla'!IS83=0,\"\",'[1]Tasa de Falla'!IS83)","v":""},{"$f":"IF('[1]Tasa de Falla'!IT83=0,\"\",'[1]Tasa de Falla'!IT83)","v":""},{"$f":"IF('[1]Tasa de Falla'!IU83=0,\"\",'[1]Tasa de Falla'!IU83)","v":1},{"$f":"IF('[1]Tasa de Falla'!IV83=0,\"\",'[1]Tasa de Falla'!IV83)","v":1}]
[null,null,{"$f":"'[1]Tasa de Falla'!C84","v":66},{"$f":"'[1]Tasa de Falla'!D84","v":"GÜEMES - BURRUYACU"},{"$f":"'[1]Tasa de Falla'!E84","v":132},{"$f":"'[1]Tasa de Falla'!F84","v":235.1},{"$f":"IF('[1]Tasa de Falla'!IK84=0,\"\",'[1]Tasa de Falla'!IK84)","v":"XXXX"},{"$f":"IF('[1]Tasa de Falla'!IL84=0,\"\",'[1]Tasa de Falla'!IL84)","v":"XXXX"},{"$f":"IF('[1]Tasa de Falla'!IM84=0,\"\",'[1]Tasa de Falla'!IM84)","v":"XXXX"},{"$f":"IF('[1]Tasa de Falla'!IN84=0,\"\",'[1]Tasa de Falla'!IN84)","v":"XXXX"},{"$f":"IF('[1]Tasa de Falla'!IO84=0,\"\",'[1]Tasa de Falla'!IO84)","v":"XXXX"},{"$f":"IF('[1]Tasa de Falla'!IP84=0,\"\",'[1]Tasa de Falla'!IP84)","v":"XXXX"},{"$f":"IF('[1]Tasa de Falla'!IQ84=0,\"\",'[1]Tasa de Falla'!IQ84)","v":"XXXX"},{"$f":"IF('[1]Tasa de Falla'!IR84=0,\"\",'[1]Tasa de Falla'!IR84)","v":"XXXX"},{"$f":"IF('[1]Tasa de Falla'!IS84=0,\"\",'[1]Tasa de Falla'!IS84)","v":"XXXX"},{"$f":"IF('[1]Tasa de Falla'!IT84=0,\"\",'[1]Tasa de Falla'!IT84)","v":"XXXX"},{"$f":"IF('[1]Tasa de Falla'!IU84=0,\"\",'[1]Tasa de Falla'!IU84)","v":"XXXX"},{"$f":"IF('[1]Tasa de Falla'!IV84=0,\"\",'[1]Tasa de Falla'!IV84)","v":"XXXX"}]
[null,null,{"$f":"'[1]Tasa de Falla'!C85","v":67},{"$f":"'[1]Tasa de Falla'!D85","v":"FRIAS - RECREO"},{"$f":"'[1]Tasa de Falla'!E85","v":132},{"$f":"'[1]Tasa de Falla'!F85","v":74.540000000000006},{"$f":"IF('[1]Tasa de Falla'!IK85=0,\"\",'[1]Tasa de Falla'!IK85)","v":""},{"$f":"IF('[1]Tasa de Falla'!IL85=0,\"\",'[1]Tasa de Falla'!IL85)","v":""},{"$f":"IF('[1]Tasa de Falla'!IM85=0,\"\",'[1]Tasa de Falla'!IM85)","v":""},{"$f":"IF('[1]Tasa de Falla'!IN85=0,\"\",'[1]Tasa de Falla'!IN85)","v":""},{"$f":"IF('[1]Tasa de Falla'!IO85=0,\"\",'[1]Tasa de Falla'!IO85)","v":""},{"$f":"IF('[1]Tasa de Falla'!IP85=0,\"\",'[1]Tasa de Falla'!IP85)","v":""},{"$f":"IF('[1]Tasa de Falla'!IQ85=0,\"\",'[1]Tasa de Falla'!IQ85)","v":""},{"$f":"IF('[1]Tasa de Falla'!IR85=0,\"\",'[1]Tasa de Falla'!IR85)","v":""},{"$f":"IF('[1]Tasa de Falla'!IS85=0,\"\",'[1]Tasa de Falla'!IS85)","v":""},{"$f":"IF('[1]Tasa de Falla'!IT85=0,\"\",'[1]Tasa de Falla'!IT85)","v":""},{"$f":"IF('[1]Tasa de Falla'!IU85=0,\"\",'[1]Tasa de Falla'!IU85)","v":""},{"$f":"IF('[1]Tasa de Falla'!IV85=0,\"\",'[1]Tasa de Falla'!IV85)","v":""}]
[null,null,{"$f":"'[1]Tasa de Falla'!C86","v":68},{"$f":"'[1]Tasa de Falla'!D86","v":"RECREO - LA RIOJA 1"},{"$f":"'[1]Tasa de Falla'!E86","v":132},{"$f":"'[1]Tasa de Falla'!F86","v":221},{"$f":"IF('[1]Tasa de Falla'!IK86=0,\"\",'[1]Tasa de Falla'!IK86)","v":""},{"$f":"IF('[1]Tasa de Falla'!IL86=0,\"\",'[1]Tasa de Falla'!IL86)","v":""},{"$f":"IF('[1]Tasa de Falla'!IM86=0,\"\",'[1]Tasa de Falla'!IM86)","v":""},{"$f":"IF('[1]Tasa de Falla'!IN86=0,\"\",'[1]Tasa de Falla'!IN86)","v":""},{"$f":"IF('[1]Tasa de Falla'!IO86=0,\"\",'[1]Tasa de Falla'!IO86)","v":""},{"$f":"IF('[1]Tasa de Falla'!IP86=0,\"\",'[1]Tasa de Falla'!IP86)","v":""},{"$f":"IF('[1]Tasa de Falla'!IQ86=0,\"\",'[1]Tasa de Falla'!IQ86)","v":""},{"$f":"IF('[1]Tasa de Falla'!IR86=0,\"\",'[1]Tasa de Falla'!IR86)","v":""},{"$f":"IF('[1]Tasa de Falla'!IS86=0,\"\",'[1]Tasa de Falla'!IS86)","v":""},{"$f":"IF('[1]Tasa de Falla'!IT86=0,\"\",'[1]Tasa de Falla'!IT86)","v":1},{"$f":"IF('[1]Tasa de Falla'!IU86=0,\"\",'[1]Tasa de Falla'!IU86)","v":1},{"$f":"IF('[1]Tasa de Falla'!IV86=0,\"\",'[1]Tasa de Falla'!IV86)","v":""}]
[null,null,{"$f":"'[1]Tasa de Falla'!C87","v":69},{"$f":"'[1]Tasa de Falla'!D87","v":"RECREO - LA RIOJA 2"},{"$f":"'[1]Tasa de Falla'!E87","v":132},{"$f":"'[1]Tasa de Falla'!F87","v":220},{"$f":"IF('[1]Tasa de Falla'!IK87=0,\"\",'[1]Tasa de Falla'!IK87)","v":""},{"$f":"IF('[1]Tasa de Falla'!IL87=0,\"\",'[1]Tasa de Falla'!IL87)","v":""},{"$f":"IF('[1]Tasa de Falla'!IM87=0,\"\",'[1]Tasa de Falla'!IM87)","v":1},{"$f":"IF('[1]Tasa de Falla'!IN87=0,\"\",'[1]Tasa de Falla'!IN87)","v":""},{"$f":"IF('[1]Tasa de Falla'!IO87=0,\"\",'[1]Tasa de Falla'!IO87)","v":""},{"$f":"IF('[1]Tasa de Falla'!IP87=0,\"\",'[1]Tasa de Falla'!IP87)","v":""},{"$f":"IF('[1]Tasa de Falla'!IQ87=0,\"\",'[1]Tasa de Falla'!IQ87)","v":""},{"$f":"IF('[1]Tasa de Falla'!IR87=0,\"\",'[1]Tasa de Falla'!IR87)","v":""},{"$f":"IF('[1]Tasa de Falla'!IS87=0,\"\",'[1]Tasa de Falla'!IS87)","v":1},{"$f":"IF('[1]Tasa de Falla'!IT87=0,\"\",'[1]Tasa de Falla'!IT87)","v":""},{"$f":"IF('[1]Tasa de Falla'!IU87=0,\"\",'[1]Tasa de Falla'!IU87)","v":1},{"$f":"IF('[1]Tasa de Falla'!IV87=0,\"\",'[1]Tasa de Falla'!IV87)","v":""}]
[null,null,{"$f":"'[1]Tasa de Falla'!C88","v":70},{"$f":"'[1]Tasa de Falla'!D88","v":"RECREO - CATAMARCA"},{"$f":"'[1]Tasa de Falla'!E88","v":132},{"$f":"'[1]Tasa de Falla'!F88","v":203},{"$f":"IF('[1]Tasa de Falla'!IK88=0,\"\",'[1]Tasa de Falla'!IK88)","v":""},{"$f":"IF('[1]Tasa de Falla'!IL88=0,\"\",'[1]Tasa de Falla'!IL88)","v":""},{"$f":"IF('[1]Tasa de Falla'!IM88=0,\"\",'[1]Tasa de Falla'!IM88)","v":1},{"$f":"IF('[1]Tasa de Falla'!IN88=0,\"\",'[1]Tasa de Falla'!IN88)","v":""},{"$f":"IF('[1]Tasa de Falla'!IO88=0,\"\",'[1]Tasa de Falla'!IO88)","v":1},{"$f":"IF('[1]Tasa de Falla'!IP88=0,\"\",'[1]Tasa de Falla'!IP88)","v":""},{"$f":"IF('[1]Tasa de Falla'!IQ88=0,\"\",'[1]Tasa de Falla'!IQ88)","v":""},{"$f":"IF('[1]Tasa de Falla'!IR88=0,\"\",'[1]Tasa de Falla'!IR88)","v":""},{"$f":"IF('[1]Tasa de Falla'!IS88=0,\"\",'[1]Tasa de Falla'!IS88)","v":""},{"$f":"IF('[1]Tasa de Falla'!IT88=0,\"\",'[1]Tasa de Falla'!IT88)","v":2},{"$f":"IF('[1]Tasa de Falla'!IU88=0,\"\",'[1]Tasa de Falla'!IU88)","v":""},{"$f":"IF('[1]Tasa de Falla'!IV88=0,\"\",'[1]Tasa de Falla'!IV88)","v":""}]
[null,null,{"$f":"'[1]Tasa de Falla'!C89","v":71},{"$f":"'[1]Tasa de Falla'!D89","v":"CABRA CORRAL - EL CARRIL"},{"$f":"'[1]Tasa de Falla'!E89","v":132},{"$f":"'[1]Tasa de Falla'!F89","v":33.75},{"$f":"IF('[1]Tasa de Falla'!IK89=0,\"\",'[1]Tasa de Falla'!IK89)","v":1},{"$f":"IF('[1]Tasa de Falla'!IL89=0,\"\",'[1]Tasa de Falla'!IL89)","v":""},{"$f":"IF('[1]Tasa de Falla'!IM89=0,\"\",'[1]Tasa de Falla'!IM89)","v":2},{"$f":"IF('[1]Tasa de Falla'!IN89=0,\"\",'[1]Tasa de Falla'!IN89)","v":""},{"$f":"IF('[1]Tasa de Falla'!IO89=0,\"\",'[1]Tasa de Falla'!IO89)","v":""},{"$f":"IF('[1]Tasa de Falla'!IP89=0,\"\",'[1]Tasa de Falla'!IP89)","v":""},{"$f":"IF('[1]Tasa de Falla'!IQ89=0,\"\",'[1]Tasa de Falla'!IQ89)","v":""},{"$f":"IF('[1]Tasa de Falla'!IR89=0,\"\",'[1]Tasa de Falla'!IR89)","v":1},{"$f":"IF('[1]Tasa de Falla'!IS89=0,\"\",'[1]Tasa de Falla'!IS89)","v":""},{"$f":"IF('[1]Tasa de Falla'!IT89=0,\"\",'[1]Tasa de Falla'!IT89)","v":""},{"$f":"IF('[1]Tasa de Falla'!IU89=0,\"\",'[1]Tasa de Falla'!IU89)","v":""},{"$f":"IF('[1]Tasa de Falla'!IV89=0,\"\",'[1]Tasa de Falla'!IV89)","v":""}]
[null,null,{"$f":"'[1]Tasa de Falla'!C90","v":72},{"$f":"'[1]Tasa de Falla'!D90","v":"PAMPA GRANDE - CABRA CORRAL"},{"$f":"'[1]Tasa de Falla'!E90","v":132},{"$f":"'[1]Tasa de Falla'!F90","v":60},{"$f":"IF('[1]Tasa de Falla'!IK90=0,\"\",'[1]Tasa de Falla'!IK90)","v":1},{"$f":"IF('[1]Tasa de Falla'!IL90=0,\"\",'[1]Tasa de Falla'!IL90)","v":""},{"$f":"IF('[1]Tasa de Falla'!IM90=0,\"\",'[1]Tasa de Falla'!IM90)","v":3},{"$f":"IF('[1]Tasa de Falla'!IN90=0,\"\",'[1]Tasa de Falla'!IN90)","v":1},{"$f":"IF('[1]Tasa de Falla'!IO90=0,\"\",'[1]Tasa de Falla'!IO90)","v":1},{"$f":"IF('[1]Tasa de Falla'!IP90=0,\"\",'[1]Tasa de Falla'!IP90)","v":""},{"$f":"IF('[1]Tasa de Falla'!IQ90=0,\"\",'[1]Tasa de Falla'!IQ90)","v":""},{"$f":"IF('[1]Tasa de Falla'!IR90=0,\"\",'[1]Tasa de Falla'!IR90)","v":""},{"$f":"IF('[1]Tasa de Falla'!IS90=0,\"\",'[1]Tasa de Falla'!IS90)","v":""},{"$f":"IF('[1]Tasa de Falla'!IT90=0,\"\",'[1]Tasa de Falla'!IT90)","v":""},{"$f":"IF('[1]Tasa de Falla'!IU90=0,\"\",'[1]Tasa de Falla'!IU90)","v":1},{"$f":"IF('[1]Tasa de Falla'!IV90=0,\"\",'[1]Tasa de Falla'!IV90)","v":1}]
[null,null,{"$f":"'[1]Tasa de Falla'!C91","v":73},{"$f":"'[1]Tasa de Falla'!D91","v":"PAMPA GRANDE - CAFAYATE"},{"$f":"'[1]Tasa de Falla'!E91","v":132},{"$f":"'[1]Tasa de Falla'!F91","v":63},{"$f":"IF('[1]Tasa de Falla'!IK91=0,\"\",'[1]Tasa de Falla'!IK91)","v":""},{"$f":"IF('[1]Tasa de Falla'!IL91=0,\"\",'[1]Tasa de Falla'!IL91)","v":""},{"$f":"IF('[1]Tasa de Falla'!IM91=0,\"\",'[1]Tasa de Falla'!IM91)","v":""},{"$f":"IF('[1]Tasa de Falla'!IN91=0,\"\",'[1]Tasa de Falla'!IN91)","v":""},{"$f":"IF('[1]Tasa de Falla'!IO91=0,\"\",'[1]Tasa de Falla'!IO91)","v":1},{"$f":"IF('[1]Tasa de Falla'!IP91=0,\"\",'[1]Tasa de Falla'!IP91)","v":""},{"$f":"IF('[1]Tasa de Falla'!IQ91=0,\"\",'[1]Tasa de Falla'!IQ91)","v":""},{"$f":"IF('[1]Tasa de Falla'!IR91=0,\"\",'[1]Tasa de Falla'!IR91)","v":""},{"$f":"IF('[1]Tasa de Falla'!IS91=0,\"\",'[1]Tasa de Falla'!IS91)","v":""},{"$f":"IF('[1]Tasa de Falla'!IT91=0,\"\",'[1]Tasa de Falla'!IT91)","v":""},{"$f":"IF('[1]Tasa de Falla'!IU91=0,\"\",'[1]Tasa de Falla'!IU91)","v":""},{"$f":"IF('[1]Tasa de Falla'!IV91=0,\"\",'[1]Tasa de Falla'!IV91)","v":""}]
[null,null,{"$f":"'[1]Tasa de Falla'!C92","v":74},{"$f":"'[1]Tasa de Falla'!D92","v":"PAMPA GRANDE - TRANCAS"},{"$f":"'[1]Tasa de Falla'!E92","v":132},{"$f":"'[1]Tasa de Falla'!F92","v":55},{"$f":"IF('[1]Tasa de Falla'!IK92=0,\"\",'[1]Tasa de Falla'!IK92)","v":""},{"$f":"IF('[1]Tasa de Falla'!IL92=0,\"\",'[1]Tasa de Falla'!IL92)","v":""},{"$f":"IF('[1]Tasa de Falla'!IM92=0,\"\",'[1]Tasa de Falla'!IM92)","v":3},{"$f":"IF('[1]Tasa de Falla'!IN92=0,\"\",'[1]Tasa de Falla'!IN92)","v":""},{"$f":"IF('[1]Tasa de Falla'!IO92=0,\"\",'[1]Tasa de Falla'!IO92)","v":""},{"$f":"IF('[1]Tasa de Falla'!IP92=0,\"\",'[1]Tasa de Falla'!IP92)","v":""},{"$f":"IF('[1]Tasa de Falla'!IQ92=0,\"\",'[1]Tasa de Falla'!IQ92)","v":""},{"$f":"IF('[1]Tasa de Falla'!IR92=0,\"\",'[1]Tasa de Falla'!IR92)","v":""},{"$f":"IF('[1]Tasa de Falla'!IS92=0,\"\",'[1]Tasa de Falla'!IS92)","v":""},{"$f":"IF('[1]Tasa de Falla'!IT92=0,\"\",'[1]Tasa de Falla'!IT92)","v":""},{"$f":"IF('[1]Tasa de Falla'!IU92=0,\"\",'[1]Tasa de Falla'!IU92)","v":""},{"$f":"IF('[1]Tasa de Falla'!IV92=0,\"\",'[1]Tasa de Falla'!IV92)","v":""}]
[null,null,{"$f":"'[1]Tasa de Falla'!C93","v":75},{"$f":"'[1]Tasa de Falla'!D93","v":"SANTIAGO CENTRO - FERNANDEZ - SUNCHO CORRAL "},{"$f":"'[1]Tasa de Falla'!E93","v":132},{"$f":"'[1]Tasa de Falla'!F93","v":103},{"$f":"IF('[1]Tasa de Falla'!IK93=0,\"\",'[1]Tasa de Falla'!IK93)","v":""},{"$f":"IF('[1]Tasa de Falla'!IL93=0,\"\",'[1]Tasa de Falla'!IL93)","v":2},{"$f":"IF('[1]Tasa de Falla'!IM93=0,\"\",'[1]Tasa de Falla'!IM93)","v":""},{"$f":"IF('[1]Tasa de Falla'!IN93=0,\"\",'[1]Tasa de Falla'!IN93)","v":""},{"$f":"IF('[1]Tasa de Falla'!IO93=0,\"\",'[1]Tasa de Falla'!IO93)","v":""},{"$f":"IF('[1]Tasa de Falla'!IP93=0,\"\",'[1]Tasa de Falla'!IP93)","v":""},{"$f":"IF('[1]Tasa de Falla'!IQ93=0,\"\",'[1]Tasa de Falla'!IQ93)","v":""},{"$f":"IF('[1]Tasa de Falla'!IR93=0,\"\",'[1]Tasa de Falla'!IR93)","v":""},{"$f":"IF('[1]Tasa de Falla'!IS93=0,\"\",'[1]Tasa de Falla'!IS93)","v":""},{"$f":"IF('[1]Tasa de Falla'!IT93=0,\"\",'[1]Tasa de Falla'!IT93)","v":""},{"$f":"IF('[1]Tasa de Falla'!IU93=0,\"\",'[1]Tasa de Falla'!IU93)","v":""},{"$f":"IF('[1]Tasa de Falla'!IV93=0,\"\",'[1]Tasa de Falla'!IV93)","v":""}]
[null,null,{"$f":"'[1]Tasa de Falla'!C94","v":76},{"$f":"'[1]Tasa de Falla'!D94","v":"SUNCHO CORRAL - ANATUYA"},{"$f":"'[1]Tasa de Falla'!E94","v":132},{"$f":"'[1]Tasa de Falla'!F94","v":81},{"$f":"IF('[1]Tasa de Falla'!IK94=0,\"\",'[1]Tasa de Falla'!IK94)","v":""},{"$f":"IF('[1]Tasa de Falla'!IL94=0,\"\",'[1]Tasa de Falla'!IL94)","v":""},{"$f":"IF('[1]Tasa de Falla'!IM94=0,\"\",'[1]Tasa de Falla'!IM94)","v":""},{"$f":"IF('[1]Tasa de Falla'!IN94=0,\"\",'[1]Tasa de Falla'!IN94)","v":""},{"$f":"IF('[1]Tasa de Falla'!IO94=0,\"\",'[1]Tasa de Falla'!IO94)","v":""},{"$f":"IF('[1]Tasa de Falla'!IP94=0,\"\",'[1]Tasa de Falla'!IP94)","v":""},{"$f":"IF('[1]Tasa de Falla'!IQ94=0,\"\",'[1]Tasa de Falla'!IQ94)","v":""},{"$f":"IF('[1]Tasa de Falla'!IR94=0,\"\",'[1]Tasa de Falla'!IR94)","v":2},{"$f":"IF('[1]Tasa de Falla'!IS94=0,\"\",'[1]Tasa de Falla'!IS94)","v":1},{"$f":"IF('[1]Tasa de Falla'!IT94=0,\"\",'[1]Tasa de Falla'!IT94)","v":""},{"$f":"IF('[1]Tasa de Falla'!IU94=0,\"\",'[1]Tasa de Falla'!IU94)","v":""},{"$f":"IF('[1]Tasa de Falla'!IV94=0,\"\",'[1]Tasa de Falla'!IV94)","v":""}]
[null,null,{"$f":"'[1]Tasa de Falla'!C95","v":77},{"$f":"'[1]Tasa de Falla'!D95","v":"LAS MADERAS - GÜEMES SALTA"},{"$f":"'[1]Tasa de Falla'!E95","v":132},{"$f":"'[1]Tasa de Falla'!F95","v":42},{"$f":"IF('[1]Tasa de Falla'!IK95=0,\"\",'[1]Tasa de Falla'!IK95)","v":1},{"$f":"IF('[1]Tasa de Falla'!IL95=0,\"\",'[1]Tasa de Falla'!IL95)","v":""},{"$f":"IF('[1]Tasa de Falla'!IM95=0,\"\",'[1]Tasa de Falla'!IM95)","v":""},{"$f":"IF('[1]Tasa de Falla'!IN95=0,\"\",'[1]Tasa de Falla'!IN95)","v":""},{"$f":"IF('[1]Tasa de Falla'!IO95=0,\"\",'[1]Tasa de Falla'!IO95)","v":""},{"$f":"IF('[1]Tasa de Falla'!IP95=0,\"\",'[1]Tasa de Falla'!IP95)","v":""},{"$f":"IF('[1]Tasa de Falla'!IQ95=0,\"\",'[1]Tasa de Falla'!IQ95)","v":""},{"$f":"IF('[1]Tasa de Falla'!IR95=0,\"\",'[1]Tasa de Falla'!IR95)","v":1},{"$f":"IF('[1]Tasa de Falla'!IS95=0,\"\",'[1]Tasa de Falla'!IS95)","v":""},{"$f":"IF('[1]Tasa de Falla'!IT95=0,\"\",'[1]Tasa de Falla'!IT95)","v":""},{"$f":"IF('[1]Tasa de Falla'!IU95=0,\"\",'[1]Tasa de Falla'!IU95)","v":""},{"$f":"IF('[1]Tasa de Falla'!IV95=0,\"\",'[1]Tasa de Falla'!IV95)","v":""}]
[null,null,{"$f":"'[1]Tasa de Falla'!C96","v":78},{"$f":"'[1]Tasa de Falla'!D96","v":"INDEPENDENCIA - EL BRACHO 2"},{"$f":"'[1]Tasa de Falla'!E96","v":132},{"$f":"'[1]Tasa de Falla'!F96","v":17.100000000000001},{"$f":"IF('[1]Tasa de Falla'!IK96=0,\"\",'[1]Tasa de Falla'!IK96)","v":""},{"$f":"IF('[1]Tasa de Falla'!IL96=0,\"\",'[1]Tasa de Falla'!IL96)","v":""},{"$f":"IF('[1]Tasa de Falla'!IM96=0,\"\",'[1]Tasa de Falla'!IM96)","v":""},{"$f":"IF('[1]Tasa de Falla'!IN96=0,\"\",'[1]Tasa de Falla'!IN96)","v":""},{"$f":"IF('[1]Tasa de Falla'!IO96=0,\"\",'[1]Tasa de Falla'!IO96)","v":""},{"$f":"IF('[1]Tasa de Falla'!IP96=0,\"\",'[1]Tasa de Falla'!IP96)","v":""},{"$f":"IF('[1]Tasa de Falla'!IQ96=0,\"\",'[1]Tasa de Falla'!IQ96)","v":""},{"$f":"IF('[1]Tasa de Falla'!IR96=0,\"\",'[1]Tasa de Falla'!IR96)","v":""},{"$f":"IF('[1]Tasa de Falla'!IS96=0,\"\",'[1]Tasa de Falla'!IS96)","v":""},{"$f":"IF('[1]Tasa de Falla'!IT96=0,\"\",'[1]Tasa de Falla'!IT96)","v":""},{"$f":"IF('[1]Tasa de Falla'!IU96=0,\"\",'[1]Tasa de Falla'!IU96)","v":""},{"$f":"IF('[1]Tasa de Falla'!IV96=0,\"\",'[1]Tasa de Falla'!IV96)","v":1}]
[null,null,{"$f":"'[1]Tasa de Falla'!C97","v":79},{"$f":"'[1]Tasa de Falla'!D97","v":"GÜEMES - SALTA NORTE"},{"$f":"'[1]Tasa de Falla'!E97","v":132},{"$f":"'[1]Tasa de Falla'!F97","v":39},{"$f":"IF('[1]Tasa de Falla'!IK97=0,\"\",'[1]Tasa de Falla'!IK97)","v":"XXXX"},{"$f":"IF('[1]Tasa de Falla'!IL97=0,\"\",'[1]Tasa de Falla'!IL97)","v":"XXXX"},{"$f":"IF('[1]Tasa de Falla'!IM97=0,\"\",'[1]Tasa de Falla'!IM97)","v":"XXXX"},{"$f":"IF('[1]Tasa de Falla'!IN97=0,\"\",'[1]Tasa de Falla'!IN97)","v":"XXXX"},{"$f":"IF('[1]Tasa de Falla'!IO97=0,\"\",'[1]Tasa de Falla'!IO97)","v":"XXXX"},{"$f":"IF('[1]Tasa de Falla'!IP97=0,\"\",'[1]Tasa de Falla'!IP97)","v":"XXXX"},{"$f":"IF('[1]Tasa de Falla'!IQ97=0,\"\",'[1]Tasa de Falla'!IQ97)","v":"XXXX"},{"$f":"IF('[1]Tasa de Falla'!IR97=0,\"\",'[1]Tasa de Falla'!IR97)","v":"XXXX"},{"$f":"IF('[1]Tasa de Falla'!IS97=0,\"\",'[1]Tasa de Falla'!IS97)","v":"XXXX"},{"$f":"IF('[1]Tasa de Falla'!IT97=0,\"\",'[1]Tasa de Falla'!IT97)","v":"XXXX"},{"$f":"IF('[1]Tasa de Falla'!IU97=0,\"\",'[1]Tasa de Falla'!IU97)","v":"XXXX"},{"$f":"IF('[1]Tasa de Falla'!IV97=0,\"\",'[1]Tasa de Falla'!IV97)","v":"XXXX"}]
[null,null,{"$f":"'[1]Tasa de Falla'!C98","v":80},{"$f":"'[1]Tasa de Falla'!D98","v":"BURRUYACU - COBOS"},{"$f":"'[1]Tasa de Falla'!E98","v":132},{"$f":"'[1]Tasa de Falla'!F98","v":229.5},{"$f":"IF('[1]Tasa de Falla'!IK98=0,\"\",'[1]Tasa de Falla'!IK98)","v":"XXXX"},{"$f":"IF('[1]Tasa de Falla'!IL98=0,\"\",'[1]Tasa de Falla'!IL98)","v":"XXXX"},{"$f":"IF('[1]Tasa de Falla'!IM98=0,\"\",'[1]Tasa de Falla'!IM98)","v":"XXXX"},{"$f":"IF('[1]Tasa de Falla'!IN98=0,\"\",'[1]Tasa de Falla'!IN98)","v":"XXXX"},{"$f":"IF('[1]Tasa de Falla'!IO98=0,\"\",'[1]Tasa de Falla'!IO98)","v":"XXXX"},{"$f":"IF('[1]Tasa de Falla'!IP98=0,\"\",'[1]Tasa de Falla'!IP98)","v":"XXXX"},{"$f":"IF('[1]Tasa de Falla'!IQ98=0,\"\",'[1]Tasa de Falla'!IQ98)","v":"XXXX"},{"$f":"IF('[1]Tasa de Falla'!IR98=0,\"\",'[1]Tasa de Falla'!IR98)","v":"XXXX"},{"$f":"IF('[1]Tasa de Falla'!IS98=0,\"\",'[1]Tasa de Falla'!IS98)","v":"XXXX"},{"$f":"IF('[1]Tasa de Falla'!IT98=0,\"\",'[1]Tasa de Falla'!IT98)","v":"XXXX"},{"$f":"IF('[1]Tasa de Falla'!IU98=0,\"\",'[1]Tasa de Falla'!IU98)","v":"XXXX"},{"$f":"IF('[1]Tasa de Falla'!IV98=0,\"\",'[1]Tasa de Falla'!IV98)","v":"XXXX"}]
[null,null,{"$f":"'[1]Tasa de Falla'!C99","v":81},{"$f":"'[1]Tasa de Falla'!D99","v":"METAN - COBOS"},{"$f":"'[1]Tasa de Falla'!E99","v":132},{"$f":"'[1]Tasa de Falla'!F99","v":89.2},{"$f":"IF('[1]Tasa de Falla'!IK99=0,\"\",'[1]Tasa de Falla'!IK99)","v":""},{"$f":"IF('[1]Tasa de Falla'!IL99=0,\"\",'[1]Tasa de Falla'!IL99)","v":""},{"$f":"IF('[1]Tasa de Falla'!IM99=0,\"\",'[1]Tasa de Falla'!IM99)","v":""},{"$f":"IF('[1]Tasa de Falla'!IN99=0,\"\",'[1]Tasa de Falla'!IN99)","v":""},{"$f":"IF('[1]Tasa de Falla'!IO99=0,\"\",'[1]Tasa de Falla'!IO99)","v":""},{"$f":"IF('[1]Tasa de Falla'!IP99=0,\"\",'[1]Tasa de Falla'!IP99)","v":""},{"$f":"IF('[1]Tasa de Falla'!IQ99=0,\"\",'[1]Tasa de Falla'!IQ99)","v":""},{"$f":"IF('[1]Tasa de Falla'!IR99=0,\"\",'[1]Tasa de Falla'!IR99)","v":""},{"$f":"IF('[1]Tasa de Falla'!IS99=0,\"\",'[1]Tasa de Falla'!IS99)","v":""},{"$f":"IF('[1]Tasa de Falla'!IT99=0,\"\",'[1]Tasa de Falla'!IT99)","v":""},{"$f":"IF('[1]Tasa de Falla'!IU99=0,\"\",'[1]Tasa de Falla'!IU99)","v":""},{"$f":"IF('[1]Tasa de Falla'!IV99=0,\"\",'[1]Tasa de Falla'!IV99)","v":""}]
[null,null,{"$f":"'[1]Tasa de Falla'!C100","v":82},{"$f":"'[1]Tasa de Falla'!D100","v":"AÑATUYA - BANDERA"},{"$f":"'[1]Tasa de Falla'!E100","v":132},{"$f":"'[1]Tasa de Falla'!F100","v":76},{"$f":"IF('[1]Tasa de Falla'!IK100=0,\"\",'[1]Tasa de Falla'!IK100)","v":""},{"$f":"IF('[1]Tasa de Falla'!IL100=0,\"\",'[1]Tasa de Falla'!IL100)","v":""},{"$f":"IF('[1]Tasa de Falla'!IM100=0,\"\",'[1]Tasa de Falla'!IM100)","v":""},{"$f":"IF('[1]Tasa de Falla'!IN100=0,\"\",'[1]Tasa de Falla'!IN100)","v":""},{"$f":"IF('[1]Tasa de Falla'!IO100=0,\"\",'[1]Tasa de Falla'!IO100)","v":""},{"$f":"IF('[1]Tasa de Falla'!IP100=0,\"\",'[1]Tasa de Falla'!IP100)","v":""},{"$f":"IF('[1]Tasa de Falla'!IQ100=0,\"\",'[1]Tasa de Falla'!IQ100)","v":""},{"$f":"IF('[1]Tasa de Falla'!IR100=0,\"\",'[1]Tasa de Falla'!IR100)","v":""},{"$f":"IF('[1]Tasa de Falla'!IS100=0,\"\",'[1]Tasa de Falla'!IS100)","v":2},{"$f":"IF('[1]Tasa de Falla'!IT100=0,\"\",'[1]Tasa de Falla'!IT100)","v":""},{"$f":"IF('[1]Tasa de Falla'!IU100=0,\"\",'[1]Tasa de Falla'!IU100)","v":""},{"$f":"IF('[1]Tasa de Falla'!IV100=0,\"\",'[1]Tasa de Falla'!IV100)","v":1}]
[null,null,{"$f":"'[1]Tasa de Falla'!C101","v":84},{"$f":"'[1]Tasa de Falla'!D101","v":"GÜEMES SALTA - COBOS 1"},{"$f":"'[1]Tasa de Falla'!E101","v":132},{"$f":"'[1]Tasa de Falla'!F101","v":12.1},{"$f":"IF('[1]Tasa de Falla'!IK101=0,\"\",'[1]Tasa de Falla'!IK101)","v":""},{"$f":"IF('[1]Tasa de Falla'!IL101=0,\"\",'[1]Tasa de Falla'!IL101)","v":""},{"$f":"IF('[1]Tasa de Falla'!IM101=0,\"\",'[1]Tasa de Falla'!IM101)","v":""},{"$f":"IF('[1]Tasa de Falla'!IN101=0,\"\",'[1]Tasa de Falla'!IN101)","v":""},{"$f":"IF('[1]Tasa de Falla'!IO101=0,\"\",'[1]Tasa de Falla'!IO101)","v":""},{"$f":"IF('[1]Tasa de Falla'!IP101=0,\"\",'[1]Tasa de Falla'!IP101)","v":""},{"$f":"IF('[1]Tasa de Falla'!IQ101=0,\"\",'[1]Tasa de Falla'!IQ101)","v":""},{"$f":"IF('[1]Tasa de Falla'!IR101=0,\"\",'[1]Tasa de Falla'!IR101)","v":""},{"$f":"IF('[1]Tasa de Falla'!IS101=0,\"\",'[1]Tasa de Falla'!IS101)","v":""},{"$f":"IF('[1]Tasa de Falla'!IT101=0,\"\",'[1]Tasa de Falla'!IT101)","v":""},{"$f":"IF('[1]Tasa de Falla'!IU101=0,\"\",'[1]Tasa de Falla'!IU101)","v":""},{"$f":"IF('[1]Tasa de Falla'!IV101=0,\"\",'[1]Tasa de Falla'!IV101)","v":""}]
[null,null,{"$f":"'[1]Tasa de Falla'!C102","v":85},{"$f":"'[1]Tasa de Falla'!D102","v":"GÜEMES SALTA - COBOS 2"},{"$f":"'[1]Tasa de Falla'!E102","v":132},{"$f":"'[1]Tasa de Falla'!F102","v":12.1},{"$f":"IF('[1]Tasa de Falla'!IK102=0,\"\",'[1]Tasa de Falla'!IK102)","v":""},{"$f":"IF('[1]Tasa de Falla'!IL102=0,\"\",'[1]Tasa de Falla'!IL102)","v":""},{"$f":"IF('[1]Tasa de Falla'!IM102=0,\"\",'[1]Tasa de Falla'!IM102)","v":""},{"$f":"IF('[1]Tasa de Falla'!IN102=0,\"\",'[1]Tasa de Falla'!IN102)","v":""},{"$f":"IF('[1]Tasa de Falla'!IO102=0,\"\",'[1]Tasa de Falla'!IO102)","v":""},{"$f":"IF('[1]Tasa de Falla'!IP102=0,\"\",'[1]Tasa de Falla'!IP102)","v":""},{"$f":"IF('[1]Tasa de Falla'!IQ102=0,\"\",'[1]Tasa de Falla'!IQ102)","v":""},{"$f":"IF('[1]Tasa de Falla'!IR102=0,\"\",'[1]Tasa de Falla'!IR102)","v":""},{"$f":"IF('[1]Tasa de Falla'!IS102=0,\"\",'[1]Tasa de Falla'!IS102)","v":""},{"$f":"IF('[1]Tasa de Falla'!IT102=0,\"\",'[1]Tasa de Falla'!IT102)","v":""},{"$f":"IF('[1]Tasa de Falla'!IU102=0,\"\",'[1]Tasa de Falla'!IU102)","v":""},{"$f":"IF('[1]Tasa de Falla'!IV102=0,\"\",'[1]Tasa de Falla'!IV102)","v":""}]
[null,null,{"$f":"'[1]Tasa de Falla'!C103","v":86},{"$f":"'[1]Tasa de Falla'!D103","v":"EL BRACHO - LA BANDA"},{"$f":"'[1]Tasa de Falla'!E103","v":132},{"$f":"'[1]Tasa de Falla'!F103","v":133.5},{"$f":"IF('[1]Tasa de Falla'!IK103=0,\"\",'[1]Tasa de Falla'!IK103)","v":"XXXX"},{"$f":"IF('[1]Tasa de Falla'!IL103=0,\"\",'[1]Tasa de Falla'!IL103)","v":"XXXX"},{"$f":"IF('[1]Tasa de Falla'!IM103=0,\"\",'[1]Tasa de Falla'!IM103)","v":"XXXX"},{"$f":"IF('[1]Tasa de Falla'!IN103=0,\"\",'[1]Tasa de Falla'!IN103)","v":"XXXX"},{"$f":"IF('[1]Tasa de Falla'!IO103=0,\"\",'[1]Tasa de Falla'!IO103)","v":"XXXX"},{"$f":"IF('[1]Tasa de Falla'!IP103=0,\"\",'[1]Tasa de Falla'!IP103)","v":"XXXX"},{"$f":"IF('[1]Tasa de Falla'!IQ103=0,\"\",'[1]Tasa de Falla'!IQ103)","v":"XXXX"},{"$f":"IF('[1]Tasa de Falla'!IR103=0,\"\",'[1]Tasa de Falla'!IR103)","v":"XXXX"},{"$f":"IF('[1]Tasa de Falla'!IS103=0,\"\",'[1]Tasa de Falla'!IS103)","v":"XXXX"},{"$f":"IF('[1]Tasa de Falla'!IT103=0,\"\",'[1]Tasa de Falla'!IT103)","v":"XXXX"},{"$f":"IF('[1]Tasa de Falla'!IU103=0,\"\",'[1]Tasa de Falla'!IU103)","v":"XXXX"},{"$f":"IF('[1]Tasa de Falla'!IV103=0,\"\",'[1]Tasa de Falla'!IV103)","v":"XXXX"}]
[null,null,{"$f":"'[1]Tasa de Falla'!C104","v":87},{"$f":"'[1]Tasa de Falla'!D104","v":"SANTIAGO OESTE - SANTIAGO SUR "},{"$f":"'[1]Tasa de Falla'!E104","v":132},{"$f":"'[1]Tasa de Falla'!F104","v":10.6},{"$f":"IF('[1]Tasa de Falla'!IK104=0,\"\",'[1]Tasa de Falla'!IK104)","v":""},{"$f":"IF('[1]Tasa de Falla'!IL104=0,\"\",'[1]Tasa de Falla'!IL104)","v":""},{"$f":"IF('[1]Tasa de Falla'!IM104=0,\"\",'[1]Tasa de Falla'!IM104)","v":""},{"$f":"IF('[1]Tasa de Falla'!IN104=0,\"\",'[1]Tasa de Falla'!IN104)","v":""},{"$f":"IF('[1]Tasa de Falla'!IO104=0,\"\",'[1]Tasa de Falla'!IO104)","v":""},{"$f":"IF('[1]Tasa de Falla'!IP104=0,\"\",'[1]Tasa de Falla'!IP104)","v":""},{"$f":"IF('[1]Tasa de Falla'!IQ104=0,\"\",'[1]Tasa de Falla'!IQ104)","v":""},{"$f":"IF('[1]Tasa de Falla'!IR104=0,\"\",'[1]Tasa de Falla'!IR104)","v":""},{"$f":"IF('[1]Tasa de Falla'!IS104=0,\"\",'[1]Tasa de Falla'!IS104)","v":1},{"$f":"IF('[1]Tasa de Falla'!IT104=0,\"\",'[1]Tasa de Falla'!IT104)","v":""},{"$f":"IF('[1]Tasa de Falla'!IU104=0,\"\",'[1]Tasa de Falla'!IU104)","v":""},{"$f":"IF('[1]Tasa de Falla'!IV104=0,\"\",'[1]Tasa de Falla'!IV104)","v":""}]
[null,null,{"$f":"'[1]Tasa de Falla'!C105","v":88},{"$f":"'[1]Tasa de Falla'!D105","v":"SANTIAGO SUR - SANTIAGO CENTRO"},{"$f":"'[1]Tasa de Falla'!E105","v":132},{"$f":"'[1]Tasa de Falla'!F105","v":4},{"$f":"IF('[1]Tasa de Falla'!IK105=0,\"\",'[1]Tasa de Falla'!IK105)","v":""},{"$f":"IF('[1]Tasa de Falla'!IL105=0,\"\",'[1]Tasa de Falla'!IL105)","v":""},{"$f":"IF('[1]Tasa de Falla'!IM105=0,\"\",'[1]Tasa de Falla'!IM105)","v":""},{"$f":"IF('[1]Tasa de Falla'!IN105=0,\"\",'[1]Tasa de Falla'!IN105)","v":""},{"$f":"IF('[1]Tasa de Falla'!IO105=0,\"\",'[1]Tasa de Falla'!IO105)","v":""},{"$f":"IF('[1]Tasa de Falla'!IP105=0,\"\",'[1]Tasa de Falla'!IP105)","v":""},{"$f":"IF('[1]Tasa de Falla'!IQ105=0,\"\",'[1]Tasa de Falla'!IQ105)","v":""},{"$f":"IF('[1]Tasa de Falla'!IR105=0,\"\",'[1]Tasa de Falla'!IR105)","v":""},{"$f":"IF('[1]Tasa de Falla'!IS105=0,\"\",'[1]Tasa de Falla'!IS105)","v":""},{"$f":"IF('[1]Tasa de Falla'!IT105=0,\"\",'[1]Tasa de Falla'!IT105)","v":""},{"$f":"IF('[1]Tasa de Falla'!IU105=0,\"\",'[1]Tasa de Falla'!IU105)","v":""},{"$f":"IF('[1]Tasa de Falla'!IV105=0,\"\",'[1]Tasa de Falla'!IV105)","v":""}]
[null,null,{"$f":"'[1]Tasa de Falla'!C106","v":89},{"$f":"'[1]Tasa de Falla'!D106","v":"C.H. RIO HONDO - SANTIAGO OESTE"},{"$f":"'[1]Tasa de Falla'!E106","v":132},{"$f":"'[1]Tasa de Falla'!F106","v":69.8},{"$f":"IF('[1]Tasa de Falla'!IK106=0,\"\",'[1]Tasa de Falla'!IK106)","v":""},{"$f":"IF('[1]Tasa de Falla'!IL106=0,\"\",'[1]Tasa de Falla'!IL106)","v":""},{"$f":"IF('[1]Tasa de Falla'!IM106=0,\"\",'[1]Tasa de Falla'!IM106)","v":""},{"$f":"IF('[1]Tasa de Falla'!IN106=0,\"\",'[1]Tasa de Falla'!IN106)","v":""},{"$f":"IF('[1]Tasa de Falla'!IO106=0,\"\",'[1]Tasa de Falla'!IO106)","v":""},{"$f":"IF('[1]Tasa de Falla'!IP106=0,\"\",'[1]Tasa de Falla'!IP106)","v":""},{"$f":"IF('[1]Tasa de Falla'!IQ106=0,\"\",'[1]Tasa de Falla'!IQ106)","v":""},{"$f":"IF('[1]Tasa de Falla'!IR106=0,\"\",'[1]Tasa de Falla'!IR106)","v":""},{"$f":"IF('[1]Tasa de Falla'!IS106=0,\"\",'[1]Tasa de Falla'!IS106)","v":1},{"$f":"IF('[1]Tasa de Falla'!IT106=0,\"\",'[1]Tasa de Falla'!IT106)","v":""},{"$f":"IF('[1]Tasa de Falla'!IU106=0,\"\",'[1]Tasa de Falla'!IU106)","v":""},{"$f":"IF('[1]Tasa de Falla'!IV106=0,\"\",'[1]Tasa de Falla'!IV106)","v":""}]
[null,null,{"$f":"'[1]Tasa de Falla'!C107","v":90},{"$f":"'[1]Tasa de Falla'!D107","v":"GÜEMES - MINETTI"},{"$f":"'[1]Tasa de Falla'!E107","v":132},{"$f":"'[1]Tasa de Falla'!F107","v":36.1},{"$f":"IF('[1]Tasa de Falla'!IK107=0,\"\",'[1]Tasa de Falla'!IK107)","v":1},{"$f":"IF('[1]Tasa de Falla'!IL107=0,\"\",'[1]Tasa de Falla'!IL107)","v":""},{"$f":"IF('[1]Tasa de Falla'!IM107=0,\"\",'[1]Tasa de Falla'!IM107)","v":""},{"$f":"IF('[1]Tasa de Falla'!IN107=0,\"\",'[1]Tasa de Falla'!IN107)","v":""},{"$f":"IF('[1]Tasa de Falla'!IO107=0,\"\",'[1]Tasa de Falla'!IO107)","v":""},{"$f":"IF('[1]Tasa de Falla'!IP107=0,\"\",'[1]Tasa de Falla'!IP107)","v":""},{"$f":"IF('[1]Tasa de Falla'!IQ107=0,\"\",'[1]Tasa de Falla'!IQ107)","v":""},{"$f":"IF('[1]Tasa de Falla'!IR107=0,\"\",'[1]Tasa de Falla'!IR107)","v":""},{"$f":"IF('[1]Tasa de Falla'!IS107=0,\"\",'[1]Tasa de Falla'!IS107)","v":""},{"$f":"IF('[1]Tasa de Falla'!IT107=0,\"\",'[1]Tasa de Falla'!IT107)","v":""},{"$f":"IF('[1]Tasa de Falla'!IU107=0,\"\",'[1]Tasa de Falla'!IU107)","v":""},{"$f":"IF('[1]Tasa de Falla'!IV107=0,\"\",'[1]Tasa de Falla'!IV107)","v":""}]
[null,null,{"$f":"'[1]Tasa de Falla'!C108","v":91},{"$f":"'[1]Tasa de Falla'!D108","v":"GÜEMES - SALTA NORTE"},{"$f":"'[1]Tasa de Falla'!E108","v":132},{"$f":"'[1]Tasa de Falla'!F108","v":38.97},{"$f":"IF('[1]Tasa de Falla'!IK108=0,\"\",'[1]Tasa de Falla'!IK108)","v":""},{"$f":"IF('[1]Tasa de Falla'!IL108=0,\"\",'[1]Tasa de Falla'!IL108)","v":""},{"$f":"IF('[1]Tasa de Falla'!IM108=0,\"\",'[1]Tasa de Falla'!IM108)","v":""},{"$f":"IF('[1]Tasa de Falla'!IN108=0,\"\",'[1]Tasa de Falla'!IN108)","v":""},{"$f":"IF('[1]Tasa de Falla'!IO108=0,\"\",'[1]Tasa de Falla'!IO108)","v":""},{"$f":"IF('[1]Tasa de Falla'!IP108=0,\"\",'[1]Tasa de Falla'!IP108)","v":""},{"$f":"IF('[1]Tasa de Falla'!IQ108=0,\"\",'[1]Tasa de Falla'!IQ108)","v":1},{"$f":"IF('[1]Tasa de Falla'!IR108=0,\"\",'[1]Tasa de Falla'!IR108)","v":""},{"$f":"IF('[1]Tasa de Falla'!IS108=0,\"\",'[1]Tasa de Falla'!IS108)","v":""},{"$f":"IF('[1]Tasa de Falla'!IT108=0,\"\",'[1]Tasa de Falla'!IT108)","v":""},{"$f":"IF('[1]Tasa de Falla'!IU108=0,\"\",'[1]Tasa de Falla'!IU108)","v":""},{"$f":"IF('[1]Tasa de Falla'!IV108=0,\"\",'[1]Tasa de Falla'!IV108)","v":""}]
[null,null,{"$f":"'[1]Tasa de Falla'!C109","v":92},{"$f":"'[1]Tasa de Falla'!D109","v":"BURRUYACU - R. DE LA FRONTERA"},{"$f":"'[1]Tasa de Falla'!E109","v":132},{"$f":"'[1]Tasa de Falla'!F109","v":99.1},{"$f":"IF('[1]Tasa de Falla'!IK109=0,\"\",'[1]Tasa de Falla'!IK109)","v":""},{"$f":"IF('[1]Tasa de Falla'!IL109=0,\"\",'[1]Tasa de Falla'!IL109)","v":""},{"$f":"IF('[1]Tasa de Falla'!IM109=0,\"\",'[1]Tasa de Falla'!IM109)","v":""},{"$f":"IF('[1]Tasa de Falla'!IN109=0,\"\",'[1]Tasa de Falla'!IN109)","v":""},{"$f":"IF('[1]Tasa de Falla'!IO109=0,\"\",'[1]Tasa de Falla'!IO109)","v":""},{"$f":"IF('[1]Tasa de Falla'!IP109=0,\"\",'[1]Tasa de Falla'!IP109)","v":""},{"$f":"IF('[1]Tasa de Falla'!IQ109=0,\"\",'[1]Tasa de Falla'!IQ109)","v":""},{"$f":"IF('[1]Tasa de Falla'!IR109=0,\"\",'[1]Tasa de Falla'!IR109)","v":""},{"$f":"IF('[1]Tasa de Falla'!IS109=0,\"\",'[1]Tasa de Falla'!IS109)","v":""},{"$f":"IF('[1]Tasa de Falla'!IT109=0,\"\",'[1]Tasa de Falla'!IT109)","v":""},{"$f":"IF('[1]Tasa de Falla'!IU109=0,\"\",'[1]Tasa de Falla'!IU109)","v":""},{"$f":"IF('[1]Tasa de Falla'!IV109=0,\"\",'[1]Tasa de Falla'!IV109)","v":""}]
[null,null,{"$f":"'[1]Tasa de Falla'!C110","v":93},{"$f":"'[1]Tasa de Falla'!D110","v":"R. DE LA FRONTERA - COBOS"},{"$f":"'[1]Tasa de Falla'!E110","v":132},{"$f":"'[1]Tasa de Falla'!F110","v":130.4},{"$f":"IF('[1]Tasa de Falla'!IK110=0,\"\",'[1]Tasa de Falla'!IK110)","v":""},{"$f":"IF('[1]Tasa de Falla'!IL110=0,\"\",'[1]Tasa de Falla'!IL110)","v":""},{"$f":"IF('[1]Tasa de Falla'!IM110=0,\"\",'[1]Tasa de Falla'!IM110)","v":""},{"$f":"IF('[1]Tasa de Falla'!IN110=0,\"\",'[1]Tasa de Falla'!IN110)","v":""},{"$f":"IF('[1]Tasa de Falla'!IO110=0,\"\",'[1]Tasa de Falla'!IO110)","v":""},{"$f":"IF('[1]Tasa de Falla'!IP110=0,\"\",'[1]Tasa de Falla'!IP110)","v":""},{"$f":"IF('[1]Tasa de Falla'!IQ110=0,\"\",'[1]Tasa de Falla'!IQ110)","v":""},{"$f":"IF('[1]Tasa de Falla'!IR110=0,\"\",'[1]Tasa de Falla'!IR110)","v":""},{"$f":"IF('[1]Tasa de Falla'!IS110=0,\"\",'[1]Tasa de Falla'!IS110)","v":""},{"$f":"IF('[1]Tasa de Falla'!IT110=0,\"\",'[1]Tasa de Falla'!IT110)","v":1},{"$f":"IF('[1]Tasa de Falla'!IU110=0,\"\",'[1]Tasa de Falla'!IU110)","v":""},{"$f":"IF('[1]Tasa de Falla'!IV110=0,\"\",'[1]Tasa de Falla'!IV110)","v":""}]
[null,null,{"$f":"'[1]Tasa de Falla'!C111","v":94},{"$f":"'[1]Tasa de Falla'!D111","v":"J.V. GONZALEZ - APOLINARIO SARAVIA"},{"$f":"'[1]Tasa de Falla'!E111","v":132},{"$f":"'[1]Tasa de Falla'!F111","v":94},{"$f":"IF('[1]Tasa de Falla'!IK111=0,\"\",'[1]Tasa de Falla'!IK111)","v":""},{"$f":"IF('[1]Tasa de Falla'!IL111=0,\"\",'[1]Tasa de Falla'!IL111)","v":""},{"$f":"IF('[1]Tasa de Falla'!IM111=0,\"\",'[1]Tasa de Falla'!IM111)","v":""},{"$f":"IF('[1]Tasa de Falla'!IN111=0,\"\",'[1]Tasa de Falla'!IN111)","v":""},{"$f":"IF('[1]Tasa de Falla'!IO111=0,\"\",'[1]Tasa de Falla'!IO111)","v":""},{"$f":"IF('[1]Tasa de Falla'!IP111=0,\"\",'[1]Tasa de Falla'!IP111)","v":""},{"$f":"IF('[1]Tasa de Falla'!IQ111=0,\"\",'[1]Tasa de Falla'!IQ111)","v":""},{"$f":"IF('[1]Tasa de Falla'!IR111=0,\"\",'[1]Tasa de Falla'!IR111)","v":""},{"$f":"IF('[1]Tasa de Falla'!IS111=0,\"\",'[1]Tasa de Falla'!IS111)","v":""},{"$f":"IF('[1]Tasa de Falla'!IT111=0,\"\",'[1]Tasa de Falla'!IT111)","v":""},{"$f":"IF('[1]Tasa de Falla'!IU111=0,\"\",'[1]Tasa de Falla'!IU111)","v":""},{"$f":"IF('[1]Tasa de Falla'!IV111=0,\"\",'[1]Tasa de Falla'!IV111)","v":""}]
[null,null,{"$f":"'[1]Tasa de Falla'!C112","v":95},{"$f":"'[1]Tasa de Falla'!D112","v":"ANDALGALA - SAULIL"},{"$f":"'[1]Tasa de Falla'!E112","v":132},{"$f":"'[1]Tasa de Falla'!F112","v":76},{"$f":"IF('[1]Tasa de Falla'!IK112=0,\"\",'[1]Tasa de Falla'!IK112)","v":""},{"$f":"IF('[1]Tasa de Falla'!IL112=0,\"\",'[1]Tasa de Falla'!IL112)","v":""},{"$f":"IF('[1]Tasa de Falla'!IM112=0,\"\",'[1]Tasa de Falla'!IM112)","v":""},{"$f":"IF('[1]Tasa de Falla'!IN112=0,\"\",'[1]Tasa de Falla'!IN112)","v":""},{"$f":"IF('[1]Tasa de Falla'!IO112=0,\"\",'[1]Tasa de Falla'!IO112)","v":""},{"$f":"IF('[1]Tasa de Falla'!IP112=0,\"\",'[1]Tasa de Falla'!IP112)","v":""},{"$f":"IF('[1]Tasa de Falla'!IQ112=0,\"\",'[1]Tasa de Falla'!IQ112)","v":1},{"$f":"IF('[1]Tasa de Falla'!IR112=0,\"\",'[1]Tasa de Falla'!IR112)","v":""},{"$f":"IF('[1]Tasa de Falla'!IS112=0,\"\",'[1]Tasa de Falla'!IS112)","v":""},{"$f":"IF('[1]Tasa de Falla'!IT112=0,\"\",'[1]Tasa de Falla'!IT112)","v":""},{"$f":"IF('[1]Tasa de Falla'!IU112=0,\"\",'[1]Tasa de Falla'!IU112)","v":""},{"$f":"IF('[1]Tasa de Falla'!IV112=0,\"\",'[1]Tasa de Falla'!IV112)","v":""}]
[null,null,{"$f":"'[1]Tasa de Falla'!C113","v":96},{"$f":"'[1]Tasa de Falla'!D113","v":"SANTIAGO OESTE - SANT. SUR  - SANT. CENTRO"},{"$f":"'[1]Tasa de Falla'!E113","v":132},{"$f":"'[1]Tasa de Falla'!F113","v":14.6},{"$f":"IF('[1]Tasa de Falla'!IK113=0,\"\",'[1]Tasa de Falla'!IK113)","v":"XXXX"},{"$f":"IF('[1]Tasa de Falla'!IL113=0,\"\",'[1]Tasa de Falla'!IL113)","v":"XXXX"},{"$f":"IF('[1]Tasa de Falla'!IM113=0,\"\",'[1]Tasa de Falla'!IM113)","v":"XXXX"},{"$f":"IF('[1]Tasa de Falla'!IN113=0,\"\",'[1]Tasa de Falla'!IN113)","v":"XXXX"},{"$f":"IF('[1]Tasa de Falla'!IO113=0,\"\",'[1]Tasa de Falla'!IO113)","v":"XXXX"},{"$f":"IF('[1]Tasa de Falla'!IP113=0,\"\",'[1]Tasa de Falla'!IP113)","v":"XXXX"},{"$f":"IF('[1]Tasa de Falla'!IQ113=0,\"\",'[1]Tasa de Falla'!IQ113)","v":"XXXX"},{"$f":"IF('[1]Tasa de Falla'!IR113=0,\"\",'[1]Tasa de Falla'!IR113)","v":"XXXX"},{"$f":"IF('[1]Tasa de Falla'!IS113=0,\"\",'[1]Tasa de Falla'!IS113)","v":"XXXX"},{"$f":"IF('[1]Tasa de Falla'!IT113=0,\"\",'[1]Tasa de Falla'!IT113)","v":"XXXX"},{"$f":"IF('[1]Tasa de Falla'!IU113=0,\"\",'[1]Tasa de Falla'!IU113)","v":"XXXX"},{"$f":"IF('[1]Tasa de Falla'!IV113=0,\"\",'[1]Tasa de Falla'!IV113)","v":"XXXX"}]
[null,null,{"$f":"'[1]Tasa de Falla'!C114","v":97},{"$f":"'[1]Tasa de Falla'!D114","v":"SUNCHO CORRAL - QUIMILI"},{"$f":"'[1]Tasa de Falla'!E114","v":132},{"$f":"'[1]Tasa de Falla'!F114","v":108},{"$f":"IF('[1]Tasa de Falla'!IK114=0,\"\",'[1]Tasa de Falla'!IK114)","v":""},{"$f":"IF('[1]Tasa de Falla'!IL114=0,\"\",'[1]Tasa de Falla'!IL114)","v":""},{"$f":"IF('[1]Tasa de Falla'!IM114=0,\"\",'[1]Tasa de Falla'!IM114)","v":""},{"$f":"IF('[1]Tasa de Falla'!IN114=0,\"\",'[1]Tasa de Falla'!IN114)","v":""},{"$f":"IF('[1]Tasa de Falla'!IO114=0,\"\",'[1]Tasa de Falla'!IO114)","v":""},{"$f":"IF('[1]Tasa de Falla'!IP114=0,\"\",'[1]Tasa de Falla'!IP114)","v":""},{"$f":"IF('[1]Tasa de Falla'!IQ114=0,\"\",'[1]Tasa de Falla'!IQ114)","v":""},{"$f":"IF('[1]Tasa de Falla'!IR114=0,\"\",'[1]Tasa de Falla'!IR114)","v":""},{"$f":"IF('[1]Tasa de Falla'!IS114=0,\"\",'[1]Tasa de Falla'!IS114)","v":""},{"$f":"IF('[1]Tasa de Falla'!IT114=0,\"\",'[1]Tasa de Falla'!IT114)","v":""},{"$f":"IF('[1]Tasa de Falla'!IU114=0,\"\",'[1]Tasa de Falla'!IU114)","v":""},{"$f":"IF('[1]Tasa de Falla'!IV114=0,\"\",'[1]Tasa de Falla'!IV114)","v":""}]
[null,null,{"$f":"'[1]Tasa de Falla'!C115","v":98},{"$f":"'[1]Tasa de Falla'!D115","v":"EL BRACHO - LA BANDA ESTE"},{"$f":"'[1]Tasa de Falla'!E115","v":132},{"$f":"'[1]Tasa de Falla'!F115","v":140.9},{"$f":"IF('[1]Tasa de Falla'!IK115=0,\"\",'[1]Tasa de Falla'!IK115)","v":""},{"$f":"IF('[1]Tasa de Falla'!IL115=0,\"\",'[1]Tasa de Falla'!IL115)","v":""},{"$f":"IF('[1]Tasa de Falla'!IM115=0,\"\",'[1]Tasa de Falla'!IM115)","v":""},{"$f":"IF('[1]Tasa de Falla'!IN115=0,\"\",'[1]Tasa de Falla'!IN115)","v":""},{"$f":"IF('[1]Tasa de Falla'!IO115=0,\"\",'[1]Tasa de Falla'!IO115)","v":""},{"$f":"IF('[1]Tasa de Falla'!IP115=0,\"\",'[1]Tasa de Falla'!IP115)","v":""},{"$f":"IF('[1]Tasa de Falla'!IQ115=0,\"\",'[1]Tasa de Falla'!IQ115)","v":""},{"$f":"IF('[1]Tasa de Falla'!IR115=0,\"\",'[1]Tasa de Falla'!IR115)","v":""},{"$f":"IF('[1]Tasa de Falla'!IS115=0,\"\",'[1]Tasa de Falla'!IS115)","v":""},{"$f":"IF('[1]Tasa de Falla'!IT115=0,\"\",'[1]Tasa de Falla'!IT115)","v":1},{"$f":"IF('[1]Tasa de Falla'!IU115=0,\"\",'[1]Tasa de Falla'!IU115)","v":""},{"$f":"IF('[1]Tasa de Falla'!IV115=0,\"\",'[1]Tasa de Falla'!IV115)","v":1}]
[null,null,{"$f":"'[1]Tasa de Falla'!C116","v":99},{"$f":"'[1]Tasa de Falla'!D116","v":"LA BANDA ESTE - LA BANDA"},{"$f":"'[1]Tasa de Falla'!E116","v":132},{"$f":"'[1]Tasa de Falla'!F116","v":16.2},{"$f":"IF('[1]Tasa de Falla'!IK116=0,\"\",'[1]Tasa de Falla'!IK116)","v":""},{"$f":"IF('[1]Tasa de Falla'!IL116=0,\"\",'[1]Tasa de Falla'!IL116)","v":""},{"$f":"IF('[1]Tasa de Falla'!IM116=0,\"\",'[1]Tasa de Falla'!IM116)","v":""},{"$f":"IF('[1]Tasa de Falla'!IN116=0,\"\",'[1]Tasa de Falla'!IN116)","v":""},{"$f":"IF('[1]Tasa de Falla'!IO116=0,\"\",'[1]Tasa de Falla'!IO116)","v":""},{"$f":"IF('[1]Tasa de Falla'!IP116=0,\"\",'[1]Tasa de Falla'!IP116)","v":""},{"$f":"IF('[1]Tasa de Falla'!IQ116=0,\"\",'[1]Tasa de Falla'!IQ116)","v":""},{"$f":"IF('[1]Tasa de Falla'!IR116=0,\"\",'[1]Tasa de Falla'!IR116)","v":""},{"$f":"IF('[1]Tasa de Falla'!IS116=0,\"\",'[1]Tasa de Falla'!IS116)","v":""},{"$f":"IF('[1]Tasa de Falla'!IT116=0,\"\",'[1]Tasa de Falla'!IT116)","v":""},{"$f":"IF('[1]Tasa de Falla'!IU116=0,\"\",'[1]Tasa de Falla'!IU116)","v":""},{"$f":"IF('[1]Tasa de Falla'!IV116=0,\"\",'[1]Tasa de Falla'!IV116)","v":""}]
[null,null,{"$f":"'[1]Tasa de Falla'!C117","v":100},{"$f":"'[1]Tasa de Falla'!D117","v":"TABACAL - PICHANAL"},{"$f":"'[1]Tasa de Falla'!E117","v":132},{"$f":"'[1]Tasa de Falla'!F117","v":7},{"$f":"IF('[1]Tasa de Falla'!IK117=0,\"\",'[1]Tasa de Falla'!IK117)","v":""},{"$f":"IF('[1]Tasa de Falla'!IL117=0,\"\",'[1]Tasa de Falla'!IL117)","v":""},{"$f":"IF('[1]Tasa de Falla'!IM117=0,\"\",'[1]Tasa de Falla'!IM117)","v":""},{"$f":"IF('[1]Tasa de Falla'!IN117=0,\"\",'[1]Tasa de Falla'!IN117)","v":""},{"$f":"IF('[1]Tasa de Falla'!IO117=0,\"\",'[1]Tasa de Falla'!IO117)","v":""},{"$f":"IF('[1]Tasa de Falla'!IP117=0,\"\",'[1]Tasa de Falla'!IP117)","v":""},{"$f":"IF('[1]Tasa de Falla'!IQ117=0,\"\",'[1]Tasa de Falla'!IQ117)","v":""},{"$f":"IF('[1]Tasa de Falla'!IR117=0,\"\",'[1]Tasa de Falla'!IR117)","v":""},{"$f":"IF('[1]Tasa de Falla'!IS117=0,\"\",'[1]Tasa de Falla'!IS117)","v":""},{"$f":"IF('[1]Tasa de Falla'!IT117=0,\"\",'[1]Tasa de Falla'!IT117)","v":""},{"$f":"IF('[1]Tasa de Falla'!IU117=0,\"\",'[1]Tasa de Falla'!IU117)","v":""},{"$f":"IF('[1]Tasa de Falla'!IV117=0,\"\",'[1]Tasa de Falla'!IV117)","v":""}]
[null,null,{"$f":"'[1]Tasa de Falla'!C118","v":101},{"$f":"'[1]Tasa de Falla'!D118","v":"ORAN - TABACAL"},{"$f":"'[1]Tasa de Falla'!E118","v":132},{"$f":"'[1]Tasa de Falla'!F118","v":10},{"$f":"IF('[1]Tasa de Falla'!IK118=0,\"\",'[1]Tasa de Falla'!IK118)","v":""},{"$f":"IF('[1]Tasa de Falla'!IL118=0,\"\",'[1]Tasa de Falla'!IL118)","v":""},{"$f":"IF('[1]Tasa de Falla'!IM118=0,\"\",'[1]Tasa de Falla'!IM118)","v":""},{"$f":"IF('[1]Tasa de Falla'!IN118=0,\"\",'[1]Tasa de Falla'!IN118)","v":""},{"$f":"IF('[1]Tasa de Falla'!IO118=0,\"\",'[1]Tasa de Falla'!IO118)","v":""},{"$f":"IF('[1]Tasa de Falla'!IP118=0,\"\",'[1]Tasa de Falla'!IP118)","v":""},{"$f":"IF('[1]Tasa de Falla'!IQ118=0,\"\",'[1]Tasa de Falla'!IQ118)","v":""},{"$f":"IF('[1]Tasa de Falla'!IR118=0,\"\",'[1]Tasa de Falla'!IR118)","v":""},{"$f":"IF('[1]Tasa de Falla'!IS118=0,\"\",'[1]Tasa de Falla'!IS118)","v":""},{"$f":"IF('[1]Tasa de Falla'!IT118=0,\"\",'[1]Tasa de Falla'!IT118)","v":""},{"$f":"IF('[1]Tasa de Falla'!IU118=0,\"\",'[1]Tasa de Falla'!IU118)","v":""},{"$f":"IF('[1]Tasa de Falla'!IV118=0,\"\",'[1]Tasa de Falla'!IV118)","v":""}]
[null,null,{"$f":"'[1]Tasa de Falla'!C119","v":102},{"$f":"'[1]Tasa de Falla'!D119","v":"MONTE QUEMADO -COPO - QUIMILI"},{"$f":"'[1]Tasa de Falla'!E119","v":132},{"$f":"'[1]Tasa de Falla'!F119","v":218},{"$f":"IF('[1]Tasa de Falla'!IK119=0,\"\",'[1]Tasa de Falla'!IK119)","v":""},{"$f":"IF('[1]Tasa de Falla'!IL119=0,\"\",'[1]Tasa de Falla'!IL119)","v":""},{"$f":"IF('[1]Tasa de Falla'!IM119=0,\"\",'[1]Tasa de Falla'!IM119)","v":""},{"$f":"IF('[1]Tasa de Falla'!IN119=0,\"\",'[1]Tasa de Falla'!IN119)","v":""},{"$f":"IF('[1]Tasa de Falla'!IO119=0,\"\",'[1]Tasa de Falla'!IO119)","v":""},{"$f":"IF('[1]Tasa de Falla'!IP119=0,\"\",'[1]Tasa de Falla'!IP119)","v":""},{"$f":"IF('[1]Tasa de Falla'!IQ119=0,\"\",'[1]Tasa de Falla'!IQ119)","v":""},{"$f":"IF('[1]Tasa de Falla'!IR119=0,\"\",'[1]Tasa de Falla'!IR119)","v":""},{"$f":"IF('[1]Tasa de Falla'!IS119=0,\"\",'[1]Tasa de Falla'!IS119)","v":""},{"$f":"IF('[1]Tasa de Falla'!IT119=0,\"\",'[1]Tasa de Falla'!IT119)","v":1},{"$f":"IF('[1]Tasa de Falla'!IU119=0,\"\",'[1]Tasa de Falla'!IU119)","v":""},{"$f":"IF('[1]Tasa de Falla'!IV119=0,\"\",'[1]Tasa de Falla'!IV119)","v":""}]
[null,null,{"$f":"'[1]Tasa de Falla'!C120","v":103},{"$f":"'[1]Tasa de Falla'!D120","v":"PI. CIRCUNVALACIÓN - LARIOJA N. 1"},{"$f":"'[1]Tasa de Falla'!E120","v":132},{"$f":"'[1]Tasa de Falla'!F120","v":16.649999999999999},{"$f":"IF('[1]Tasa de Falla'!IK120=0,\"\",'[1]Tasa de Falla'!IK120)","v":"XXXX"},{"$f":"IF('[1]Tasa de Falla'!IL120=0,\"\",'[1]Tasa de Falla'!IL120)","v":"XXXX"},{"$f":"IF('[1]Tasa de Falla'!IM120=0,\"\",'[1]Tasa de Falla'!IM120)","v":"XXXX"},{"$f":"IF('[1]Tasa de Falla'!IN120=0,\"\",'[1]Tasa de Falla'!IN120)","v":"XXXX"},{"$f":"IF('[1]Tasa de Falla'!IO120=0,\"\",'[1]Tasa de Falla'!IO120)","v":"XXXX"},{"$f":"IF('[1]Tasa de Falla'!IP120=0,\"\",'[1]Tasa de Falla'!IP120)","v":""},{"$f":"IF('[1]Tasa de Falla'!IQ120=0,\"\",'[1]Tasa de Falla'!IQ120)","v":""},{"$f":"IF('[1]Tasa de Falla'!IR120=0,\"\",'[1]Tasa de Falla'!IR120)","v":""},{"$f":"IF('[1]Tasa de Falla'!IS120=0,\"\",'[1]Tasa de Falla'!IS120)","v":1},{"$f":"IF('[1]Tasa de Falla'!IT120=0,\"\",'[1]Tasa de Falla'!IT120)","v":""},{"$f":"IF('[1]Tasa de Falla'!IU120=0,\"\",'[1]Tasa de Falla'!IU120)","v":""},{"$f":"IF('[1]Tasa de Falla'!IV120=0,\"\",'[1]Tasa de Falla'!IV120)","v":""}]
[null,null,{"$f":"'[1]Tasa de Falla'!C121","v":104},{"$f":"'[1]Tasa de Falla'!D121","v":"PATQUIA NONOGASTA 132 1"},{"$f":"'[1]Tasa de Falla'!E121","v":132},{"$f":"'[1]Tasa de Falla'!F121","v":108.3},{"$f":"IF('[1]Tasa de Falla'!IK121=0,\"\",'[1]Tasa de Falla'!IK121)","v":"XXXX"},{"$f":"IF('[1]Tasa de Falla'!IL121=0,\"\",'[1]Tasa de Falla'!IL121)","v":"XXXX"},{"$f":"IF('[1]Tasa de Falla'!IM121=0,\"\",'[1]Tasa de Falla'!IM121)","v":"XXXX"},{"$f":"IF('[1]Tasa de Falla'!IN121=0,\"\",'[1]Tasa de Falla'!IN121)","v":"XXXX"},{"$f":"IF('[1]Tasa de Falla'!IO121=0,\"\",'[1]Tasa de Falla'!IO121)","v":"XXXX"},{"$f":"IF('[1]Tasa de Falla'!IP121=0,\"\",'[1]Tasa de Falla'!IP121)","v":""},{"$f":"IF('[1]Tasa de Falla'!IQ121=0,\"\",'[1]Tasa de Falla'!IQ121)","v":""},{"$f":"IF('[1]Tasa de Falla'!IR121=0,\"\",'[1]Tasa de Falla'!IR121)","v":""},{"$f":"IF('[1]Tasa de Falla'!IS121=0,\"\",'[1]Tasa de Falla'!IS121)","v":""},{"$f":"IF('[1]Tasa de Falla'!IT121=0,\"\",'[1]Tasa de Falla'!IT121)","v":""},{"$f":"IF('[1]Tasa de Falla'!IU121=0,\"\",'[1]Tasa de Falla'!IU121)","v":""},{"$f":"IF('[1]Tasa de Falla'!IV121=0,\"\",'[1]Tasa de Falla'!IV121)","v":""}]
[null,null,{"$f":"'[1]Tasa de Falla'!C122","v":105},{"$f":"'[1]Tasa de Falla'!D122","v":"NONOGASTA - VILLA UNION 132 1"},{"$f":"'[1]Tasa de Falla'!E122","v":132},{"$f":"'[1]Tasa de Falla'!F122","v":82.1},{"$f":"IF('[1]Tasa de Falla'!IK122=0,\"\",'[1]Tasa de Falla'!IK122)","v":"XXXX"},{"$f":"IF('[1]Tasa de Falla'!IL122=0,\"\",'[1]Tasa de Falla'!IL122)","v":"XXXX"},{"$f":"IF('[1]Tasa de Falla'!IM122=0,\"\",'[1]Tasa de Falla'!IM122)","v":"XXXX"},{"$f":"IF('[1]Tasa de Falla'!IN122=0,\"\",'[1]Tasa de Falla'!IN122)","v":"XXXX"},{"$f":"IF('[1]Tasa de Falla'!IO122=0,\"\",'[1]Tasa de Falla'!IO122)","v":"XXXX"},{"$f":"IF('[1]Tasa de Falla'!IP122=0,\"\",'[1]Tasa de Falla'!IP122)","v":""},{"$f":"IF('[1]Tasa de Falla'!IQ122=0,\"\",'[1]Tasa de Falla'!IQ122)","v":""},{"$f":"IF('[1]Tasa de Falla'!IR122=0,\"\",'[1]Tasa de Falla'!IR122)","v":""},{"$f":"IF('[1]Tasa de Falla'!IS122=0,\"\",'[1]Tasa de Falla'!IS122)","v":""},{"$f":"IF('[1]Tasa de Falla'!IT122=0,\"\",'[1]Tasa de Falla'!IT122)","v":""},{"$f":"IF('[1]Tasa de Falla'!IU122=0,\"\",'[1]Tasa de Falla'!IU122)","v":""},{"$f":"IF('[1]Tasa de Falla'!IV122=0,\"\",'[1]Tasa de Falla'!IV122)","v":""}]
[null,null,{"$f":"'[1]Tasa de Falla'!C123","v":106},{"$f":"'[1]Tasa de Falla'!D123","v":"ARAUCO - AIMOGASTA 132 1"},{"$f":"'[1]Tasa de Falla'!E123","v":132},{"$f":"'[1]Tasa de Falla'!F123","v":20},{"$f":"IF('[1]Tasa de Falla'!IK123=0,\"\",'[1]Tasa de Falla'!IK123)","v":"XXXX"},{"$f":"IF('[1]Tasa de Falla'!IL123=0,\"\",'[1]Tasa de Falla'!IL123)","v":"XXXX"},{"$f":"IF('[1]Tasa de Falla'!IM123=0,\"\",'[1]Tasa de Falla'!IM123)","v":"XXXX"},{"$f":"IF('[1]Tasa de Falla'!IN123=0,\"\",'[1]Tasa de Falla'!IN123)","v":"XXXX"},{"$f":"IF('[1]Tasa de Falla'!IO123=0,\"\",'[1]Tasa de Falla'!IO123)","v":"XXXX"},{"$f":"IF('[1]Tasa de Falla'!IP123=0,\"\",'[1]Tasa de Falla'!IP123)","v":""},{"$f":"IF('[1]Tasa de Falla'!IQ123=0,\"\",'[1]Tasa de Falla'!IQ123)","v":""},{"$f":"IF('[1]Tasa de Falla'!IR123=0,\"\",'[1]Tasa de Falla'!IR123)","v":""},{"$f":"IF('[1]Tasa de Falla'!IS123=0,\"\",'[1]Tasa de Falla'!IS123)","v":""},{"$f":"IF('[1]Tasa de Falla'!IT123=0,\"\",'[1]Tasa de Falla'!IT123)","v":""},{"$f":"IF('[1]Tasa de Falla'!IU123=0,\"\",'[1]Tasa de Falla'!IU123)","v":""},{"$f":"IF('[1]Tasa de Falla'!IV123=0,\"\",'[1]Tasa de Falla'!IV123)","v":""}]
[null,null,{"$f":"'[1]Tasa de Falla'!C124","v":107},{"$f":"'[1]Tasa de Falla'!D124","v":"PATQUIA - CHAMICAL 132 1"},{"$f":"'[1]Tasa de Falla'!E124","v":132},{"$f":"'[1]Tasa de Falla'!F124","v":67.400000000000006},{"$f":"IF('[1]Tasa de Falla'!IK124=0,\"\",'[1]Tasa de Falla'!IK124)","v":"XXXX"},{"$f":"IF('[1]Tasa de Falla'!IL124=0,\"\",'[1]Tasa de Falla'!IL124)","v":"XXXX"},{"$f":"IF('[1]Tasa de Falla'!IM124=0,\"\",'[1]Tasa de Falla'!IM124)","v":"XXXX"},{"$f":"IF('[1]Tasa de Falla'!IN124=0,\"\",'[1]Tasa de Falla'!IN124)","v":"XXXX"},{"$f":"IF('[1]Tasa de Falla'!IO124=0,\"\",'[1]Tasa de Falla'!IO124)","v":"XXXX"},{"$f":"IF('[1]Tasa de Falla'!IP124=0,\"\",'[1]Tasa de Falla'!IP124)","v":1},{"$f":"IF('[1]Tasa de Falla'!IQ124=0,\"\",'[1]Tasa de Falla'!IQ124)","v":""},{"$f":"IF('[1]Tasa de Falla'!IR124=0,\"\",'[1]Tasa de Falla'!IR124)","v":""},{"$f":"IF('[1]Tasa de Falla'!IS124=0,\"\",'[1]Tasa de Falla'!IS124)","v":""},{"$f":"IF('[1]Tasa de Falla'!IT124=0,\"\",'[1]Tasa de Falla'!IT124)","v":""},{"$f":"IF('[1]Tasa de Falla'!IU124=0,\"\",'[1]Tasa de Falla'!IU124)","v":""},{"$f":"IF('[1]Tasa de Falla'!IV124=0,\"\",'[1]Tasa de Falla'!IV124)","v":""}]
[null,null,{"$f":"'[1]Tasa de Falla'!C125","v":108},{"$f":"'[1]Tasa de Falla'!D125","v":"LA RIOJA - ARAUCO 132 1"},{"$f":"'[1]Tasa de Falla'!E125","v":132},{"$f":"'[1]Tasa de Falla'!F125","v":84.3},{"$f":"IF('[1]Tasa de Falla'!IK125=0,\"\",'[1]Tasa de Falla'!IK125)","v":"XXXX"},{"$f":"IF('[1]Tasa de Falla'!IL125=0,\"\",'[1]Tasa de Falla'!IL125)","v":"XXXX"},{"$f":"IF('[1]Tasa de Falla'!IM125=0,\"\",'[1]Tasa de Falla'!IM125)","v":"XXXX"},{"$f":"IF('[1]Tasa de Falla'!IN125=0,\"\",'[1]Tasa de Falla'!IN125)","v":"XXXX"},{"$f":"IF('[1]Tasa de Falla'!IO125=0,\"\",'[1]Tasa de Falla'!IO125)","v":"XXXX"},{"$f":"IF('[1]Tasa de Falla'!IP125=0,\"\",'[1]Tasa de Falla'!IP125)","v":""},{"$f":"IF('[1]Tasa de Falla'!IQ125=0,\"\",'[1]Tasa de Falla'!IQ125)","v":""},{"$f":"IF('[1]Tasa de Falla'!IR125=0,\"\",'[1]Tasa de Falla'!IR125)","v":""},{"$f":"IF('[1]Tasa de Falla'!IS125=0,\"\",'[1]Tasa de Falla'!IS125)","v":""},{"$f":"IF('[1]Tasa de Falla'!IT125=0,\"\",'[1]Tasa de Falla'!IT125)","v":""},{"$f":"IF('[1]Tasa de Falla'!IU125=0,\"\",'[1]Tasa de Falla'!IU125)","v":""},{"$f":"IF('[1]Tasa de Falla'!IV125=0,\"\",'[1]Tasa de Falla'!IV125)","v":""}]
[null,null,{"$f":"'[1]Tasa de Falla'!C126","v":109},{"$f":"'[1]Tasa de Falla'!D126","v":"PI PATQUIA - PATQUIA 132 1"},{"$f":"'[1]Tasa de Falla'!E126","v":132},{"$f":"'[1]Tasa de Falla'!F126","v":58.65},{"$f":"IF('[1]Tasa de Falla'!IK126=0,\"\",'[1]Tasa de Falla'!IK126)","v":"XXXX"},{"$f":"IF('[1]Tasa de Falla'!IL126=0,\"\",'[1]Tasa de Falla'!IL126)","v":"XXXX"},{"$f":"IF('[1]Tasa de Falla'!IM126=0,\"\",'[1]Tasa de Falla'!IM126)","v":"XXXX"},{"$f":"IF('[1]Tasa de Falla'!IN126=0,\"\",'[1]Tasa de Falla'!IN126)","v":"XXXX"},{"$f":"IF('[1]Tasa de Falla'!IO126=0,\"\",'[1]Tasa de Falla'!IO126)","v":"XXXX"},{"$f":"IF('[1]Tasa de Falla'!IP126=0,\"\",'[1]Tasa de Falla'!IP126)","v":""},{"$f":"IF('[1]Tasa de Falla'!IQ126=0,\"\",'[1]Tasa de Falla'!IQ126)","v":""},{"$f":"IF('[1]Tasa de Falla'!IR126=0,\"\",'[1]Tasa de Falla'!IR126)","v":""},{"$f":"IF('[1]Tasa de Falla'!IS126=0,\"\",'[1]Tasa de Falla'!IS126)","v":""},{"$f":"IF('[1]Tasa de Falla'!IT126=0,\"\",'[1]Tasa de Falla'!IT126)","v":""},{"$f":"IF('[1]Tasa de Falla'!IU126=0,\"\",'[1]Tasa de Falla'!IU126)","v":""},{"$f":"IF('[1]Tasa de Falla'!IV126=0,\"\",'[1]Tasa de Falla'!IV126)","v":""}]
[null,null,{"$f":"'[1]Tasa de Falla'!C127","v":110},{"$f":"'[1]Tasa de Falla'!D127","v":"RIO HONDO - TERMAS NORTE"},{"$f":"'[1]Tasa de Falla'!E127","v":132},{"$f":"'[1]Tasa de Falla'!F127","v":5.8},{"$f":"IF('[1]Tasa de Falla'!IK127=0,\"\",'[1]Tasa de Falla'!IK127)","v":"XXXX"},{"$f":"IF('[1]Tasa de Falla'!IL127=0,\"\",'[1]Tasa de Falla'!IL127)","v":"XXXX"},{"$f":"IF('[1]Tasa de Falla'!IM127=0,\"\",'[1]Tasa de Falla'!IM127)","v":"XXXX"},{"$f":"IF('[1]Tasa de Falla'!IN127=0,\"\",'[1]Tasa de Falla'!IN127)","v":"XXXX"},{"$f":"IF('[1]Tasa de Falla'!IO127=0,\"\",'[1]Tasa de Falla'!IO127)","v":"XXXX"},{"$f":"IF('[1]Tasa de Falla'!IP127=0,\"\",'[1]Tasa de Falla'!IP127)","v":"XXXX"},{"$f":"IF('[1]Tasa de Falla'!IQ127=0,\"\",'[1]Tasa de Falla'!IQ127)","v":"XXXX"},{"$f":"IF('[1]Tasa de Falla'!IR127=0,\"\",'[1]Tasa de Falla'!IR127)","v":"XXXX"},{"$f":"IF('[1]Tasa de Falla'!IS127=0,\"\",'[1]Tasa de Falla'!IS127)","v":""},{"$f":"IF('[1]Tasa de Falla'!IT127=0,\"\",'[1]Tasa de Falla'!IT127)","v":""},{"$f":"IF('[1]Tasa de Falla'!IU127=0,\"\",'[1]Tasa de Falla'!IU127)","v":""},{"$f":"IF('[1]Tasa de Falla'!IV127=0,\"\",'[1]Tasa de Falla'!IV127)","v":""}]
[null,null,{"$f":"'[1]Tasa de Falla'!C128","v":111},{"$f":"'[1]Tasa de Falla'!D128","v":"EL BRACHO - TETRMAS NORTE"},{"$f":"'[1]Tasa de Falla'!E128","v":132},{"$f":"'[1]Tasa de Falla'!F128","v":78.400000000000006},{"$f":"IF('[1]Tasa de Falla'!IK128=0,\"\",'[1]Tasa de Falla'!IK128)","v":"XXXX"},{"$f":"IF('[1]Tasa de Falla'!IL128=0,\"\",'[1]Tasa de Falla'!IL128)","v":"XXXX"},{"$f":"IF('[1]Tasa de Falla'!IM128=0,\"\",'[1]Tasa de Falla'!IM128)","v":"XXXX"},{"$f":"IF('[1]Tasa de Falla'!IN128=0,\"\",'[1]Tasa de Falla'!IN128)","v":"XXXX"},{"$f":"IF('[1]Tasa de Falla'!IO128=0,\"\",'[1]Tasa de Falla'!IO128)","v":"XXXX"},{"$f":"IF('[1]Tasa de Falla'!IP128=0,\"\",'[1]Tasa de Falla'!IP128)","v":"XXXX"},{"$f":"IF('[1]Tasa de Falla'!IQ128=0,\"\",'[1]Tasa de Falla'!IQ128)","v":"XXXX"},{"$f":"IF('[1]Tasa de Falla'!IR128=0,\"\",'[1]Tasa de Falla'!IR128)","v":"XXXX"},{"$f":"IF('[1]Tasa de Falla'!IS128=0,\"\",'[1]Tasa de Falla'!IS128)","v":""},{"$f":"IF('[1]Tasa de Falla'!IT128=0,\"\",'[1]Tasa de Falla'!IT128)","v":""},{"$f":"IF('[1]Tasa de Falla'!IU128=0,\"\",'[1]Tasa de Falla'!IU128)","v":""},{"$f":"IF('[1]Tasa de Falla'!IV128=0,\"\",'[1]Tasa de Falla'!IV128)","v":""}]
[null,null,{"$f":"'[1]Tasa de Falla'!C129","v":112},{"$f":"'[1]Tasa de Falla'!D129","v":"PI 150 NORTE - LA RIOJA ESTE"},{"$f":"'[1]Tasa de Falla'!E129","v":132},{"$f":"'[1]Tasa de Falla'!F129","v":4},{"$f":"IF('[1]Tasa de Falla'!IK129=0,\"\",'[1]Tasa de Falla'!IK129)","v":"XXXX"},{"$f":"IF('[1]Tasa de Falla'!IL129=0,\"\",'[1]Tasa de Falla'!IL129)","v":"XXXX"},{"$f":"IF('[1]Tasa de Falla'!IM129=0,\"\",'[1]Tasa de Falla'!IM129)","v":"XXXX"},{"$f":"IF('[1]Tasa de Falla'!IN129=0,\"\",'[1]Tasa de Falla'!IN129)","v":"XXXX"},{"$f":"IF('[1]Tasa de Falla'!IO129=0,\"\",'[1]Tasa de Falla'!IO129)","v":"XXXX"},{"$f":"IF('[1]Tasa de Falla'!IP129=0,\"\",'[1]Tasa de Falla'!IP129)","v":"XXXX"},{"$f":"IF('[1]Tasa de Falla'!IQ129=0,\"\",'[1]Tasa de Falla'!IQ129)","v":"XXXX"},{"$f":"IF('[1]Tasa de Falla'!IR129=0,\"\",'[1]Tasa de Falla'!IR129)","v":"XXXX"},{"$f":"IF('[1]Tasa de Falla'!IS129=0,\"\",'[1]Tasa de Falla'!IS129)","v":""},{"$f":"IF('[1]Tasa de Falla'!IT129=0,\"\",'[1]Tasa de Falla'!IT129)","v":""},{"$f":"IF('[1]Tasa de Falla'!IU129=0,\"\",'[1]Tasa de Falla'!IU129)","v":""},{"$f":"IF('[1]Tasa de Falla'!IV129=0,\"\",'[1]Tasa de Falla'!IV129)","v":""}]
[null,null,{"$f":"'[1]Tasa de Falla'!C130","v":113},{"$f":"'[1]Tasa de Falla'!D130","v":"PI 150 SUR - LA RIOJA ESTE"},{"$f":"'[1]Tasa de Falla'!E130","v":132},{"$f":"'[1]Tasa de Falla'!F130","v":4},{"$f":"IF('[1]Tasa de Falla'!IK130=0,\"\",'[1]Tasa de Falla'!IK130)","v":"XXXX"},{"$f":"IF('[1]Tasa de Falla'!IL130=0,\"\",'[1]Tasa de Falla'!IL130)","v":"XXXX"},{"$f":"IF('[1]Tasa de Falla'!IM130=0,\"\",'[1]Tasa de Falla'!IM130)","v":"XXXX"},{"$f":"IF('[1]Tasa de Falla'!IN130=0,\"\",'[1]Tasa de Falla'!IN130)","v":"XXXX"},{"$f":"IF('[1]Tasa de Falla'!IO130=0,\"\",'[1]Tasa de Falla'!IO130)","v":"XXXX"},{"$f":"IF('[1]Tasa de Falla'!IP130=0,\"\",'[1]Tasa de Falla'!IP130)","v":"XXXX"},{"$f":"IF('[1]Tasa de Falla'!IQ130=0,\"\",'[1]Tasa de Falla'!IQ130)","v":"XXXX"},{"$f":"IF('[1]Tasa de Falla'!IR130=0,\"\",'[1]Tasa de Falla'!IR130)","v":"XXXX"},{"$f":"IF('[1]Tasa de Falla'!IS130=0,\"\",'[1]Tasa de Falla'!IS130)","v":""},{"$f":"IF('[1]Tasa de Falla'!IT130=0,\"\",'[1]Tasa de Falla'!IT130)","v":""},{"$f":"IF('[1]Tasa de Falla'!IU130=0,\"\",'[1]Tasa de Falla'!IU130)","v":""},{"$f":"IF('[1]Tasa de Falla'!IV130=0,\"\",'[1]Tasa de Falla'!IV130)","v":""}]
[null,null,{"$f":"'[1]Tasa de Falla'!C131","v":114},{"$f":"'[1]Tasa de Falla'!D131","v":"QUIMILI - CAMPO GALLO 132 1"},{"$f":"'[1]Tasa de Falla'!E131","v":132},{"$f":"'[1]Tasa de Falla'!F131","v":140},{"$f":"IF('[1]Tasa de Falla'!IK131=0,\"\",'[1]Tasa de Falla'!IK131)","v":"XXXX"},{"$f":"IF('[1]Tasa de Falla'!IL131=0,\"\",'[1]Tasa de Falla'!IL131)","v":"XXXX"},{"$f":"IF('[1]Tasa de Falla'!IM131=0,\"\",'[1]Tasa de Falla'!IM131)","v":"XXXX"},{"$f":"IF('[1]Tasa de Falla'!IN131=0,\"\",'[1]Tasa de Falla'!IN131)","v":"XXXX"},{"$f":"IF('[1]Tasa de Falla'!IO131=0,\"\",'[1]Tasa de Falla'!IO131)","v":"XXXX"},{"$f":"IF('[1]Tasa de Falla'!IP131=0,\"\",'[1]Tasa de Falla'!IP131)","v":"XXXX"},{"$f":"IF('[1]Tasa de Falla'!IQ131=0,\"\",'[1]Tasa de Falla'!IQ131)","v":"XXXX"},{"$f":"IF('[1]Tasa de Falla'!IR131=0,\"\",'[1]Tasa de Falla'!IR131)","v":"XXXX"},{"$f":"IF('[1]Tasa de Falla'!IS131=0,\"\",'[1]Tasa de Falla'!IS131)","v":"XXXX"},{"$f":"IF('[1]Tasa de Falla'!IT131=0,\"\",'[1]Tasa de Falla'!IT131)","v":""},{"$f":"IF('[1]Tasa de Falla'!IU131=0,\"\",'[1]Tasa de Falla'!IU131)","v":""},{"$f":"IF('[1]Tasa de Falla'!IV131=0,\"\",'[1]Tasa de Falla'!IV131)","v":""}]
[null,null,{"$f":"'[1]Tasa de Falla'!C132","v":115},{"$f":"'[1]Tasa de Falla'!D132","v":"CAMPO GALLO - COPO 132 1"},{"$f":"'[1]Tasa de Falla'!E132","v":132},{"$f":"'[1]Tasa de Falla'!F132","v":90},{"$f":"IF('[1]Tasa de Falla'!IK132=0,\"\",'[1]Tasa de Falla'!IK132)","v":"XXXX"},{"$f":"IF('[1]Tasa de Falla'!IL132=0,\"\",'[1]Tasa de Falla'!IL132)","v":"XXXX"},{"$f":"IF('[1]Tasa de Falla'!IM132=0,\"\",'[1]Tasa de Falla'!IM132)","v":"XXXX"},{"$f":"IF('[1]Tasa de Falla'!IN132=0,\"\",'[1]Tasa de Falla'!IN132)","v":"XXXX"},{"$f":"IF('[1]Tasa de Falla'!IO132=0,\"\",'[1]Tasa de Falla'!IO132)","v":"XXXX"},{"$f":"IF('[1]Tasa de Falla'!IP132=0,\"\",'[1]Tasa de Falla'!IP132)","v":"XXXX"},{"$f":"IF('[1]Tasa de Falla'!IQ132=0,\"\",'[1]Tasa de Falla'!IQ132)","v":"XXXX"},{"$f":"IF('[1]Tasa de Falla'!IR132=0,\"\",'[1]Tasa de Falla'!IR132)","v":"XXXX"},{"$f":"IF('[1]Tasa de Falla'!IS132=0,\"\",'[1]Tasa de Falla'!IS132)","v":"XXXX"},{"$f":"IF('[1]Tasa de Falla'!IT132=0,\"\",'[1]Tasa de Falla'!IT132)","v":""},{"$f":"IF('[1]Tasa de Falla'!IU132=0,\"\",'[1]Tasa de Falla'!IU132)","v":""},{"$f":"IF('[1]Tasa de Falla'!IV132=0,\"\",'[1]Tasa de Falla'!IV132)","v":""}]
[null,null,{"$f":"'[1]Tasa de Falla'!C133","v":116},{"$f":"'[1]Tasa de Falla'!D133","v":"PICHANAL - SENDA HACHADA 132 1"},{"$f":"'[1]Tasa de Falla'!E133","v":132},{"$f":"'[1]Tasa de Falla'!F133","v":46.5},{"$f":"IF('[1]Tasa de Falla'!IK133=0,\"\",'[1]Tasa de Falla'!IK133)","v":"XXXX"},{"$f":"IF('[1]Tasa de Falla'!IL133=0,\"\",'[1]Tasa de Falla'!IL133)","v":"XXXX"},{"$f":"IF('[1]Tasa de Falla'!IM133=0,\"\",'[1]Tasa de Falla'!IM133)","v":"XXXX"},{"$f":"IF('[1]Tasa de Falla'!IN133=0,\"\",'[1]Tasa de Falla'!IN133)","v":"XXXX"},{"$f":"IF('[1]Tasa de Falla'!IO133=0,\"\",'[1]Tasa de Falla'!IO133)","v":"XXXX"},{"$f":"IF('[1]Tasa de Falla'!IP133=0,\"\",'[1]Tasa de Falla'!IP133)","v":"XXXX"},{"$f":"IF('[1]Tasa de Falla'!IQ133=0,\"\",'[1]Tasa de Falla'!IQ133)","v":"XXXX"},{"$f":"IF('[1]Tasa de Falla'!IR133=0,\"\",'[1]Tasa de Falla'!IR133)","v":"XXXX"},{"$f":"IF('[1]Tasa de Falla'!IS133=0,\"\",'[1]Tasa de Falla'!IS133)","v":"XXXX"},{"$f":"IF('[1]Tasa de Falla'!IT133=0,\"\",'[1]Tasa de Falla'!IT133)","v":"XXXX"},{"$f":"IF('[1]Tasa de Falla'!IU133=0,\"\",'[1]Tasa de Falla'!IU133)","v":"XXXX"},{"$f":"IF('[1]Tasa de Falla'!IV133=0,\"\",'[1]Tasa de Falla'!IV133)","v":""}]
[null,null,{"$f":"'[1]Tasa de Falla'!C134","v":117},{"$f":"'[1]Tasa de Falla'!D134","v":"SENDA HACHADA - TARTAGAL 132 1"},{"$f":"'[1]Tasa de Falla'!E134","v":132},{"$f":"'[1]Tasa de Falla'!F134","v":58.5},{"$f":"IF('[1]Tasa de Falla'!IK134=0,\"\",'[1]Tasa de Falla'!IK134)","v":"XXXX"},{"$f":"IF('[1]Tasa de Falla'!IL134=0,\"\",'[1]Tasa de Falla'!IL134)","v":"XXXX"},{"$f":"IF('[1]Tasa de Falla'!IM134=0,\"\",'[1]Tasa de Falla'!IM134)","v":"XXXX"},{"$f":"IF('[1]Tasa de Falla'!IN134=0,\"\",'[1]Tasa de Falla'!IN134)","v":"XXXX"},{"$f":"IF('[1]Tasa de Falla'!IO134=0,\"\",'[1]Tasa de Falla'!IO134)","v":"XXXX"},{"$f":"IF('[1]Tasa de Falla'!IP134=0,\"\",'[1]Tasa de Falla'!IP134)","v":"XXXX"},{"$f":"IF('[1]Tasa de Falla'!IQ134=0,\"\",'[1]Tasa de Falla'!IQ134)","v":"XXXX"},{"$f":"IF('[1]Tasa de Falla'!IR134=0,\"\",'[1]Tasa de Falla'!IR134)","v":"XXXX"},{"$f":"IF('[1]Tasa de Falla'!IS134=0,\"\",'[1]Tasa de Falla'!IS134)","v":"XXXX"},{"$f":"IF('[1]Tasa de Falla'!IT134=0,\"\",'[1]Tasa de Falla'!IT134)","v":"XXXX"},{"$f":"IF('[1]Tasa de Falla'!IU134=0,\"\",'[1]Tasa de Falla'!IU134)","v":"XXXX"},{"$f":"IF('[1]Tasa de Falla'!IV134=0,\"\",'[1]Tasa de Falla'!IV134)","v":""}]
[null,null,{"$f":"'[1]Tasa de Falla'!C135","v":118},{"$f":"'[1]Tasa de Falla'!D135","v":"ESTATICA - INDEPENDENCIA.TUC. 132 2"},{"$f":"'[1]Tasa de Falla'!E135","v":132},{"$f":"'[1]Tasa de Falla'!F135","v":3.1},{"$f":"IF('[1]Tasa de Falla'!IK135=0,\"\",'[1]Tasa de Falla'!IK135)","v":"XXXX"},{"$f":"IF('[1]Tasa de Falla'!IL135=0,\"\",'[1]Tasa de Falla'!IL135)","v":"XXXX"},{"$f":"IF('[1]Tasa de Falla'!IM135=0,\"\",'[1]Tasa de Falla'!IM135)","v":"XXXX"},{"$f":"IF('[1]Tasa de Falla'!IN135=0,\"\",'[1]Tasa de Falla'!IN135)","v":"XXXX"},{"$f":"IF('[1]Tasa de Falla'!IO135=0,\"\",'[1]Tasa de Falla'!IO135)","v":"XXXX"},{"$f":"IF('[1]Tasa de Falla'!IP135=0,\"\",'[1]Tasa de Falla'!IP135)","v":"XXXX"},{"$f":"IF('[1]Tasa de Falla'!IQ135=0,\"\",'[1]Tasa de Falla'!IQ135)","v":"XXXX"},{"$f":"IF('[1]Tasa de Falla'!IR135=0,\"\",'[1]Tasa de Falla'!IR135)","v":"XXXX"},{"$f":"IF('[1]Tasa de Falla'!IS135=0,\"\",'[1]Tasa de Falla'!IS135)","v":"XXXX"},{"$f":"IF('[1]Tasa de Falla'!IT135=0,\"\",'[1]Tasa de Falla'!IT135)","v":"XXXX"},{"$f":"IF('[1]Tasa de Falla'!IU135=0,\"\",'[1]Tasa de Falla'!IU135)","v":"XXXX"},{"$f":"IF('[1]Tasa de Falla'!IV135=0,\"\",'[1]Tasa de Falla'!IV135)","v":"XXXX"}]
[null,null,{"$f":"'[1]Tasa de Falla'!C136","v":119},{"$f":"'[1]Tasa de Falla'!D136","v":"SENDA HACHADA - DRAGONES 132 1"},{"$f":"'[1]Tasa de Falla'!E136","v":132},{"$f":"'[1]Tasa de Falla'!F136","v":65},{"$f":"IF('[1]Tasa de Falla'!IK136=0,\"\",'[1]Tasa de Falla'!IK136)","v":"XXXX"},{"$f":"IF('[1]Tasa de Falla'!IL136=0,\"\",'[1]Tasa de Falla'!IL136)","v":"XXXX"},{"$f":"IF('[1]Tasa de Falla'!IM136=0,\"\",'[1]Tasa de Falla'!IM136)","v":"XXXX"},{"$f":"IF('[1]Tasa de Falla'!IN136=0,\"\",'[1]Tasa de Falla'!IN136)","v":"XXXX"},{"$f":"IF('[1]Tasa de Falla'!IO136=0,\"\",'[1]Tasa de Falla'!IO136)","v":"XXXX"},{"$f":"IF('[1]Tasa de Falla'!IP136=0,\"\",'[1]Tasa de Falla'!IP136)","v":"XXXX"},{"$f":"IF('[1]Tasa de Falla'!IQ136=0,\"\",'[1]Tasa de Falla'!IQ136)","v":"XXXX"},{"$f":"IF('[1]Tasa de Falla'!IR136=0,\"\",'[1]Tasa de Falla'!IR136)","v":"XXXX"},{"$f":"IF('[1]Tasa de Falla'!IS136=0,\"\",'[1]Tasa de Falla'!IS136)","v":"XXXX"},{"$f":"IF('[1]Tasa de Falla'!IT136=0,\"\",'[1]Tasa de Falla'!IT136)","v":"XXXX"},{"$f":"IF('[1]Tasa de Falla'!IU136=0,\"\",'[1]Tasa de Falla'!IU136)","v":"XXXX"},{"$f":"IF('[1]Tasa de Falla'!IV136=0,\"\",'[1]Tasa de Falla'!IV136)","v":"XXXX"}]
[null,null,{"$f":"'[1]Tasa de Falla'!C137","v":120},{"$f":"'[1]Tasa de Falla'!D137","v":"COBOS - SALTA ESTE 132 1"},{"$f":"'[1]Tasa de Falla'!E137","v":132},{"$f":"'[1]Tasa de Falla'!F137","v":45.6},{"$f":"IF('[1]Tasa de Falla'!IK137=0,\"\",'[1]Tasa de Falla'!IK137)","v":"XXXX"},{"$f":"IF('[1]Tasa de Falla'!IL137=0,\"\",'[1]Tasa de Falla'!IL137)","v":"XXXX"},{"$f":"IF('[1]Tasa de Falla'!IM137=0,\"\",'[1]Tasa de Falla'!IM137)","v":"XXXX"},{"$f":"IF('[1]Tasa de Falla'!IN137=0,\"\",'[1]Tasa de Falla'!IN137)","v":"XXXX"},{"$f":"IF('[1]Tasa de Falla'!IO137=0,\"\",'[1]Tasa de Falla'!IO137)","v":"XXXX"},{"$f":"IF('[1]Tasa de Falla'!IP137=0,\"\",'[1]Tasa de Falla'!IP137)","v":"XXXX"},{"$f":"IF('[1]Tasa de Falla'!IQ137=0,\"\",'[1]Tasa de Falla'!IQ137)","v":"XXXX"},{"$f":"IF('[1]Tasa de Falla'!IR137=0,\"\",'[1]Tasa de Falla'!IR137)","v":"XXXX"},{"$f":"IF('[1]Tasa de Falla'!IS137=0,\"\",'[1]Tasa de Falla'!IS137)","v":"XXXX"},{"$f":"IF('[1]Tasa de Falla'!IT137=0,\"\",'[1]Tasa de Falla'!IT137)","v":"XXXX"},{"$f":"IF('[1]Tasa de Falla'!IU137=0,\"\",'[1]Tasa de Falla'!IU137)","v":"XXXX"},{"$f":"IF('[1]Tasa de Falla'!IV137=0,\"\",'[1]Tasa de Falla'!IV137)","v":"XXXX"}]
[null,null,{"$f":"'[1]Tasa de Falla'!C138","v":121},{"$f":"'[1]Tasa de Falla'!D138","v":"SANTIAGO - SANTIAGO SUR "},{"$f":"'[1]Tasa de Falla'!E138","v":132},{"$f":"'[1]Tasa de Falla'!F138","v":8.4},{"$f":"IF('[1]Tasa de Falla'!IK138=0,\"\",'[1]Tasa de Falla'!IK138)","v":"XXXX"},{"$f":"IF('[1]Tasa de Falla'!IL138=0,\"\",'[1]Tasa de Falla'!IL138)","v":"XXXX"},{"$f":"IF('[1]Tasa de Falla'!IM138=0,\"\",'[1]Tasa de Falla'!IM138)","v":"XXXX"},{"$f":"IF('[1]Tasa de Falla'!IN138=0,\"\",'[1]Tasa de Falla'!IN138)","v":"XXXX"},{"$f":"IF('[1]Tasa de Falla'!IO138=0,\"\",'[1]Tasa de Falla'!IO138)","v":"XXXX"},{"$f":"IF('[1]Tasa de Falla'!IP138=0,\"\",'[1]Tasa de Falla'!IP138)","v":"XXXX"},{"$f":"IF('[1]Tasa de Falla'!IQ138=0,\"\",'[1]Tasa de Falla'!IQ138)","v":"XXXX"},{"$f":"IF('[1]Tasa de Falla'!IR138=0,\"\",'[1]Tasa de Falla'!IR138)","v":"XXXX"},{"$f":"IF('[1]Tasa de Falla'!IS138=0,\"\",'[1]Tasa de Falla'!IS138)","v":"XXXX"},{"$f":"IF('[1]Tasa de Falla'!IT138=0,\"\",'[1]Tasa de Falla'!IT138)","v":"XXXX"},{"$f":"IF('[1]Tasa de Falla'!IU138=0,\"\",'[1]Tasa de Falla'!IU138)","v":"XXXX"},{"$f":"IF('[1]Tasa de Falla'!IV138=0,\"\",'[1]Tasa de Falla'!IV138)","v":"XXXX"}]
[null,null,{"$f":"'[1]Tasa de Falla'!C139","v":122},{"$f":"'[1]Tasa de Falla'!D139","v":"SANTIAGO OESTE - SANTIAGO"},{"$f":"'[1]Tasa de Falla'!E139","v":132},{"$f":"'[1]Tasa de Falla'!F139","v":8.4},{"$f":"IF('[1]Tasa de Falla'!IK139=0,\"\",'[1]Tasa de Falla'!IK139)","v":"XXXX"},{"$f":"IF('[1]Tasa de Falla'!IL139=0,\"\",'[1]Tasa de Falla'!IL139)","v":"XXXX"},{"$f":"IF('[1]Tasa de Falla'!IM139=0,\"\",'[1]Tasa de Falla'!IM139)","v":"XXXX"},{"$f":"IF('[1]Tasa de Falla'!IN139=0,\"\",'[1]Tasa de Falla'!IN139)","v":"XXXX"},{"$f":"IF('[1]Tasa de Falla'!IO139=0,\"\",'[1]Tasa de Falla'!IO139)","v":"XXXX"},{"$f":"IF('[1]Tasa de Falla'!IP139=0,\"\",'[1]Tasa de Falla'!IP139)","v":"XXXX"},{"$f":"IF('[1]Tasa de Falla'!IQ139=0,\"\",'[1]Tasa de Falla'!IQ139)","v":"XXXX"},{"$f":"IF('[1]Tasa de Falla'!IR139=0,\"\",'[1]Tasa de Falla'!IR139)","v":"XXXX"},{"$f":"IF('[1]Tasa de Falla'!IS139=0,\"\",'[1]Tasa de Falla'!IS139)","v":"XXXX"},{"$f":"IF('[1]Tasa de Falla'!IT139=0,\"\",'[1]Tasa de Falla'!IT139)","v":"XXXX"},{"$f":"IF('[1]Tasa de Falla'!IU139=0,\"\",'[1]Tasa de Falla'!IU139)","v":"XXXX"},{"$f":"IF('[1]Tasa de Falla'!IV139=0,\"\",'[1]Tasa de Falla'!IV139)","v":"XXXX"}]
[null,null,{"$f":"'[1]Tasa de Falla'!C140","v":123},{"$f":"'[1]Tasa de Falla'!D140","v":"LA BANDA - MISQUI MAYU II - SANTIAGO ESTE II"},{"$f":"'[1]Tasa de Falla'!E140","v":132},{"$f":"'[1]Tasa de Falla'!F140","v":4.92},{"$f":"IF('[1]Tasa de Falla'!IK140=0,\"\",'[1]Tasa de Falla'!IK140)","v":"XXXX"},{"$f":"IF('[1]Tasa de Falla'!IL140=0,\"\",'[1]Tasa de Falla'!IL140)","v":"XXXX"},{"$f":"IF('[1]Tasa de Falla'!IM140=0,\"\",'[1]Tasa de Falla'!IM140)","v":"XXXX"},{"$f":"IF('[1]Tasa de Falla'!IN140=0,\"\",'[1]Tasa de Falla'!IN140)","v":"XXXX"},{"$f":"IF('[1]Tasa de Falla'!IO140=0,\"\",'[1]Tasa de Falla'!IO140)","v":"XXXX"},{"$f":"IF('[1]Tasa de Falla'!IP140=0,\"\",'[1]Tasa de Falla'!IP140)","v":"XXXX"},{"$f":"IF('[1]Tasa de Falla'!IQ140=0,\"\",'[1]Tasa de Falla'!IQ140)","v":"XXXX"},{"$f":"IF('[1]Tasa de Falla'!IR140=0,\"\",'[1]Tasa de Falla'!IR140)","v":"XXXX"},{"$f":"IF('[1]Tasa de Falla'!IS140=0,\"\",'[1]Tasa de Falla'!IS140)","v":"XXXX"},{"$f":"IF('[1]Tasa de Falla'!IT140=0,\"\",'[1]Tasa de Falla'!IT140)","v":"XXXX"},{"$f":"IF('[1]Tasa de Falla'!IU140=0,\"\",'[1]Tasa de Falla'!IU140)","v":"XXXX"},{"$f":"IF('[1]Tasa de Falla'!IV140=0,\"\",'[1]Tasa de Falla'!IV140)","v":"XXXX"}]
[null,null,null,null,null,null,{"$f":"IF('[1]Tasa de Falla'!IK141=0,\"\",'[1]Tasa de Falla'!IK141)","v":""},{"$f":"IF('[1]Tasa de Falla'!IL141=0,\"\",'[1]Tasa de Falla'!IL141)","v":""},{"$f":"IF('[1]Tasa de Falla'!IM141=0,\"\",'[1]Tasa de Falla'!IM141)","v":""},{"$f":"IF('[1]Tasa de Falla'!IN141=0,\"\",'[1]Tasa de Falla'!IN141)","v":""},{"$f":"IF('[1]Tasa de Falla'!IO141=0,\"\",'[1]Tasa de Falla'!IO141)","v":""},{"$f":"IF('[1]Tasa de Falla'!IP141=0,\"\",'[1]Tasa de Falla'!IP141)","v":""},{"$f":"IF('[1]Tasa de Falla'!IQ141=0,\"\",'[1]Tasa de Falla'!IQ141)","v":""},{"$f":"IF('[1]Tasa de Falla'!IR141=0,\"\",'[1]Tasa de Falla'!IR141)","v":""},{"$f":"IF('[1]Tasa de Falla'!IS141=0,\"\",'[1]Tasa de Falla'!IS141)","v":""},{"$f":"IF('[1]Tasa de Falla'!IT141=0,\"\",'[1]Tasa de Falla'!IT141)","v":""},{"$f":"IF('[1]Tasa de Falla'!IU141=0,\"\",'[1]Tasa de Falla'!IU141)","v":""},{"$f":"IF('[1]Tasa de Falla'!IV141=0,\"\",'[1]Tasa de Falla'!IV141)","v":""}]
[null,null,null,null,"Longitud Total    ",{"$f":"SUM(F16:F141)-F19-F21-F22-F23-F26-F27-F37-F39-F40-F41-F43-F44-F47-F48-F49-F53-F60-F61-F65-F76-F80-F93-F94-F99-F109-F131-F132-F133-F134","v":5053.470000000003}]
[null,null,null,null,null,"Indisponibilidades Forzadas  ",{"$f":"SUM(G17:G141)","v":13},4,17,2,6,3,5,17,10,19,12,14]
[null,null,null,null,null,"TASA DE FALLA  ",{"$f":"+'[1]Tasa de Falla'!IK151","v":4.1900000000000004},{"$f":"+'[1]Tasa de Falla'!IL151","v":4.33},{"$f":"+'[1]Tasa de Falla'!IM151","v":4.37},{"$f":"+'[1]Tasa de Falla'!IN151","v":4.6500000000000004},{"$f":"+'[1]Tasa de Falla'!IO151","v":4.6500000000000004},{"$f":"+'[1]Tasa de Falla'!IP151","v":3.87},{"$f":"+'[1]Tasa de Falla'!IQ151","v":3.45},{"$f":"+'[1]Tasa de Falla'!IR151","v":3.26},{"$f":"+'[1]Tasa de Falla'!IS151","v":3.35},{"$f":"+'[1]Tasa de Falla'!IT151","v":2.96},{"$f":"+'[1]Tasa de Falla'!IU151","v":2.64},{"$f":"+'[1]Tasa de Falla'!IV151","v":2.37},{"$f":"+'[1]Tasa de Falla'!IW151","v":2.4500000000000002}]
[]
[null,null,"XXX","  Línea no computada en el mes",null,null,null,null,null,"TASA DE FALLA",null,null,{"$f":"S144","v":2.4500000000000002},"SALIDAS x AÑO / 100 km"]

{"sheet":"DATO","index":13,"n_rows":25,"n_cols":29,"rows_kept":25,"cut":false,"hidden":false,"merged":[]}
["Mes","Mes","Dia","Año"]
["enero","01",31,2006]
["febrero","02",{"$f":"IF(MOD(E14,4)=0,29,28)","v":28},{"$f":"+D2+1","v":2007}]
["marzo","03",31,2008]
["abril","04",30,2009]
["mayo","05",31,2010]
["junio","06",30,2011]
["julio","07",31,2012]
["agosto","08",31,2013]
["septiembre","09",30,2014]
["octubre","10",31,2015]
["noviembre","11",30]
["diciembre","12",31,null,null,null,null,null,"Total"]
[10,4,{"$f":"CELL(\"CONTENIDO\",OFFSET(A1,B14,0))","v":"abril"},{"$f":"CELL(\"CONTENIDO\",OFFSET(C1,B14,0))","v":30},{"$f":"CELL(\"CONTENIDO\",OFFSET(D1,A14,0))","v":2015},{"$f":"\"Desde el 01 al \" & D14 & \" de \" & C14 & \" de \" & E14","v":"Desde el 01 al 30 de abril de 2015"},{"$f":"CELL(\"CONTENIDO\",OFFSET(B1,B14,0))","v":"04"},{"$f":"RIGHT(E14,2)","v":"15"},"B14"]
[null,{"$f":"\"\\\\rugor\\files\\Transporte\\Transporte\\AA PROCESO AUT ARCHIVOS J\\TRANSNOA\\\" &E14","v":"\\\\rugor\\files\\Transporte\\Transporte\\AA PROCESO AUT ARCHIVOS J\\TRANSNOA\\2015"},null,null,null,null,{"$f":"\"J\"&G14&H14&\"NOA\"","v":"J0415NOA"}]
[null,{"$f":"\"\\\\rugor\\files\\Transporte\\transporte\\AA PROCESO AUT\\INTERCAMBIO\\\" &H14&G14","v":"\\\\rugor\\files\\Transporte\\transporte\\AA PROCESO AUT\\INTERCAMBIO\\1504"}]
["Hoja","FilaInicio","FilasPlantilla","Columnas","NombreHoja","OrigenDeDatos","Col00","Col01","Col02","Col03","Col04","Col05","Col06","Col07","Col08","Col09","Col10","Col11","Col12","Col13","Col14","Col15","FILHTOTAL","COLHTOTAL","FILHCALC","COLHCALC","FILTRANSP","COLTRANSP","COL TSAL"]
["MODELO L",21,20,11,{"$f":"\"LI-\" & $G$14","v":"LI-04"},"TRANSNOA_INDISPONIBILIDADES_LINEAS_TRANSNOA.XLS",3,5,4,6,7,8,0,10,11,14,0,26,0,0,0,0,19,10,42,27,19,27,14]
["MODELO T",24,20,13,{"$f":"\"T-\" & $G$14","v":"T-04"},"TRANSNOA_INDISPONIBILIDADES_TRAFOS_TRANSNOA.XLS",3,5,4,6,7,8,9,11,12,15,16,18,28,17,0,0,25,10,45,29,22,29,15]
["MODELO S",23,20,10,{"$f":"\"SA-\" & $G$14","v":"SA-04"},"TRANSNOA_INDISPONIBILIDADES_SALIDAS_TRANSNOA.XLS",3,5,4,6,7,8,10,11,14,15,21,0,0,0,0,0,29,10,44,22,21,22,14]
["MODELO L RIOJA",21,20,11,{"$f":"\"LI-RIOJA-\" & $G$14","v":"LI-RIOJA-04"},"TRANSNOA_INDISPONIBILIDADES_LINEAS_RIOJA.XLS",3,5,4,6,7,8,0,10,11,14,2,26,0,0,0,0,21,10,42,27,19,27,14]
["MODELO L EDESA",21,20,11,{"$f":"\"LI-EDESA-\" & $G$14","v":"LI-EDESA-04"},"TRANSNOA_INDISPONIBILIDADES_LINEAS_EDESA.XLS",3,5,4,6,7,8,0,10,11,14,2,26,0,0,0,0,20,10,42,27,19,27,14]
["MODELO T EDESA",24,20,13,{"$f":"\"T-EDESA-\" & $G$14","v":"T-EDESA-04"},"TRANSNOA_INDISPONIBILIDADES_TRAFOS_EDESA.XLS",3,5,4,6,7,8,9,11,12,15,16,18,28,17,0,0,26,10,45,29,22,29,15]
["MODELO S EDESA",23,20,10,{"$f":"\"SA-EDESA-\" & $G$14","v":"SA-EDESA-04"},"TRANSNOA_INDISPONIBILIDADES_SALIDAS_EDESA.XLS",3,5,4,6,7,8,10,11,14,15,21,0,0,0,0,0,30,10,44,22,21,22,14]
["MODELO VST",19,24,4,{"$f":"\"CAUSAS-VST-\" & $G$14","v":"CAUSAS-VST-04"},"TRANSNOA_CAUSAS_VST.XLS",3,4,5,6,7,0,0,0,0,0,0,0,0,0,0,0,999,999,0,0,0,0,0]