{"text_format":"1","workbook":"xlsx","n_sheets":8,"sheets":["TOT-0516","LI-05 (1)","LI-DPEC-05 (1)","T-05 (1)","T-05 (2)","SA-05 (1)","SUP-DPEC","DATO"],"not_rendered":{"charts":0,"images":2,"macros":1,"external_links":2,"defined_names":25,"comments":0,"pivot_tables":0},"unopened":[],"bounds":{"document_bytes":16777216,"sheet_cells":100000,"rows_first":2000,"rows_last":500,"rows_between":2000,"halvings":0,"cell_chars":16384,"cell_head_chars":4096},"cells_cut":0,"cells_raw":0,"read":"whole","date_system":"1900"}

{"sheet":"TOT-0516","index":0,"n_rows":35,"n_cols":9,"rows_kept":35,"cut":false,"hidden":false,"merged":[]}
[]
[null,"ANEXO V al Memorandum D.T.E.E. N°  294  / 2017"]
[]
["ENTE NACIONAL REGULADOR "]
["DE LA ELECTRICIDAD"]
[]
[null,"SISTEMA DE TRANSPORTE DE ENERGÍA ELÉCTRICA POR DISTRIBUCIÓN TRONCAL"]
[]
[null,"TRANSNEA S.A."]
[]
[null,"TOTAL DE PENALIZACIONES"]
[]
[null,2]
[null,"Desde el 01 al 31 de mayo de 2016"]
[]
[null,"Sanciones duplicadas por tasa de falla > 4 Sal. x año/100km."]
[]
[null,null,"1.-","LÍNEAS"]
[]
[null,null,null,"1.1.-","Equipamiento propio",null,null,null,{"$f":"'LI-05 (1)'!AA43","v":565745.86}]
[null,null,null,"1.2.-","Transportista Independiente D.P.E.C.",null,null,null,{"$f":"'LI-DPEC-05 (1)'!AA44","v":46672.85}]
[]
[null,null,"2.-","CONEXIÓN"]
[]
[null,null,null,"2.1.-","Transformación"]
[null,null,null,null,"2.1.1.-","Equipamiento propio",null,null,{"$f":"+'T-05 (2)'!AC43","v":13803.99}]
[null,null,null,"2.2.-","Salidas"]
[null,null,null,null,"2.2.1.-","Equipamiento propio",null,null,{"$f":"'SA-05 (1)'!V43","v":1690.68}]
[]
[null,null,"3.-","SUPERVISIÓN"]
[]
[null,null,null,"3.1.-","Transportista Independiente D.P.E.C.",null,null,null,{"$f":"'SUP-DPEC'!I66","v":8905.4026181999998}]
[]
[]
[null,null,null,null,null,"TOTAL ",{"$f":"SUM(I20:I32)","v":636818.78261820006}]

{"sheet":"LI-05 (1)","index":1,"n_rows":43,"n_cols":27,"rows_kept":43,"cut":false,"hidden":false,"merged":[]}
[]
[null,{"$f":"+'TOT-0516'!B2","v":"ANEXO V al Memorandum D.T.E.E. N°  294  / 2017"}]
[]
[" ENTE NACIONAL REGULADOR "]
["       DE LA ELECTRICIDAD"]
[]
[]
[null,null,null,null,null,"SISTEMA DE TRANSPORTE DE ENERGÍA ELÉCTRICA POR DISTRIBUCIÓN TRONCAL - TRANSNEA S.A."]
[]
[null,null,null,null,null,"1.- LÍNEAS"]
[]
[null,null,null,null,null,"1.1.- Líneas propias"]
[]
[null,{"$f":"+'TOT-0516'!B14","v":"Desde el 01 al 31 de mayo de 2016"}]
[]
[null,null,null,null,null,"$/100 km-h : LÍNEAS 220 kV ",360.92500000000001]
[null,null,null,null,null,"$/100 km-h : LÍNEAS 132 kV ",345.49299999999999,null,null,null,"FACTOR DE PENALIZACIÓN K =",{"$f":"30*'TOT-0516'!B13","v":60},{"$f":"IF(L17=30,\" \",IF(L17=60,\"Coeficiente duplicado por tasa de falla >4 Sal. x año/100 km.\",\"REVISAR COEFICIENTE\"))","v":"Coeficiente duplicado por tasa de falla >4 Sal. x año/100 km."}]
[null,null,null,null,null,"$/100 km-h : LÍNEAS 33 kV ",345.49299999999999]
[null,null,3,4,5,6,7,8,9,10,11,12,13,14,15,16,17,18,19,20,21,22,23,24,25,26,27]
[null,null,"N°","INDISP","ID EQUIPO","LÍNEAS","U\n[kV]","Long.\n[km]","$/h","Salida","Entrada","Hs.\nIndisp. ","Minutos\nIndisp.","Tipo \nSal.(²)","C.R.\n%","PENALIZAC.\nPROGRAM.","REDUCC.\nPROGRAM.","PENALIZACIÓN FORZADA\nPor Salida    1ras. 3 hs.  hs. Restantes",null,null,"REDUCC. FORZADA\nPor Salida    1ras. 3 hs.  hs. Restantes",null,null,"RESTANTE\nFORZADA","REDUCC.\nRESTANTE","Informó\nenTérm.","TOTAL\nPENALIZAC."]
[]
[]
[null,null,1,261606,748,"STA. CATALINA - RESISTENCIA",132,42,{"$f":"IF(H23>25,H23,25)*IF(G23=220,$G$16,IF(G23=132,$G$17,$G$18))/100","v":145.10705999999999},"2016-05-01","2016-05-31T23:59:59",{"$f":"IF(F23=\"\",\"\",(K23-J23)*24)","v":743.99972222215729},{"$f":"IF(F23=\"\",\"\",ROUND((K23-J23)*24*60,0))","v":44640},"P",{"$f":"IF(F23=\"\",\"\",\"--\")","v":"--"},{"$f":"IF(N23=\"P\",ROUND(M23/60,2)*I23*$L$17*0.01,\"--\")","v":64775.791583999991},{"$f":"IF(N23=\"RP\",ROUND(M23/60,2)*I23*$L$17*0.01*O23/100,\"--\")","v":"--"},{"$f":"IF(N23=\"F\",I23*$L$17,\"--\")","v":"--"},{"$f":"IF(AND(M23>10,N23=\"F\"),I23*$L$17*IF(M23>180,3,ROUND(M23/60,2)),\"--\")","v":"--"},{"$f":"IF(AND(N23=\"F\",M23>180),(ROUND(M23/60,2)-3)*I23*$L$17*0.1,\"--\")","v":"--"},{"$f":"IF(N23=\"R\",I23*$L$17*O23/100,\"--\")","v":"--"},{"$f":"IF(AND(M23>10,N23=\"R\"),I23*$L$17*O23/100*IF(M23>180,3,ROUND(M23/60,2)),\"--\")","v":"--"},{"$f":"IF(AND(N23=\"R\",M23>180),(ROUND(M23/60,2)-3)*I23*$L$17*0.1*O23/100,\"--\")","v":"--"},{"$f":"IF(N23=\"RF\",ROUND(M23/60,2)*I23*$L$17*0.1,\"--\")","v":"--"},{"$f":"IF(N23=\"RR\",ROUND(M23/60,2)*I23*$L$17*0.1*O23/100,\"--\")","v":"--"},"SI",{"$f":"IF(F23=\"\",\"\",SUM(P23:Y23)*IF(Z23=\"SI\",1,2))","v":64775.791583999991}]
[null,null,2,291181,946,"PASO DE LOS LIBRES - URUGUAYANA",132,3.9000000953674316,{"$f":"IF(H24>25,H24,25)*IF(G24=220,$G$16,IF(G24=132,$G$17,$G$18))/100","v":86.373250000000013},"2016-05-01","2016-05-31T23:59:59",{"$f":"IF(F24=\"\",\"\",(K24-J24)*24)","v":743.99972222215729},{"$f":"IF(F24=\"\",\"\",ROUND((K24-J24)*24*60,0))","v":44640},"RF",{"$f":"IF(F24=\"\",\"\",\"--\")","v":"--"},{"$f":"IF(N24=\"P\",ROUND(M24/60,2)*I24*$L$17*0.01,\"--\")","v":"--"},{"$f":"IF(N24=\"RP\",ROUND(M24/60,2)*I24*$L$17*0.01*O24/100,\"--\")","v":"--"},{"$f":"IF(N24=\"F\",I24*$L$17,\"--\")","v":"--"},{"$f":"IF(AND(M24>10,N24=\"F\"),I24*$L$17*IF(M24>180,3,ROUND(M24/60,2)),\"--\")","v":"--"},{"$f":"IF(AND(N24=\"F\",M24>180),(ROUND(M24/60,2)-3)*I24*$L$17*0.1,\"--\")","v":"--"},{"$f":"IF(N24=\"R\",I24*$L$17*O24/100,\"--\")","v":"--"},{"$f":"IF(AND(M24>10,N24=\"R\"),I24*$L$17*O24/100*IF(M24>180,3,ROUND(M24/60,2)),\"--\")","v":"--"},{"$f":"IF(AND(N24=\"R\",M24>180),(ROUND(M24/60,2)-3)*I24*$L$17*0.1*O24/100,\"--\")","v":"--"},{"$f":"IF(N24=\"RF\",ROUND(M24/60,2)*I24*$L$17*0.1,\"--\")","v":385570.18800000008},{"$f":"IF(N24=\"RR\",ROUND(M24/60,2)*I24*$L$17*0.1*O24/100,\"--\")","v":"--"},"SI",{"$f":"IF(F24=\"\",\"\",SUM(P24:Y24)*IF(Z24=\"SI\",1,2))","v":385570.18800000008}]
[null,null,3,302281,743,"SALTO GRANDE - CHAJARÍ",132,60.9,210.40523699999997,"2016-05-04T08:18:00","2016-05-08T13:48:00",101.49999999994179,6090,"P","--",12813.6789333,"--","--","--","--","--","--","--","--","--","SI",12813.6789333]
[null,null,4,302284,5557,"MANSILLA - RESISTENCIA 132 1",132,109.5,378.31483500000002,"2016-05-06T09:22:00","2016-05-06T09:37:00",0.24999999994179234,15,"F","--","--","--",22698.890100000001,5674.7225250000001,"--","--","--","--","--","--","SI",28373.612625000002]
[null,null,5,302568,5047,"GRAN FORMOSA - CLORINDA   1",132,103.5,357.58525499999996,"2016-05-10T08:55:00","2016-05-10T09:00:00",8.3333333255723119E-2,5,"F","--","--","--",21455.115299999998,"--","--","--","--","--","--","--","SI",21455.115299999998]
[null,null,"6/7","302619/302591",5394,"STA. CATALINA - COLONIA BRUGNE - B. VISTA",132,121,418.04652999999996,"2016-05-14T13:06:00","2016-05-14T13:13:00",0.11666666669771075,7,"F","--","--","--",25082.791799999999,"--","--","--","--","--","--","--","SI",25082.791799999999]
[]
[null,null,"8/9","302620/302602",5394,"STA. CATALINA - COLONIA BRUGNE - B. VISTA",132,121,418.04652999999996,"2016-05-15T10:35:00","2016-05-15T10:43:00",0.13333333341870457,8,"F",{"$f":"IF(F30=\"\",\"\",\"--\")","v":"--"},{"$f":"IF(N30=\"P\",ROUND(M30/60,2)*I30*$L$17*0.01,\"--\")","v":"--"},{"$f":"IF(N30=\"RP\",ROUND(M30/60,2)*I30*$L$17*0.01*O30/100,\"--\")","v":"--"},{"$f":"IF(N30=\"F\",I30*$L$17,\"--\")","v":25082.791799999999},{"$f":"IF(AND(M30>10,N30=\"F\"),I30*$L$17*IF(M30>180,3,ROUND(M30/60,2)),\"--\")","v":"--"},{"$f":"IF(AND(N30=\"F\",M30>180),(ROUND(M30/60,2)-3)*I30*$L$17*0.1,\"--\")","v":"--"},{"$f":"IF(N30=\"R\",I30*$L$17*O30/100,\"--\")","v":"--"},{"$f":"IF(AND(M30>10,N30=\"R\"),I30*$L$17*O30/100*IF(M30>180,3,ROUND(M30/60,2)),\"--\")","v":"--"},{"$f":"IF(AND(N30=\"R\",M30>180),(ROUND(M30/60,2)-3)*I30*$L$17*0.1*O30/100,\"--\")","v":"--"},{"$f":"IF(N30=\"RF\",ROUND(M30/60,2)*I30*$L$17*0.1,\"--\")","v":"--"},{"$f":"IF(N30=\"RR\",ROUND(M30/60,2)*I30*$L$17*0.1*O30/100,\"--\")","v":"--"},{"$f":"IF(F30=\"\",\"\",\"SI\")","v":"SI"},25082.791799999999]
[]
[null,null,10,302893,4317,"PIRANE - IBARRETA 132 1",132,91.8,317.16257400000001,"2016-05-18T07:33:00","2016-05-18T12:09:00",4.5999999999767169,276,"P","--",875.36870423999994,"--","--","--","--","--","--","--","--","--","SI",875.36870423999994]
[null,null,11,302894,5394,"STA. CATALINA - COLONIA BRUGNE - B. VISTA",132,121,418.04652999999996,"2016-05-18T13:31:00","2016-05-18T15:38:00",2.1166666665812954,127,"P","--",531.75518615999999,"--","--","--","--","--","--","--","--","--","SI",531.75518615999999]
[null,null,12,302895,4317,"PIRANE - IBARRETA 132 1",132,91.8,317.16257400000001,"2016-05-19T07:21:00","2016-05-19T11:22:00",4.0166666666627862,241,"P","--",764.99612848799995,"--","--","--","--","--","--","--","--","--","SI",764.99612848799995]
[null,null,13,302908,1002,"BARRANQUERAS - CORRIENTES    1      CA",33,3.8,86.373250000000013,"2016-05-19T08:45:00","2016-05-19T11:48:00",3.0499999999883585,183,"P","--",158.06304750000001,"--","--","--","--","--","--","--","--","--","SI",158.06304750000001]
[null,null,14,302909,1003,"BARRANQUERAS - CORRIENTES    2      CA",33,3.8,86.373250000000013,"2016-05-19T08:45:00","2016-05-19T11:48:00",3.0499999999883585,183,"P","--",158.06304750000001,"--","--","--","--","--","--","--","--","--",{"$f":"IF(F36=\"\",\"\",\"SI\")","v":"SI"},158.06304750000001]
[null,null,15,302912,741,"CORRIENTES - SANTA CATALINA",132,10.199999999999999,86.373250000000013,"2016-05-22T07:50:00","2016-05-22T09:50:00",1.9999999998835847,120,"P","--",103.64790000000001,"--","--","--","--","--","--","--","--","--","SI",103.64790000000001]
[null,null,null,null,null,null,null,null,86.373250000000013,null,null,"","",null,"","--","--","--","--","--","--","--","--","--","--","",""]
[null,null,null,null,null,null,null,null,86.373250000000013,null,null,"","",null,"","--","--","--","--","--","--","--","--","--","--","",""]
[null,null,null,null,null,null,null,null,{"$f":"IF(H40>25,H40,25)*IF(G40=220,$G$16,IF(G40=132,$G$17,$G$18))/100","v":86.373250000000013},null,null,{"$f":"IF(F40=\"\",\"\",(K40-J40)*24)","v":""},{"$f":"IF(F40=\"\",\"\",ROUND((K40-J40)*24*60,0))","v":""},null,{"$f":"IF(F40=\"\",\"\",\"--\")","v":""},{"$f":"IF(N40=\"P\",ROUND(M40/60,2)*I40*$L$17*0.01,\"--\")","v":"--"},{"$f":"IF(N40=\"RP\",ROUND(M40/60,2)*I40*$L$17*0.01*O40/100,\"--\")","v":"--"},{"$f":"IF(N40=\"F\",I40*$L$17,\"--\")","v":"--"},{"$f":"IF(AND(M40>10,N40=\"F\"),I40*$L$17*IF(M40>180,3,ROUND(M40/60,2)),\"--\")","v":"--"},{"$f":"IF(AND(N40=\"F\",M40>180),(ROUND(M40/60,2)-3)*I40*$L$17*0.1,\"--\")","v":"--"},{"$f":"IF(N40=\"R\",I40*$L$17*O40/100,\"--\")","v":"--"},{"$f":"IF(AND(M40>10,N40=\"R\"),I40*$L$17*O40/100*IF(M40>180,3,ROUND(M40/60,2)),\"--\")","v":"--"},{"$f":"IF(AND(N40=\"R\",M40>180),(ROUND(M40/60,2)-3)*I40*$L$17*0.1*O40/100,\"--\")","v":"--"},{"$f":"IF(N40=\"RF\",ROUND(M40/60,2)*I40*$L$17*0.1,\"--\")","v":"--"},{"$f":"IF(N40=\"RR\",ROUND(M40/60,2)*I40*$L$17*0.1*O40/100,\"--\")","v":"--"},{"$f":"IF(F40=\"\",\"\",\"SI\")","v":""},""]
[null,null,null,null,null,null,null,null,{"$f":"IF(H41>25,H41,25)*IF(G41=220,$G$16,IF(G41=132,$G$17,$G$18))/100","v":86.373250000000013},null,null,{"$f":"IF(F41=\"\",\"\",(K41-J41)*24)","v":""},{"$f":"IF(F41=\"\",\"\",ROUND((K41-J41)*24*60,0))","v":""},null,{"$f":"IF(F41=\"\",\"\",\"--\")","v":""},{"$f":"IF(N41=\"P\",ROUND(M41/60,2)*I41*$L$17*0.01,\"--\")","v":"--"},{"$f":"IF(N41=\"RP\",ROUND(M41/60,2)*I41*$L$17*0.01*O41/100,\"--\")","v":"--"},{"$f":"IF(N41=\"F\",I41*$L$17,\"--\")","v":"--"},{"$f":"IF(AND(M41>10,N41=\"F\"),I41*$L$17*IF(M41>180,3,ROUND(M41/60,2)),\"--\")","v":"--"},{"$f":"IF(AND(N41=\"F\",M41>180),(ROUND(M41/60,2)-3)*I41*$L$17*0.1,\"--\")","v":"--"},{"$f":"IF(N41=\"R\",I41*$L$17*O41/100,\"--\")","v":"--"},{"$f":"IF(AND(M41>10,N41=\"R\"),I41*$L$17*O41/100*IF(M41>180,3,ROUND(M41/60,2)),\"--\")","v":"--"},{"$f":"IF(AND(N41=\"R\",M41>180),(ROUND(M41/60,2)-3)*I41*$L$17*0.1*O41/100,\"--\")","v":"--"},{"$f":"IF(N41=\"RF\",ROUND(M41/60,2)*I41*$L$17*0.1,\"--\")","v":"--"},{"$f":"IF(N41=\"RR\",ROUND(M41/60,2)*I41*$L$17*0.1*O41/100,\"--\")","v":"--"},{"$f":"IF(F41=\"\",\"\",\"SI\")","v":""},""]
[]
[null,null,"(²)","P - PROGRAMADA  ; F - FORZADA  ; RF - RESTANTE FORZADA",null,null,null,null,null,null,null,null,null,null,null,{"$f":"SUM(P21:P42)","v":80181.364531187995},{"$f":"SUM(Q21:Q42)","v":0},{"$f":"SUM(R21:R42)","v":94319.589000000007},5674.7225250000001,0,0,0,0,385570.18800000008,0,null,{"$f":"ROUND(SUM(AA21:AA42),2)","v":565745.86}]

{"sheet":"LI-DPEC-05 (1)","index":2,"n_rows":44,"n_cols":27,"rows_kept":44,"cut":false,"hidden":false,"merged":[]}
[]
[null,{"$f":"'TOT-0516'!B2","v":"ANEXO V al Memorandum D.T.E.E. N°  294  / 2017"}]
[]
[" ENTE NACIONAL REGULADOR "]
["       DE LA ELECTRICIDAD"]
[]
[]
[null,null,null,null,null,"SISTEMA DE TRANSPORTE DE ENERGÍA ELÉCTRICA POR DISTRIBUCIÓN TRONCAL - TRANSNEA S.A."]
[]
[null,null,null,null,null,"1.2.-Transportista Independiente - Dirección Provincial de Energía de Corrientes (D.P.E.C.)"]
[]
[null,{"$f":"'TOT-0516'!B14","v":"Desde el 01 al 31 de mayo de 2016"}]
[]
[]
[null,null,null,null,null,"$/100 km-h : LÍNEAS 220 kV "," - "]
[null,null,null,null,null,"$/100 km-h : LÍNEAS 132 kV ",145.14699999999999,null,null,null,"FACTOR DE PENALIZACIÓN K =",{"$f":"30*'TOT-0516'!B13","v":60},{"$f":"IF(L16=30,\" \",IF(L16=60,\"Coeficiente duplicado por tasa de falla >4 Sal. x año/100 km.\",\"REVISAR COEFICIENTE\"))","v":"Coeficiente duplicado por tasa de falla >4 Sal. x año/100 km."}]
[null,null,null,null,null,"$/100 km-h : LÍNEAS 66 kV "," - "]
[]
[null,null,3,4,5,6,7,8,9,10,11,12,13,14,15,16,17,18,19,20,21,22,23,24,25,26,27]
[null,null,"N°","INDISP","ID EQUIPO","LÍNEAS","U\n[kV]","Long.\n[km]","$/h","Salida","Entrada","Hs.\nIndisp. ","Minutos\nIndisp.","Tipo \nSal.(²)","C.R.\n%","PENALIZAC.\nPROGRAM.","REDUCC.\nPROGRAM.","PENALIZACIÓN FORZADA\nPor Salida    1ras. 3 hs.  hs. Restantes",null,null,"REDUCC. FORZADA\nPor Salida    1ras. 3 hs.  hs. Restantes",null,null,"RESTANTE\nFORZADA","REDUCC.\nRESTANTE","Informó\nenTérm.","TOTAL\nPENALIZAC."]
[]
[]
[null,null,46,302268,1001,"PASO DE LOS LIBRES - MONTE CASEROS",132,101,{"$f":"IF(H23>25,H23,25)*IF(G23=220,$G$15,IF(G23=132,$G$16,$G$17))/100","v":146.59846999999999},"2016-05-02T06:23:00","2016-05-02T08:15:00",{"$f":"IF(F23=\"\",\"\",(K23-J23)*24)","v":1.8666666666395031},{"$f":"IF(F23=\"\",\"\",ROUND((K23-J23)*24*60,0))","v":112},"F",{"$f":"IF(F23=\"\",\"\",\"--\")","v":"--"},{"$f":"IF(N23=\"P\",ROUND(M23/60,2)*I23*$L$16*0.01,\"--\")","v":"--"},{"$f":"IF(N23=\"RP\",ROUND(M23/60,2)*I23*$L$16*0.01*O23/100,\"--\")","v":"--"},{"$f":"IF(N23=\"F\",I23*$L$16,\"--\")","v":8795.9081999999999},{"$f":"IF(AND(M23>10,N23=\"F\"),I23*$L$16*IF(M23>180,3,ROUND(M23/60,2)),\"--\")","v":16448.348334000002},{"$f":"IF(AND(N23=\"F\",M23>180),(ROUND(M23/60,2)-3)*I23*$L$16*0.1,\"--\")","v":"--"},{"$f":"IF(N23=\"R\",I23*$L$16*O23/100,\"--\")","v":"--"},{"$f":"IF(AND(M23>10,N23=\"R\"),I23*$L$16*O23/100*IF(M23>180,3,ROUND(M23/60,2)),\"--\")","v":"--"},{"$f":"IF(AND(N23=\"R\",M23>180),(ROUND(M23/60,2)-3)*I23*$L$16*0.1*O23/100,\"--\")","v":"--"},{"$f":"IF(N23=\"RF\",ROUND(M23/60,2)*I23*$L$16*0.1,\"--\")","v":"--"},{"$f":"IF(N23=\"RR\",ROUND(M23/60,2)*I23*$L$16*0.1*O23/100,\"--\")","v":"--"},{"$f":"IF(F23=\"\",\"\",\"SI\")","v":"SI"},{"$f":"IF(F23=\"\",\"\",SUM(P23:Y23)*IF(Z23=\"SI\",1,2))","v":25244.256534}]
[null,null,47,302285,1001,"PASO DE LOS LIBRES - MONTE CASEROS",132,101,{"$f":"IF(H24>25,H24,25)*IF(G24=220,$G$15,IF(G24=132,$G$16,$G$17))/100","v":146.59846999999999},"2016-05-08T07:52:00","2016-05-08T08:15:00",0.38333333336049691,{"$f":"IF(F24=\"\",\"\",ROUND((K24-J24)*24*60,0))","v":23},"F","--","--","--",{"$f":"IF(N24=\"F\",I24*$L$16,\"--\")","v":8795.9081999999999},3342.4451159999999,"--","--","--","--",{"$f":"IF(N24=\"RF\",ROUND(M24/60,2)*I24*$L$16*0.1,\"--\")","v":"--"},{"$f":"IF(N24=\"RR\",ROUND(M24/60,2)*I24*$L$16*0.1*O24/100,\"--\")","v":"--"},"SI",{"$f":"IF(F24=\"\",\"\",SUM(P24:Y24)*IF(Z24=\"SI\",1,2))","v":12138.353316000001}]
[null,null,48,302567,1001,"PASO DE LOS LIBRES - MONTE CASEROS",132,101,146.59846999999999,"2016-05-10T08:02:00","2016-05-10T17:50:00",9.7999999999883585,588,"P","--",861.99900360000004,"--","--","--","--","--","--","--","--","--","SI",861.99900360000004]
[null,null,49,302587,1001,"PASO DE LOS LIBRES - MONTE CASEROS",132,101,146.59846999999999,"2016-05-11T07:54:00","2016-05-11T17:55:00",10.016666666662786,601,"P","--",881.35000163999985,"--","--","--","--","--","--","--","--","--","SI",881.35000163999985]
[null,null,50,302588,1001,"PASO DE LOS LIBRES - MONTE CASEROS",132,101,146.59846999999999,"2016-05-12T08:10:00","2016-05-12T20:19:00",12.149999999965075,729,"P","--",1068.7028462999999,"--","--","--","--","--","--","--","--","--","SI",1068.7028462999999]
[null,null,51,302589,1001,"PASO DE LOS LIBRES - MONTE CASEROS",132,101,146.59846999999999,"2016-05-13T07:42:00","2016-05-13T17:26:00",9.7333333334536292,584,"P","--",855.84186785999998,"--","--","--","--","--","--","--","--","--","SI",855.84186785999998]
[null,null,52,302590,1001,"PASO DE LOS LIBRES - MONTE CASEROS",132,101,146.59846999999999,"2016-05-14T08:09:00","2016-05-14T17:58:00",9.8166666667093523,589,"P","--",863.75818523999999,"--","--","--","--","--","--","--","--","--","SI",863.75818523999999]
[null,null,53,302896,1001,"PASO DE LOS LIBRES - MONTE CASEROS",132,101,146.59846999999999,"2016-05-19T07:05:00","2016-05-21T13:11:00",54.099999999976717,3246,"P","--",4758.5863362,"--","--","--","--","--","--","--","--","--","SI",4758.5863362]
[null,null,null,null,null,null,null,null,{"$error":"#VALUE!"},null,null,"","",null,"","--","--","--","--","--","--","--","--","--","--","",""]
[null,null,null,null,null,null,null,null,{"$error":"#VALUE!"},null,null,"","",null,"","--","--","--","--","--","--","--","--","--","--","",""]
[null,null,null,null,null,null,null,null,{"$error":"#VALUE!"},null,null,"","",null,"","--","--","--","--","--","--","--","--","--","--","",""]
[null,null,null,null,null,null,null,null,{"$error":"#VALUE!"},null,null,"","",null,"","--","--","--","--","--","--","--","--","--","--","",""]
[null,null,null,null,null,null,null,null,{"$error":"#VALUE!"},null,null,"","",null,"","--","--","--","--","--","--","--","--","--","--","",""]
[null,null,null,null,null,null,null,null,{"$error":"#VALUE!"},null,null,"","",null,"","--","--","--","--","--","--","--","--","--","--","",""]
[null,null,null,null,null,null,null,null,{"$error":"#VALUE!"},null,null,"","",null,"","--","--","--","--","--","--","--","--","--","--","",""]
[null,null,null,null,null,null,null,null,{"$error":"#VALUE!"},null,null,"","",null,"","--","--","--","--","--","--","--","--","--","--","",""]
[null,null,null,null,null,null,null,null,{"$error":"#VALUE!"},null,null,"","",null,"","--","--","--","--","--","--","--","--","--","--","",""]
[null,null,null,null,null,null,null,null,{"$f":"IF(H40>25,H40,25)*IF(G40=220,$G$15,IF(G40=132,$G$16,$G$17))/100","v":{"$error":"#VALUE!"}},null,null,"",{"$f":"IF(F40=\"\",\"\",ROUND((K40-J40)*24*60,0))","v":""},null,"","--","--","--","--","--","--","--","--",{"$f":"IF(N40=\"RF\",ROUND(M40/60,2)*I40*$L$16*0.1,\"--\")","v":"--"},{"$f":"IF(N40=\"RR\",ROUND(M40/60,2)*I40*$L$16*0.1*O40/100,\"--\")","v":"--"},"",""]
[null,null,null,null,null,null,null,null,{"$f":"IF(H41>25,H41,25)*IF(G41=220,$G$15,IF(G41=132,$G$16,$G$17))/100","v":{"$error":"#VALUE!"}},null,null,"",{"$f":"IF(F41=\"\",\"\",ROUND((K41-J41)*24*60,0))","v":""},null,"","--","--","--","--","--","--","--","--",{"$f":"IF(N41=\"RF\",ROUND(M41/60,2)*I41*$L$16*0.1,\"--\")","v":"--"},{"$f":"IF(N41=\"RR\",ROUND(M41/60,2)*I41*$L$16*0.1*O41/100,\"--\")","v":"--"},"",""]
[null,null,null,null,null,null,null,null,{"$f":"IF(H42>25,H42,25)*IF(G42=220,$G$15,IF(G42=132,$G$16,$G$17))/100","v":{"$error":"#VALUE!"}},null,null,"",{"$f":"IF(F42=\"\",\"\",ROUND((K42-J42)*24*60,0))","v":""},null,"","--","--","--","--","--","--","--","--",{"$f":"IF(N42=\"RF\",ROUND(M42/60,2)*I42*$L$16*0.1,\"--\")","v":"--"},{"$f":"IF(N42=\"RR\",ROUND(M42/60,2)*I42*$L$16*0.1*O42/100,\"--\")","v":"--"},"",""]
[]
[null,null,"(²)","P - PROGRAMADA  ; F - FORZADA",null,null,null,null,null,null,null,null,null,null,null,{"$f":"SUM(P21:P43)","v":9290.2382408400008},0,17591.8164,19790.793450000001,0,0,0,0,0,0,null,{"$f":"ROUND(SUM(AA21:AA43),2)","v":46672.85}]

{"sheet":"T-05 (1)","index":3,"n_rows":45,"n_cols":29,"rows_kept":45,"cut":false,"hidden":false,"merged":[]}
[]
[null,{"$f":"+'TOT-0516'!B2","v":"ANEXO V al Memorandum D.T.E.E. N°  294  / 2017"}]
[]
[" ENTE NACIONAL REGULADOR "]
["       DE LA ELECTRICIDAD"]
[]
[]
[null,null,null,null,null,"SISTEMA DE TRANSPORTE DE ENERGÍA ELÉCTRICA POR DISTRIBUCIÓN TRONCAL - TRANSNEA S.A."]
[]
[null,null,null,null,null,"2.- CONEXIÓN"]
[]
[null,null,null,null,null,"2.1.- Transformación"]
[]
[null,{"$f":"+'TOT-0516'!B14","v":"Desde el 01 al 31 de mayo de 2016"}]
[]
[null,null,null,null,null,"Por Transformador  [$ / h - MVA]  =",null,null,1.2350000000000001]
[null,null,null,null,null,"Coeficiente de penalización por salida forzada   =",null,null,{"$f":"30*'TOT-0516'!B13","v":60},null,{"$f":"IF(I17=30,\" \",IF(I17=60,\"  Coeficiente duplicado por tasa de falla >4 Sal. x año/100 km.\",\"  REVISAR COEFICIENTE\"))","v":"  Coeficiente duplicado por tasa de falla >4 Sal. x año/100 km."}]
[null,null,3,4,5,6,7,8,9,10,11,12,13,14,15,16,17,18,19,20,21,22,23,24,25,26,27,28,29]
[null,null,"N°","INDISP","ID EQUIPO","ESTACIÓN\nTRANSFORMADORA","EQUIPO","POT.\n[MVA]","U\n[kV]","$/h","Salida","Entrada","Hs.\nIndisp.","Mtos.\nIndisp.","Tipo \nSal.(²)","AUT.","C.R.\n%","E.N.S.","K (P;ENS)","PENALIZ.\nPROGRAM.","REDUCC.\nPROGRAM.","PENALIZACIÓN FORZADA\nPor Salida    hs. Restantes",null,"REDUCC. FORZADA\nPor Salida    hs. Restantes",null,"RESTANTE\nFORZADA","REDUCC.\nRESTANTE","Informó\nenTérm.","TOTAL\nPENALIZAC."]
[]
[]
[null,null,16,301942,752,"BARRANQUERAS","TRAFO 7",30,"132/33/13,2",{"$f":"H22*'T-05 (2)'!$I$16","v":37.050000000000004},"2016-05-01","2016-05-19T08:48:00",{"$f":"IF(F22=\"\",\"\",(L22-K22)*24)","v":440.80000000004657},{"$f":"IF(F22=\"\",\"\",ROUND((L22-K22)*24*60,0))","v":26448},"RP",{"$f":"IF(F22=\"\",\"\",IF(OR(O22=\"P\",O22=\"RP\"),\"--\",\"NO\"))","v":"--"},50,"NO",{"$f":"'T-05 (2)'!$I$17*IF(OR(O22=\"P\",O22=\"RP\"),0.1,1)*IF(R22=\"SI\",1,0.1)","v":0.60000000000000009},{"$f":"IF(O22=\"P\",J22*S22*ROUND(N22/60,2),\"--\")","v":"--"},{"$f":"IF(O22=\"RP\",J22*S22*ROUND(N22/60,2)*Q22/100,\"--\")","v":4899.492000000002},{"$f":"IF(AND(O22=\"F\",P22=\"NO\"),J22*S22,\"--\")","v":"--"},{"$f":"IF(O22=\"F\",J22*S22*ROUND(N22/60,2),\"--\")","v":"--"},{"$f":"IF(AND(O22=\"R\",P22=\"NO\"),J22*S22*Q22/100,\"--\")","v":"--"},{"$f":"IF(O22=\"R\",J22*S22*ROUND(N22/60,2)*Q22/100,\"--\")","v":"--"},{"$f":"IF(O22=\"RF\",J22*S22*ROUND(N22/60,2),\"--\")","v":"--"},{"$f":"IF(O22=\"RR\",J22*S22*ROUND(N22/60,2)*Q22/100,\"--\")","v":"--"},"SI",{"$f":"IF(F22=\"\",\"\",SUM(T22:AA22)*IF(AB22=\"SI\",1,2))","v":4899.492000000002}]
[null,null,17,302270,4263,"BELLA VISTA","TRAFO 3",7.5,"132/33/13,2",{"$f":"H23*$I$16","v":9.2625000000000011},"2016-05-03T01:17:00","2016-05-03T01:45:00",{"$f":"IF(F23=\"\",\"\",(L23-K23)*24)","v":0.46666666661622003},{"$f":"IF(F23=\"\",\"\",ROUND((L23-K23)*24*60,0))","v":28},"R",{"$f":"IF(F23=\"\",\"\",IF(OR(O23=\"P\",O23=\"RP\"),\"--\",\"NO\"))","v":"NO"},60,"SI",{"$f":"$I$17*IF(OR(O23=\"P\",O23=\"RP\"),0.1,1)*IF(R23=\"SI\",1,0.1)","v":60},{"$f":"IF(O23=\"P\",J23*S23*ROUND(N23/60,2),\"--\")","v":"--"},{"$f":"IF(O23=\"RP\",J23*S23*ROUND(N23/60,2)*Q23/100,\"--\")","v":"--"},{"$f":"IF(AND(O23=\"F\",P23=\"NO\"),J23*S23,\"--\")","v":"--"},{"$f":"IF(O23=\"F\",J23*S23*ROUND(N23/60,2),\"--\")","v":"--"},{"$f":"IF(AND(O23=\"R\",P23=\"NO\"),J23*S23*Q23/100,\"--\")","v":333.45000000000005},{"$f":"IF(O23=\"R\",J23*S23*ROUND(N23/60,2)*Q23/100,\"--\")","v":156.72150000000002},{"$f":"IF(O23=\"RF\",J23*S23*ROUND(N23/60,2),\"--\")","v":"--"},{"$f":"IF(O23=\"RR\",J23*S23*ROUND(N23/60,2)*Q23/100,\"--\")","v":"--"},"SI",{"$f":"IF(F23=\"\",\"\",SUM(T23:AA23)*IF(AB23=\"SI\",1,2))","v":490.17150000000004}]
[null,null,18,302271,4730,"BELLA VISTA","TRAFO 4",15,"132/33/13,2",{"$f":"H24*$I$16","v":18.525000000000002},"2016-05-03T01:17:00","2016-05-03T02:10:00",{"$f":"IF(F24=\"\",\"\",(L24-K24)*24)","v":0.88333333341870457},{"$f":"IF(F24=\"\",\"\",ROUND((L24-K24)*24*60,0))","v":53},"F",{"$f":"IF(F24=\"\",\"\",IF(OR(O24=\"P\",O24=\"RP\"),\"--\",\"NO\"))","v":"NO"},"0,000","SI",{"$f":"$I$17*IF(OR(O24=\"P\",O24=\"RP\"),0.1,1)*IF(R24=\"SI\",1,0.1)","v":60},{"$f":"IF(O24=\"P\",J24*S24*ROUND(N24/60,2),\"--\")","v":"--"},{"$f":"IF(O24=\"RP\",J24*S24*ROUND(N24/60,2)*Q24/100,\"--\")","v":"--"},{"$f":"IF(AND(O24=\"F\",P24=\"NO\"),J24*S24,\"--\")","v":1111.5000000000002},{"$f":"IF(O24=\"F\",J24*S24*ROUND(N24/60,2),\"--\")","v":978.12000000000023},"--","--",{"$f":"IF(O24=\"RF\",J24*S24*ROUND(N24/60,2),\"--\")","v":"--"},{"$f":"IF(O24=\"RR\",J24*S24*ROUND(N24/60,2)*Q24/100,\"--\")","v":"--"},"SI",2089.6200000000003]
[null,null,19,302279,774,"BARRANQUERAS","MTR02",20,"33/13,2",{"$f":"H25*$I$16","v":24.700000000000003},"2016-05-03T08:15:00","2016-05-06T14:40:00",{"$f":"IF(F25=\"\",\"\",(L25-K25)*24)","v":78.416666666627862},{"$f":"IF(F25=\"\",\"\",ROUND((L25-K25)*24*60,0))","v":4705},"P","--","0,000","NO",{"$f":"$I$17*IF(OR(O25=\"P\",O25=\"RP\"),0.1,1)*IF(R25=\"SI\",1,0.1)","v":0.60000000000000009},{"$f":"IF(O25=\"P\",J25*S25*ROUND(N25/60,2),\"--\")","v":1162.1844000000003},{"$f":"IF(O25=\"RP\",J25*S25*ROUND(N25/60,2)*Q25/100,\"--\")","v":"--"},{"$f":"IF(AND(O25=\"F\",P25=\"NO\"),J25*S25,\"--\")","v":"--"},{"$f":"IF(O25=\"F\",J25*S25*ROUND(N25/60,2),\"--\")","v":"--"},"--","--",{"$f":"IF(O25=\"RF\",J25*S25*ROUND(N25/60,2),\"--\")","v":"--"},{"$f":"IF(O25=\"RR\",J25*S25*ROUND(N25/60,2)*Q25/100,\"--\")","v":"--"},"SI",1162.1844000000003]
[null,null,20,302280,4611,"FORMOSA","TRAFO 5",30,"132/33/13,2",37.050000000000004,"2016-05-04T07:34:00","2016-05-04T10:13:00",2.6499999999068677,159,"RP","--",50,"NO",0.30000000000000004,{"$f":"IF(O26=\"P\",J26*S26*ROUND(N26/60,2),\"--\")","v":"--"},14.727375000000004,"--","--","--","--","--","--","SI",14.727375000000004]
[null,null,21,302282,765,"FORMOSA","TRAFO 2",15,"132/33/13,2",18.525000000000002,"2016-05-05T07:35:00","2016-05-05T12:27:00",4.8666666668141261,292,"P","--","0,000","NO",0.30000000000000004,27.065025000000009,"--","--","--",{"$f":"IF(AND(O27=\"R\",P27=\"NO\"),J27*S27*Q27/100,\"--\")","v":"--"},{"$f":"IF(O27=\"R\",J27*S27*ROUND(N27/60,2)*Q27/100,\"--\")","v":"--"},"--","--","SI",{"$f":"IF(F27=\"\",\"\",SUM(T27:AA27)*IF(AB27=\"SI\",1,2))","v":27.065025000000009}]
[null,null,22,302586,774,"BARRANQUERAS","MTR01",20,"33/13,2",24.700000000000003,"2016-05-10T09:24:00","2016-05-10T12:38:00",3.2333333332207985,194,"P","--","0,000","NO",1.3,{"$f":"IF(O28=\"P\",J28*S28*ROUND(N28/60,2),\"--\")","v":103.71530000000003},"--","--","--",{"$f":"IF(AND(O28=\"R\",P28=\"NO\"),J28*S28*Q28/100,\"--\")","v":"--"},{"$f":"IF(O28=\"R\",J28*S28*ROUND(N28/60,2)*Q28/100,\"--\")","v":"--"},"--","--","SI",{"$f":"IF(F28=\"\",\"\",SUM(T28:AA28)*IF(AB28=\"SI\",1,2))","v":103.71530000000003}]
[null,null,23,302613,770,"RESIST. NORTE","TRAFO 1",30,"132/33/13,2",37.050000000000004,"2016-05-15T18:47:00","2016-05-15T19:27:00",0.66666666674427688,40,"R","NO",40,"SI",0.30000000000000004,"--","--","--","--",4.4460000000000015,2.9788200000000011,"--","--","SI",{"$f":"IF(F29=\"\",\"\",SUM(T29:AA29)*IF(AB29=\"SI\",1,2))","v":7.4248200000000022}]
[null,null,24,302891,3305,"FORMOSA","TRAFO 1",30,"132/33/13,2",37.050000000000004,"2016-05-16T07:35:00","2016-05-16T11:29:00",3.9000000001396984,234,"P","--","0,000","NO",0.60000000000000009,86.697000000000031,"--","--","--","--","--","--","--","SI",86.697000000000031]
[null,null,25,302892,764,"FORMOSA","TRAFO 3",30,"132/33/13,2",37.050000000000004,"2016-05-17T07:34:00","2016-05-17T12:17:00",4.7166666666744277,283,"P","--","0,000","NO",0.60000000000000009,104.92560000000003,"--","--","--","--","--","--","--","SI",104.92560000000003]
[null,null,26,302897,750,"BARRANQUERAS","TRAFO 4",15,"132/33/13.2",18.525000000000002,"2016-05-19T08:47:00","2016-05-19T11:46:00",2.9833333332790062,179,"RP","--",60,"NO",{"$f":"$I$17*IF(OR(O32=\"P\",O32=\"RP\"),0.1,1)*IF(R32=\"SI\",1,0.1)","v":0.60000000000000009},{"$f":"IF(O32=\"P\",J32*S32*ROUND(N32/60,2),\"--\")","v":"--"},{"$f":"IF(O32=\"RP\",J32*S32*ROUND(N32/60,2)*Q32/100,\"--\")","v":19.873620000000006},{"$f":"IF(AND(O32=\"F\",P32=\"NO\"),J32*S32,\"--\")","v":"--"},{"$f":"IF(O32=\"F\",J32*S32*ROUND(N32/60,2),\"--\")","v":"--"},{"$f":"IF(AND(O32=\"R\",P32=\"NO\"),J32*S32*Q32/100,\"--\")","v":"--"},{"$f":"IF(O32=\"R\",J32*S32*ROUND(N32/60,2)*Q32/100,\"--\")","v":"--"},{"$f":"IF(O32=\"RF\",J32*S32*ROUND(N32/60,2),\"--\")","v":"--"},{"$f":"IF(O32=\"RR\",J32*S32*ROUND(N32/60,2)*Q32/100,\"--\")","v":"--"},"SI",19.873620000000006]
[null,null,27,302898,2662,"BARRANQUERAS","TRAFO 5",15,"132/33/13,2",18.525000000000002,"2016-05-19T08:49:00","2016-05-19T11:46:00",2.9500000000116415,177,"RP","--",60,"NO",0.60000000000000009,"--",19.673550000000006,"--","--","--","--","--","--","SI",19.673550000000006]
[null,null,28,302899,752,"BARRANQUERAS","TRAFO 7",30,"132/33/13,2",37.050000000000004,"2016-05-19T08:49:00","2016-05-19T11:46:00",2.9500000000116415,177,"RP","--",70,"NO",0.60000000000000009,"--",45.904950000000014,"--","--","--","--","--","--","SI",45.904950000000014]
[null,null,29,302900,753,"BARRANQUERAS","TRAFO 8",30,"132/33/13,2",37.050000000000004,"2016-05-19T08:49:00","2016-05-19T11:46:00",2.9500000000116415,177,"RP","--",60,"NO",0.60000000000000009,"--",39.347100000000012,"--","--","--","--","--","--","SI",39.347100000000012]
[null,null,30,302902,774,"BARRANQUERAS","MTR02",20,"33/13,2",24.700000000000003,"2016-05-19T07:17:00","2016-05-19T13:52:00",6.5833333333139308,395,"P","--","0,000","NO",0.60000000000000009,97.51560000000002,"--","--","--","--","--","--","--","SI",97.51560000000002]
[null,null,31,302901,754,"BARRANQUERAS","MTR01",20,"33/13,2",24.700000000000003,"2016-05-19T08:41:00","2016-05-19T13:50:00",5.1500000000232831,309,"P","--","0,000","NO",0.60000000000000009,76.323000000000022,"--","--","--","--","--","--","--","SI",76.323000000000022]
[null,null,32,302910,1336,"FORMOSA","TRAFO 4",30,"132/33/13.2",37.050000000000004,"2016-05-20T07:32:00","2016-05-20T11:43:00",4.1833333333488554,251,"P","--","0,000","NO",0.60000000000000009,92.92140000000002,"--","--","--","--","--","--","--","SI",92.92140000000002]
[null,null,33,302911,4611,"FORMOSA","TRAFO 5",30,"132/33/13,2",37.050000000000004,"2016-05-20T07:32:00","2016-05-20T11:43:00",4.1833333333488554,251,"P","--","0,000","NO",0.60000000000000009,92.92140000000002,"--","--","--","--","--","--","--","SI",92.92140000000002]
[null,null,34,302913,752,"BARRANQUERAS","TRAFO 7",30,"132/33/13,2",37.050000000000004,"2016-05-19T11:47:00","2016-05-31T23:59:00",300.19999999995343,18012,"RP","--",50,"NO",0.60000000000000009,"--",3336.7230000000009,"--","--","--","--","--","--","SI",3336.7230000000009]
[null,null,35,303095,774,"BARRANQUERAS","MTR02",20,"33/13,2",24.700000000000003,"2016-05-24T07:23:00","2016-05-24T13:10:00",5.7833333333255723,347,"P","--","0,000","NO",0.60000000000000009,85.659600000000026,"--","--","--","--","--","--","--","SI",85.659600000000026]
[null,null,36,303110,769,"MTE. CASEROS","TRAFO 1",15,"132/33/13,2",18.525000000000002,"2016-05-27T14:54:00","2016-05-27T15:13:00",0.31666666665114462,19,"R","NO",40,"SI",60,{"$f":"IF(O42=\"P\",J42*S42*ROUND(N42/60,2),\"--\")","v":"--"},{"$f":"IF(O42=\"RP\",J42*S42*ROUND(N42/60,2)*Q42/100,\"--\")","v":"--"},{"$f":"IF(AND(O42=\"F\",P42=\"NO\"),J42*S42,\"--\")","v":"--"},{"$f":"IF(O42=\"F\",J42*S42*ROUND(N42/60,2),\"--\")","v":"--"},{"$f":"IF(AND(O42=\"R\",P42=\"NO\"),J42*S42*Q42/100,\"--\")","v":444.60000000000008},{"$f":"IF(O42=\"R\",J42*S42*ROUND(N42/60,2)*Q42/100,\"--\")","v":142.27200000000002},{"$f":"IF(O42=\"RF\",J42*S42*ROUND(N42/60,2),\"--\")","v":"--"},{"$f":"IF(O42=\"RR\",J42*S42*ROUND(N42/60,2)*Q42/100,\"--\")","v":"--"},"SI",586.87200000000007]
[null,null,37,303245,754,"BARRANQUERAS","MTR01",20,"33/13,2",24.700000000000003,"2016-05-31T07:35:00","2016-05-31T23:59:00",16.400000000023283,984,"P","--","0,000","NO",0.60000000000000009,243.04800000000003,"--","--","--","--","--","--","--","SI",243.04800000000003]
[]
[null,null,"(²)","F - FORZADA  ; RP - REDUCCIÓN PROGRAMADA  ; R - REDUCCIÓN FORZADA",null,null,null,null,null,null,null,null,null,null,null,null,null,null,null,{"$f":"SUM(T20:T44)","v":2172.9763250000005},8375.7415950000031,1111.5000000000002,978.12000000000023,782.49600000000009,301.97232000000008,0,0,null,{"$f":"ROUND(SUM(AC20:AC44),2)","v":13722.81}]

{"sheet":"T-05 (2)","index":4,"n_rows":43,"n_cols":29,"rows_kept":43,"cut":false,"hidden":false,"merged":[]}
[]
[null,{"$f":"+'TOT-0516'!B2","v":"ANEXO V al Memorandum D.T.E.E. N°  294  / 2017"}]
[]
[" ENTE NACIONAL REGULADOR "]
["       DE LA ELECTRICIDAD"]
[]
[]
[null,null,null,null,null,"SISTEMA DE TRANSPORTE DE ENERGÍA ELÉCTRICA POR DISTRIBUCIÓN TRONCAL - TRANSNEA S.A."]
[]
[null,null,null,null,null,"2.- CONEXIÓN"]
[]
[null,null,null,null,null,"2.1.- Transformación"]
[]
[null,{"$f":"+'TOT-0516'!B14","v":"Desde el 01 al 31 de mayo de 2016"}]
[]
[null,null,null,null,null,"Por Transformador  [$ / h - MVA]  =",null,null,1.2350000000000001]
[null,null,null,null,null,"Coeficiente de penalización por salida forzada   =",null,null,{"$f":"30*'TOT-0516'!B13","v":60},null,{"$f":"IF(I17=30,\" \",IF(I17=60,\"  Coeficiente duplicado por tasa de falla >4 Sal. x año/100 km.\",\"  REVISAR COEFICIENTE\"))","v":"  Coeficiente duplicado por tasa de falla >4 Sal. x año/100 km."}]
[null,null,3,4,5,6,7,8,9,10,11,12,13,14,15,16,17,18,19,20,21,22,23,24,25,26,27,28,29]
[null,null,"N°","INDISP","ID EQUIPO","ESTACIÓN\nTRANSFORMADORA","EQUIPO","POT.\n[MVA]","U\n[kV]","$/h","Salida","Entrada","Hs.\nIndisp.","Mtos.\nIndisp.","Tipo \nSal.(²)","AUT.","C.R.\n%","E.N.S.","K (P;ENS)","PENALIZ.\nPROGRAM.","REDUCC.\nPROGRAM.","PENALIZACIÓN FORZADA\nPor Salida    hs. Restantes",null,"REDUCC. FORZADA\nPor Salida    hs. Restantes",null,"RESTANTE\nFORZADA","REDUCC.\nRESTANTE","Informó\nenTérm.","TOTAL\nPENALIZAC."]
[null,null,null,null,null,null,null,null,null,null,null,null,null,null,null,null,null,null,null,null,null,null,null,null,null,null,null,null,{"$f":"'T-05 (1)'!AC45","v":13722.81}]
[]
[null,null,38,303246,773,"CORRIENTES","TRAFO 4",50,"132/33/13,2",{"$f":"H22*$I$16","v":61.750000000000007},"2016-05-31T09:15:00","2016-05-31T12:23:00",{"$f":"IF(F22=\"\",\"\",(L22-K22)*24)","v":3.1333333334187046},{"$f":"IF(F22=\"\",\"\",ROUND((L22-K22)*24*60,0))","v":188},"RP",{"$f":"IF(F22=\"\",\"\",IF(OR(O22=\"P\",O22=\"RP\"),\"--\",\"NO\"))","v":"--"},40,"NO",{"$f":"$I$17*IF(OR(O22=\"P\",O22=\"RP\"),0.1,1)*IF(R22=\"SI\",1,0.1)","v":0.60000000000000009},{"$f":"IF(O22=\"P\",J22*S22*ROUND(N22/60,2),\"--\")","v":"--"},{"$f":"IF(O22=\"RP\",J22*S22*ROUND(N22/60,2)*Q22/100,\"--\")","v":46.386600000000008},{"$f":"IF(AND(O22=\"F\",P22=\"NO\"),J22*S22,\"--\")","v":"--"},{"$f":"IF(O22=\"F\",J22*S22*ROUND(N22/60,2),\"--\")","v":"--"},{"$f":"IF(AND(O22=\"R\",P22=\"NO\"),J22*S22*Q22/100,\"--\")","v":"--"},{"$f":"IF(O22=\"R\",J22*S22*ROUND(N22/60,2)*Q22/100,\"--\")","v":"--"},{"$f":"IF(O22=\"RF\",J22*S22*ROUND(N22/60,2),\"--\")","v":"--"},{"$f":"IF(O22=\"RR\",J22*S22*ROUND(N22/60,2)*Q22/100,\"--\")","v":"--"},"SI",{"$f":"IF(F22=\"\",\"\",SUM(T22:AA22)*IF(AB22=\"SI\",1,2))","v":46.386600000000008}]
[null,null,39,303247,4719,"FORMOSA","TRAFO 1",30,"132/33/13,2",{"$f":"H23*$I$16","v":37.050000000000004},"2016-05-31T09:15:00","2016-05-31T12:23:00",{"$f":"IF(F23=\"\",\"\",(L23-K23)*24)","v":3.1333333334187046},{"$f":"IF(F23=\"\",\"\",ROUND((L23-K23)*24*60,0))","v":188},"RP",{"$f":"IF(F23=\"\",\"\",IF(OR(O23=\"P\",O23=\"RP\"),\"--\",\"NO\"))","v":"--"},50,"NO",{"$f":"$I$17*IF(OR(O23=\"P\",O23=\"RP\"),0.1,1)*IF(R23=\"SI\",1,0.1)","v":0.60000000000000009},{"$f":"IF(O23=\"P\",J23*S23*ROUND(N23/60,2),\"--\")","v":"--"},{"$f":"IF(O23=\"RP\",J23*S23*ROUND(N23/60,2)*Q23/100,\"--\")","v":34.789950000000012},{"$f":"IF(AND(O23=\"F\",P23=\"NO\"),J23*S23,\"--\")","v":"--"},{"$f":"IF(O23=\"F\",J23*S23*ROUND(N23/60,2),\"--\")","v":"--"},{"$f":"IF(AND(O23=\"R\",P23=\"NO\"),J23*S23*Q23/100,\"--\")","v":"--"},{"$f":"IF(O23=\"R\",J23*S23*ROUND(N23/60,2)*Q23/100,\"--\")","v":"--"},{"$f":"IF(O23=\"RF\",J23*S23*ROUND(N23/60,2),\"--\")","v":"--"},{"$f":"IF(O23=\"RR\",J23*S23*ROUND(N23/60,2)*Q23/100,\"--\")","v":"--"},"SI",{"$f":"IF(F23=\"\",\"\",SUM(T23:AA23)*IF(AB23=\"SI\",1,2))","v":34.789950000000012}]
[null,null,null,null,null,null,null,null,null,{"$f":"H24*$I$16","v":0},null,null,{"$f":"IF(F24=\"\",\"\",(L24-K24)*24)","v":""},{"$f":"IF(F24=\"\",\"\",ROUND((L24-K24)*24*60,0))","v":""},null,{"$f":"IF(F24=\"\",\"\",IF(OR(O24=\"P\",O24=\"RP\"),\"--\",\"NO\"))","v":""},null,null,{"$f":"$I$17*IF(OR(O24=\"P\",O24=\"RP\"),0.1,1)*IF(R24=\"SI\",1,0.1)","v":6},{"$f":"IF(O24=\"P\",J24*S24*ROUND(N24/60,2),\"--\")","v":"--"},{"$f":"IF(O24=\"RP\",J24*S24*ROUND(N24/60,2)*Q24/100,\"--\")","v":"--"},{"$f":"IF(AND(O24=\"F\",P24=\"NO\"),J24*S24,\"--\")","v":"--"},{"$f":"IF(O24=\"F\",J24*S24*ROUND(N24/60,2),\"--\")","v":"--"},{"$f":"IF(AND(O24=\"R\",P24=\"NO\"),J24*S24*Q24/100,\"--\")","v":"--"},{"$f":"IF(O24=\"R\",J24*S24*ROUND(N24/60,2)*Q24/100,\"--\")","v":"--"},{"$f":"IF(O24=\"RF\",J24*S24*ROUND(N24/60,2),\"--\")","v":"--"},{"$f":"IF(O24=\"RR\",J24*S24*ROUND(N24/60,2)*Q24/100,\"--\")","v":"--"},{"$f":"IF(F24=\"\",\"\",\"SI\")","v":""},{"$f":"IF(F24=\"\",\"\",SUM(T24:AA24)*IF(AB24=\"SI\",1,2))","v":""}]
[null,null,null,null,null,null,null,null,null,0,null,null,"","",null,"",null,null,6,"--","--","--","--","--","--","--","--","",""]
[null,null,null,null,null,null,null,null,null,0,null,null,"","",null,"",null,null,6,"--","--","--","--","--","--","--","--","",""]
[null,null,null,null,null,null,null,null,null,0,null,null,"","",null,"",null,null,6,"--","--","--","--","--","--","--","--","",""]
[null,null,null,null,null,null,null,null,null,0,null,null,"","",null,"",null,null,6,"--","--","--","--","--","--","--","--","",""]
[null,null,null,null,null,null,null,null,null,0,null,null,"","",null,"",null,null,6,"--","--","--","--","--","--","--","--","",""]
[null,null,null,null,null,null,null,null,null,0,null,null,"","",null,"",null,null,6,"--","--","--","--","--","--","--","--","",""]
[null,null,null,null,null,null,null,null,null,{"$f":"H31*$I$16","v":0},null,null,{"$f":"IF(F31=\"\",\"\",(L31-K31)*24)","v":""},{"$f":"IF(F31=\"\",\"\",ROUND((L31-K31)*24*60,0))","v":""},null,{"$f":"IF(F31=\"\",\"\",IF(OR(O31=\"P\",O31=\"RP\"),\"--\",\"NO\"))","v":""},null,null,{"$f":"$I$17*IF(OR(O31=\"P\",O31=\"RP\"),0.1,1)*IF(R31=\"SI\",1,0.1)","v":6},{"$f":"IF(O31=\"P\",J31*S31*ROUND(N31/60,2),\"--\")","v":"--"},{"$f":"IF(O31=\"RP\",J31*S31*ROUND(N31/60,2)*Q31/100,\"--\")","v":"--"},{"$f":"IF(AND(O31=\"F\",P31=\"NO\"),J31*S31,\"--\")","v":"--"},{"$f":"IF(O31=\"F\",J31*S31*ROUND(N31/60,2),\"--\")","v":"--"},{"$f":"IF(AND(O31=\"R\",P31=\"NO\"),J31*S31*Q31/100,\"--\")","v":"--"},{"$f":"IF(O31=\"R\",J31*S31*ROUND(N31/60,2)*Q31/100,\"--\")","v":"--"},{"$f":"IF(O31=\"RF\",J31*S31*ROUND(N31/60,2),\"--\")","v":"--"},{"$f":"IF(O31=\"RR\",J31*S31*ROUND(N31/60,2)*Q31/100,\"--\")","v":"--"},{"$f":"IF(F31=\"\",\"\",\"SI\")","v":""},{"$f":"IF(F31=\"\",\"\",SUM(T31:AA31)*IF(AB31=\"SI\",1,2))","v":""}]
[null,null,null,null,null,null,null,null,null,0,null,null,"","",null,"",null,null,6,"--","--","--","--","--","--","--","--","",""]
[null,null,null,null,null,null,null,null,null,0,null,null,"","",null,"",null,null,6,"--","--","--","--","--","--","--","--","",""]
[null,null,null,null,null,null,null,null,null,0,null,null,"","",null,"",null,null,6,"--","--","--","--","--","--","--","--","",""]
[null,null,null,null,null,null,null,null,null,0,null,null,"","",null,"",null,null,6,"--","--","--","--","--","--","--","--","",""]
[null,null,null,null,null,null,null,null,null,0,null,null,"","",null,"",null,null,6,"--","--","--","--","--","--","--","--","",""]
[null,null,null,null,null,null,null,null,null,0,null,null,"","",null,{"$f":"IF(F37=\"\",\"\",IF(OR(O37=\"P\",O37=\"RP\"),\"--\",\"NO\"))","v":""},null,null,6,"--","--","--","--","--","--","--","--","",""]
[null,null,null,null,null,null,null,null,null,0,null,null,"","",null,"",null,null,{"$f":"$I$17*IF(OR(O38=\"P\",O38=\"RP\"),0.1,1)*IF(R38=\"SI\",1,0.1)","v":6},{"$f":"IF(O38=\"P\",J38*S38*ROUND(N38/60,2),\"--\")","v":"--"},{"$f":"IF(O38=\"RP\",J38*S38*ROUND(N38/60,2)*Q38/100,\"--\")","v":"--"},{"$f":"IF(AND(O38=\"F\",P38=\"NO\"),J38*S38,\"--\")","v":"--"},{"$f":"IF(O38=\"F\",J38*S38*ROUND(N38/60,2),\"--\")","v":"--"},{"$f":"IF(AND(O38=\"R\",P38=\"NO\"),J38*S38*Q38/100,\"--\")","v":"--"},{"$f":"IF(O38=\"R\",J38*S38*ROUND(N38/60,2)*Q38/100,\"--\")","v":"--"},{"$f":"IF(O38=\"RF\",J38*S38*ROUND(N38/60,2),\"--\")","v":"--"},{"$f":"IF(O38=\"RR\",J38*S38*ROUND(N38/60,2)*Q38/100,\"--\")","v":"--"},{"$f":"IF(F38=\"\",\"\",\"SI\")","v":""},""]
[null,null,null,null,null,null,null,null,null,0,null,null,"","",null,"",null,null,6,"--","--","--","--","--","--","--","--","",""]
[null,null,null,null,null,null,null,null,null,0,null,null,"","",null,"",null,null,6,"--","--","--","--","--","--","--","--","",""]
[null,null,null,null,null,null,null,null,null,0,null,null,"","",null,"",null,null,{"$f":"$I$17*IF(OR(O41=\"P\",O41=\"RP\"),0.1,1)*IF(R41=\"SI\",1,0.1)","v":6},{"$f":"IF(O41=\"P\",J41*S41*ROUND(N41/60,2),\"--\")","v":"--"},{"$f":"IF(O41=\"RP\",J41*S41*ROUND(N41/60,2)*Q41/100,\"--\")","v":"--"},{"$f":"IF(AND(O41=\"F\",P41=\"NO\"),J41*S41,\"--\")","v":"--"},{"$f":"IF(O41=\"F\",J41*S41*ROUND(N41/60,2),\"--\")","v":"--"},{"$f":"IF(AND(O41=\"R\",P41=\"NO\"),J41*S41*Q41/100,\"--\")","v":"--"},{"$f":"IF(O41=\"R\",J41*S41*ROUND(N41/60,2)*Q41/100,\"--\")","v":"--"},{"$f":"IF(O41=\"RF\",J41*S41*ROUND(N41/60,2),\"--\")","v":"--"},{"$f":"IF(O41=\"RR\",J41*S41*ROUND(N41/60,2)*Q41/100,\"--\")","v":"--"},{"$f":"IF(F41=\"\",\"\",\"SI\")","v":""},""]
[]
[null,null,"(²)","F - FORZADA  ; RP - REDUCCIÓN PROGRAMADA  ; R - REDUCCIÓN FORZADA",null,null,null,null,null,null,null,null,null,null,null,null,null,null,null,{"$f":"SUM(T20:T42)","v":0},81.17655000000002,0,0,0,0,0,0,null,{"$f":"ROUND(SUM(AC20:AC42),2)","v":13803.99}]

{"sheet":"SA-05 (1)","index":5,"n_rows":43,"n_cols":22,"rows_kept":43,"cut":false,"hidden":false,"merged":[]}
[]
[null,{"$f":"'TOT-0516'!B2","v":"ANEXO V al Memorandum D.T.E.E. N°  294  / 2017"}]
[]
[" ENTE NACIONAL REGULADOR "]
["       DE LA ELECTRICIDAD"]
[]
[]
[null,null,null,null,null,"SISTEMA DE TRANSPORTE DE ENERGÍA ELÉCTRICA POR DISTRIBUCIÓN TRONCAL - TRANSNEA S.A."]
[]
[null,null,null,null,null,"2.2.- Salidas"]
[]
[null,{"$f":"'TOT-0516'!B14","v":"Desde el 01 al 31 de mayo de 2016"}]
[]
[null,null,null,null,null,"Salida en 220 kV"," - ",{"$f":"60*'TOT-0516'!B13","v":120},null,{"$f":"IF(H14=60,\" \",IF(H14=120,\"  Coeficiente duplicado por tasa de falla >4 Sal. x año/100 km.\",\"  REVISAR COEFICIENTE\"))","v":"  Coeficiente duplicado por tasa de falla >4 Sal. x año/100 km."}]
[null,null,null,null,null,"Salida en 132 kV = ",16.042999999999999,{"$f":"50*'TOT-0516'!B13","v":100},null,{"$f":"IF(H15=50,\" \",IF(H15=100,\"  Coeficiente duplicado por tasa de falla >4 Sal. x año/100 km.\",\"  REVISAR COEFICIENTE\"))","v":"  Coeficiente duplicado por tasa de falla >4 Sal. x año/100 km."}]
[null,null,null,null,null,"Salida en 33 kV ",12.029,{"$f":"25*'TOT-0516'!B13","v":50},null,{"$f":"IF(H16=25,\" \",IF(H16=50,\"  Coeficiente duplicado por tasa de falla >4 Sal. x año/100 km.\",\"  REVISAR COEFICIENTE\"))","v":"  Coeficiente duplicado por tasa de falla >4 Sal. x año/100 km."}]
[null,null,null,null,null,"Salida en 13,2 kV =",12.029,{"$f":"20*'TOT-0516'!B13","v":40},null,{"$f":"IF(H17=20,\" \",IF(H17=40,\"  Coeficiente duplicado por tasa de falla >4 Sal. x año/100 km.\",\"  REVISAR COEFICIENTE\"))","v":"  Coeficiente duplicado por tasa de falla >4 Sal. x año/100 km."}]
[null,null,3,4,5,6,7,8,9,10,11,12,13,14,15,16,17,18,19,20,21,22]
[null,null,"N°","INDISP","ID EQUIPO","ESTACIÓN\nTRANSFORMADORA","EQUIPO","U\n[kV]","$/h","Salida","Entrada","Hs.\nIndisp.","Mtos.\nIndisp.","Tipo \nSal.(²)","AUT.","K","PENALIZ.\nPROGRAM.","PENALIZACIÓN FORZADA\nPor Salida    hs. Restantes",null,"RESTANTE\nFORZADA","Informó\nenTérm.","TOTAL\nPENALIZAC."]
[]
[]
[null,null,40,302618,2682,"R.NORTE NUEVA"," DISTRIBUIDOR 84 LIBERTAD",13.2,{"$f":"IF(H22=220,$G$14,IF(AND(H22<=132,H22>=66),$G$15,IF(AND(H22<66,H22>=33),$G$16,$G$17)))","v":12.029},"2016-05-15T18:47:00","2016-05-15T19:27:00",{"$f":"IF(F22=\"\",\"\",(K22-J22)*24)","v":0.66666666674427688},{"$f":"IF(F22=\"\",\"\",ROUND((K22-J22)*24*60,0))","v":40},"F",{"$f":"IF(F22=\"\",\"\",IF(OR(N22=\"P\",N22=\"RP\"),\"--\",\"NO\"))","v":"NO"},{"$f":"IF(H22=220,$H$14,IF(AND(H22<=132,H22>=66),$H$15,IF(AND(H22<66,H22>=33),$H$16,$H$17)))","v":40},{"$f":"IF(N22=\"P\",I22*P22*ROUND(M22/60,2)*0.1,\"--\")","v":"--"},{"$f":"IF(AND(N22=\"F\",O22=\"NO\"),I22*P22,\"--\")","v":481.15999999999997},{"$f":"IF(N22=\"F\",I22*P22*ROUND(M22/60,2),\"--\")","v":322.37720000000002},{"$f":"IF(N22=\"RF\",I22*P22*ROUND(M22/60,2),\"--\")","v":"--"},"SI",{"$f":"IF(F22=\"\",\"\",SUM(Q22:T22)*IF(U22=\"SI\",1,2)*IF(H22=\"500/220\",0,1))","v":803.53719999999998}]
[null,null,41,302903,776,"BARRANQUERAS","SALIDA LINEA C. RESIST1 (4)",33,{"$f":"IF(H23=220,$G$14,IF(AND(H23<=132,H23>=66),$G$15,IF(AND(H23<66,H23>=33),$G$16,$G$17)))","v":12.029},"2016-05-19T08:49:00","2016-05-19T11:46:00",{"$f":"IF(F23=\"\",\"\",(K23-J23)*24)","v":2.9500000000116415},{"$f":"IF(F23=\"\",\"\",ROUND((K23-J23)*24*60,0))","v":177},"P","--",{"$f":"IF(H23=220,$H$14,IF(AND(H23<=132,H23>=66),$H$15,IF(AND(H23<66,H23>=33),$H$16,$H$17)))","v":50},{"$f":"IF(N23=\"P\",I23*P23*ROUND(M23/60,2)*0.1,\"--\")","v":177.42775000000003},{"$f":"IF(AND(N23=\"F\",O23=\"NO\"),I23*P23,\"--\")","v":"--"},{"$f":"IF(N23=\"F\",I23*P23*ROUND(M23/60,2),\"--\")","v":"--"},{"$f":"IF(N23=\"RF\",I23*P23*ROUND(M23/60,2),\"--\")","v":"--"},"SI",{"$f":"IF(F23=\"\",\"\",SUM(Q23:T23)*IF(U23=\"SI\",1,2)*IF(H23=\"500/220\",0,1))","v":177.42775000000003}]
[null,null,42,302904,777,"BARRANQUERAS","SALIDA LINEA C. RESIST2 (5)",33,12.029,"2016-05-19T08:49:00","2016-05-19T11:46:00",2.9500000000116415,177,"P","--",50,177.42775000000003,"--","--","--",{"$f":"IF(F24=\"\",\"\",\"SI\")","v":"SI"},177.42775000000003]
[null,null,43,302905,778,"BARRANQUERAS","SALIDA LINEA C. RESIST3 (6)",33,12.029,"2016-05-19T08:49:00","2016-05-19T11:46:00",2.9500000000116415,177,"P","--",50,177.42775000000003,"--","--","--","SI",177.42775000000003]
[null,null,44,302906,4287,"BARRANQUERAS","SALIDA DEFENSA 1 (137)",33,12.029,"2016-05-19T08:49:00","2016-05-19T11:46:00",2.9500000000116415,177,"P","--",50,177.42775000000003,"--","--","--","SI",177.42775000000003]
[null,null,45,302907,4288,"BARRANQUERAS","SALIDA DEFENSA 2 (138)",33,12.029,"2016-05-19T08:49:00","2016-05-19T11:46:00",2.9500000000116415,177,"P","--",50,177.42775000000003,"--","--","--","SI",177.42775000000003]
[null,null,null,null,null,null,null,null,12.029,null,null,"","",null,"",40,"--","--","--","--","",""]
[null,null,null,null,null,null,null,null,12.029,null,null,"","",null,"",40,"--","--","--","--","",""]
[null,null,null,null,null,null,null,null,12.029,null,null,"","",null,"",40,"--","--","--","--","",""]
[null,null,null,null,null,null,null,null,12.029,null,null,"","",null,"",40,"--","--","--","--","",""]
[null,null,null,null,null,null,null,null,12.029,null,null,"","",null,"",40,"--","--","--","--","",""]
[null,null,null,null,null,null,null,null,12.029,null,null,"","",null,"",40,"--","--","--","--","",""]
[null,null,null,null,null,null,null,null,12.029,null,null,"","",null,"",40,"--","--","--","--","",""]
[null,null,null,null,null,null,null,null,12.029,null,null,"","",null,"",40,"--","--","--","--","",""]
[null,null,null,null,null,null,null,null,12.029,null,null,"","",null,"",40,"--","--","--","--","",""]
[null,null,null,null,null,null,null,null,12.029,null,null,"","",null,"",40,"--","--","--","--","",""]
[null,null,null,null,null,null,null,null,12.029,null,null,"","",null,"",40,"--","--","--","--","",""]
[null,null,null,null,null,null,null,null,{"$f":"IF(H39=220,$G$14,IF(AND(H39<=132,H39>=66),$G$15,IF(AND(H39<66,H39>=33),$G$16,$G$17)))","v":12.029},null,null,{"$f":"IF(F39=\"\",\"\",(K39-J39)*24)","v":""},{"$f":"IF(F39=\"\",\"\",ROUND((K39-J39)*24*60,0))","v":""},null,"",{"$f":"IF(H39=220,$H$14,IF(AND(H39<=132,H39>=66),$H$15,IF(AND(H39<66,H39>=33),$H$16,$H$17)))","v":40},{"$f":"IF(N39=\"P\",I39*P39*ROUND(M39/60,2)*0.1,\"--\")","v":"--"},{"$f":"IF(AND(N39=\"F\",O39=\"NO\"),I39*P39,\"--\")","v":"--"},{"$f":"IF(N39=\"F\",I39*P39*ROUND(M39/60,2),\"--\")","v":"--"},{"$f":"IF(N39=\"RF\",I39*P39*ROUND(M39/60,2),\"--\")","v":"--"},{"$f":"IF(F39=\"\",\"\",\"SI\")","v":""},""]
[null,null,null,null,null,null,null,null,{"$f":"IF(H40=220,$G$14,IF(AND(H40<=132,H40>=66),$G$15,IF(AND(H40<66,H40>=33),$G$16,$G$17)))","v":12.029},null,null,{"$f":"IF(F40=\"\",\"\",(K40-J40)*24)","v":""},{"$f":"IF(F40=\"\",\"\",ROUND((K40-J40)*24*60,0))","v":""},null,"",{"$f":"IF(H40=220,$H$14,IF(AND(H40<=132,H40>=66),$H$15,IF(AND(H40<66,H40>=33),$H$16,$H$17)))","v":40},{"$f":"IF(N40=\"P\",I40*P40*ROUND(M40/60,2)*0.1,\"--\")","v":"--"},{"$f":"IF(AND(N40=\"F\",O40=\"NO\"),I40*P40,\"--\")","v":"--"},{"$f":"IF(N40=\"F\",I40*P40*ROUND(M40/60,2),\"--\")","v":"--"},{"$f":"IF(N40=\"RF\",I40*P40*ROUND(M40/60,2),\"--\")","v":"--"},{"$f":"IF(F40=\"\",\"\",\"SI\")","v":""},""]
[null,null,null,null,null,null,null,null,{"$f":"IF(H41=220,$G$14,IF(AND(H41<=132,H41>=66),$G$15,IF(AND(H41<66,H41>=33),$G$16,$G$17)))","v":12.029},null,null,{"$f":"IF(F41=\"\",\"\",(K41-J41)*24)","v":""},{"$f":"IF(F41=\"\",\"\",ROUND((K41-J41)*24*60,0))","v":""},null,"",{"$f":"IF(H41=220,$H$14,IF(AND(H41<=132,H41>=66),$H$15,IF(AND(H41<66,H41>=33),$H$16,$H$17)))","v":40},{"$f":"IF(N41=\"P\",I41*P41*ROUND(M41/60,2)*0.1,\"--\")","v":"--"},{"$f":"IF(AND(N41=\"F\",O41=\"NO\"),I41*P41,\"--\")","v":"--"},{"$f":"IF(N41=\"F\",I41*P41*ROUND(M41/60,2),\"--\")","v":"--"},{"$f":"IF(N41=\"RF\",I41*P41*ROUND(M41/60,2),\"--\")","v":"--"},{"$f":"IF(F41=\"\",\"\",\"SI\")","v":""},""]
[]
[null,null,"(²)","F - FORZADA",null,null,null,null,null,null,null,null,null,null,null,null,{"$f":"SUM(Q20:Q42)","v":887.13875000000019},{"$f":"SUM(R20:R42)","v":481.15999999999997},{"$f":"SUM(S20:S42)","v":322.37720000000002},{"$f":"SUM(T20:T42)","v":0},null,{"$f":"ROUND(SUM(V20:V42),2)","v":1690.68}]

{"sheet":"SUP-DPEC","index":6,"n_rows":66,"n_cols":26,"rows_kept":66,"cut":false,"hidden":false,"merged":[[11,1,11,25]]}
[]
[null,{"$f":"'TOT-0516'!B2","v":"ANEXO V al Memorandum D.T.E.E. N°  294  / 2017"}]
[]
["ENTE NACIONAL REGULADOR "]
["DE LA ELECTRICIDAD"]
[]
[]
[null,null,null,"SISTEMA DE TRANSPORTE DE ENERGÍA ELÉCTRICA POR DISTRIBUCIÓN TRONCAL - TRANSNEA S.A."]
[]
[null,null,null,"3.1.-SUPERVISIÓN - Transportista Independiente D.P.E.C."]
[]
[null,{"$f":"'TOT-0516'!B14","v":"Desde el 01 al 31 de mayo de 2016"}]
[]
[]
[]
[null,null,"a) Datos"]
[null,null,null,null,null,null,null,null,null,null,"K"]
[null,null,null,"Tiempo de servicio =",{"$f":"MID(B12,16,2)*24","v":744},"hs",null,"$/100 km-h : LÍNEAS 220 kV ",null," - ",{"$f":"30*'TOT-0516'!B13","v":60}]
[null,null,null,"Porcentaje por Supervisión  =",2.5000000000000001E-2,null,null,"$/100 km-h : LÍNEAS 132 kV ",null,345.49299999999999,null,null,"RM por Transformador =",null,null,null,null,null,null,null,null,null,null,null," - ","$/h-MVA"]
[null,null,null,null,null,null,null,"$/100 km-h : LÍNEAS 66 kV ",null," - ",null,null,"RM Salidas 132 kV =",null,null,null,null,null,null,null,null,null,null,null,16.042999999999999,"$/hs."]
[]
[null,null,"b) SM:  es la suma de las sanciones a que en cada mes se hiciere pasible el Transportista Independiente, valorizadas con idénticos criterios que los que se aplican a la Concesionaria."]
[]
[null,null,"N°","LÍNEAS","U\n[kV]","Long.\n[km]","$/h","Salida","Entrada","Hs.\nIndisp. ","Minutos\nIndisp.","Tipo \nSal.(²)","C.R.\n%","PENALIZAC.\nPROGRAM.","REDUCC.\nPROGRAM.","PENALIZACIÓN FORZADA\nPor Salida    1ras. 3 hs.  hs. Restantes",null,null,"REDUCC. FORZADA\nPor Salida    1ras. 3 hs.  hs. Restantes",null,null,"RESTANTE\nFORZADA","REDUCC.\nRESTANTE","Informó\nenTérm.","TOTAL\nPENALIZAC."]
[]
[null,null,"I","PASO DE LOS LIBRES - MONTE CASEROS",132,101,{"$f":"IF(F26>25,F26,25)*IF(E26=220,$J$18,IF(E26=132,$J$19,$J$20))/100","v":348.94792999999999},"2016-05-02T06:23:00","2016-05-02T08:15:00",{"$f":"IF(D26=\"\",\"\",(I26-H26)*24)","v":1.8666666666395031},{"$f":"IF(D26=\"\",\"\",ROUND((I26-H26)*24*60,0))","v":112},"F",{"$f":"IF(D26=\"\",\"\",\"--\")","v":"--"},{"$f":"IF(L26=\"P\",ROUND(K26/60,2)*G26*$K$18*0.01,\"--\")","v":"--"},{"$f":"IF(L26=\"RP\",ROUND(K26/60,2)*G26*$K$18*0.01*M26/100,\"--\")","v":"--"},{"$f":"IF(L26=\"F\",G26*$K$18,\"--\")","v":20936.875799999998},{"$f":"IF(AND(K26>10,L26=\"F\"),G26*$K$18*IF(K26>180,3,ROUND(K26/60,2)),\"--\")","v":39151.957746},{"$f":"IF(AND(L26=\"F\",K26>180),(ROUND(K26/60,2)-3)*G26*$K$18*0.1,\"--\")","v":"--"},{"$f":"IF(L26=\"R\",G26*$K$18*M26/100,\"--\")","v":"--"},{"$f":"IF(AND(K26>10,L26=\"R\"),G26*$K$18*M26/100*IF(K26>180,3,ROUND(K26/60,2)),\"--\")","v":"--"},{"$f":"IF(AND(L26=\"R\",K26>180),(ROUND(K26/60,2)-3)*G26*$K$18*0.1*M26/100,\"--\")","v":"--"},{"$f":"IF(L26=\"RF\",ROUND(K26/60,2)*G26*$K$18*0.1,\"--\")","v":"--"},{"$f":"IF(L26=\"RR\",ROUND(K26/60,2)*G26*$K$18*0.1*M26/100,\"--\")","v":"--"},{"$f":"IF(D26=\"\",\"\",\"SI\")","v":"SI"},{"$f":"IF(D26=\"\",\"\",SUM(N26:W26)*IF(X26=\"SI\",1,2))","v":60088.833545999994}]
[null,null,"II","PASO DE LOS LIBRES - MONTE CASEROS",132,101,{"$f":"IF(F27>25,F27,25)*IF(E27=220,$J$18,IF(E27=132,$J$19,$J$20))/100","v":348.94792999999999},"2016-05-08T07:52:00","2016-05-08T08:15:00",{"$f":"IF(D27=\"\",\"\",(I27-H27)*24)","v":0.38333333336049691},{"$f":"IF(D27=\"\",\"\",ROUND((I27-H27)*24*60,0))","v":23},"F",{"$f":"IF(D27=\"\",\"\",\"--\")","v":"--"},{"$f":"IF(L27=\"P\",ROUND(K27/60,2)*G27*$K$18*0.01,\"--\")","v":"--"},{"$f":"IF(L27=\"RP\",ROUND(K27/60,2)*G27*$K$18*0.01*M27/100,\"--\")","v":"--"},{"$f":"IF(L27=\"F\",G27*$K$18,\"--\")","v":20936.875799999998},{"$f":"IF(AND(K27>10,L27=\"F\"),G27*$K$18*IF(K27>180,3,ROUND(K27/60,2)),\"--\")","v":7956.0128039999991},{"$f":"IF(AND(L27=\"F\",K27>180),(ROUND(K27/60,2)-3)*G27*$K$18*0.1,\"--\")","v":"--"},{"$f":"IF(L27=\"R\",G27*$K$18*M27/100,\"--\")","v":"--"},{"$f":"IF(AND(K27>10,L27=\"R\"),G27*$K$18*M27/100*IF(K27>180,3,ROUND(K27/60,2)),\"--\")","v":"--"},{"$f":"IF(AND(L27=\"R\",K27>180),(ROUND(K27/60,2)-3)*G27*$K$18*0.1*M27/100,\"--\")","v":"--"},{"$f":"IF(L27=\"RF\",ROUND(K27/60,2)*G27*$K$18*0.1,\"--\")","v":"--"},{"$f":"IF(L27=\"RR\",ROUND(K27/60,2)*G27*$K$18*0.1*M27/100,\"--\")","v":"--"},"SI",28892.888603999996]
[null,null,"III","PASO DE LOS LIBRES - MONTE CASEROS",132,101,{"$f":"IF(F28>25,F28,25)*IF(E28=220,$J$18,IF(E28=132,$J$19,$J$20))/100","v":348.94792999999999},"2016-05-10T08:02:00","2016-05-10T17:50:00",9.7999999999883585,588,"P",{"$f":"IF(D28=\"\",\"\",\"--\")","v":"--"},{"$f":"IF(L28=\"P\",ROUND(K28/60,2)*G28*$K$18*0.01,\"--\")","v":2051.8138284000001},{"$f":"IF(L28=\"RP\",ROUND(K28/60,2)*G28*$K$18*0.01*M28/100,\"--\")","v":"--"},{"$f":"IF(L28=\"F\",G28*$K$18,\"--\")","v":"--"},{"$f":"IF(AND(K28>10,L28=\"F\"),G28*$K$18*IF(K28>180,3,ROUND(K28/60,2)),\"--\")","v":"--"},{"$f":"IF(AND(L28=\"F\",K28>180),(ROUND(K28/60,2)-3)*G28*$K$18*0.1,\"--\")","v":"--"},{"$f":"IF(L28=\"R\",G28*$K$18*M28/100,\"--\")","v":"--"},{"$f":"IF(AND(K28>10,L28=\"R\"),G28*$K$18*M28/100*IF(K28>180,3,ROUND(K28/60,2)),\"--\")","v":"--"},{"$f":"IF(AND(L28=\"R\",K28>180),(ROUND(K28/60,2)-3)*G28*$K$18*0.1*M28/100,\"--\")","v":"--"},{"$f":"IF(L28=\"RF\",ROUND(K28/60,2)*G28*$K$18*0.1,\"--\")","v":"--"},{"$f":"IF(L28=\"RR\",ROUND(K28/60,2)*G28*$K$18*0.1*M28/100,\"--\")","v":"--"},{"$f":"IF(D28=\"\",\"\",\"SI\")","v":"SI"},{"$f":"IF(D28=\"\",\"\",SUM(N28:W28)*IF(X28=\"SI\",1,2))","v":2051.8138284000001}]
[null,null,"IV","PASO DE LOS LIBRES - MONTE CASEROS",132,101,348.94792999999999,"2016-05-11T07:54:00","2016-05-11T17:55:00",10.016666666662786,601,"P","--",2097.8749551599999,"--","--","--","--","--","--","--","--","--","SI",2097.8749551599999]
[null,null,"V","PASO DE LOS LIBRES - MONTE CASEROS",132,101,348.94792999999999,"2016-05-12T08:10:00","2016-05-12T20:19:00",12.149999999965075,729,"P","--",2543.8304096999996,"--","--","--","--","--","--","--","--","--","SI",2543.8304096999996]
[null,null,"VI","PASO DE LOS LIBRES - MONTE CASEROS",132,101,348.94792999999999,"2016-05-13T07:42:00","2016-05-13T17:26:00",9.7333333334536292,584,"P","--",2037.15801534,"--","--","--","--","--","--","--","--","--","SI",2037.15801534]
[null,null,"VII","PASO DE LOS LIBRES - MONTE CASEROS",132,101,348.94792999999999,"2016-05-14T08:09:00","2016-05-14T17:58:00",9.8166666667093523,589,"P","--",2056.0012035600002,"--","--","--","--","--","--","--","--","--","SI",2056.0012035600002]
[null,null,"VIII","PASO DE LOS LIBRES - MONTE CASEROS",132,101,{"$f":"IF(F33>25,F33,25)*IF(E33=220,$J$18,IF(E33=132,$J$19,$J$20))/100","v":348.94792999999999},"2016-05-19T07:05:00","2016-05-21T13:11:00",54.099999999976717,3246,"P",{"$f":"IF(D33=\"\",\"\",\"--\")","v":"--"},11326.849807799999,"--","--","--","--","--","--","--","--","--","SI",11326.849807799999]
[null,null,null,null,null,null,null,null,null,{"$f":"IF(D34=\"\",\"\",(I34-H34)*24)","v":""},{"$f":"IF(D34=\"\",\"\",ROUND((I34-H34)*24*60,0))","v":""},null,{"$f":"IF(D34=\"\",\"\",\"--\")","v":""},null,null,null,null,null,null,null,null,null,null,{"$f":"IF(D34=\"\",\"\",\"SI\")","v":""},{"$f":"IF(D34=\"\",\"\",SUM(N34:W34)*IF(X34=\"SI\",1,2))","v":""}]
[null,null,null,null,null,null,null,null,null,null,null,null,null,null,null,null,null,null,null,null,null,null,null,null,{"$f":"SUM(Y26:Y34)","v":111095.25036995998}]
[]
[null,null,"N°","ESTACIÓN\nTRANSFORMADORA","EQUIPO","U\n[kV]","$/h","Salida","Entrada","Hs.\nIndisp.","Mtos.\nIndisp.","Tipo \nSal.(²)","AUT.","K","PENALIZ.\nPROGRAM.","PENALIZACIÓN FORZADA\nPor Salida    hs. Restantes",null,null,null,null,null,"RESTANTE\nFORZADA",null,"Informó\nenTérm.","TOTAL\nPENALIZAC."]
[]
[null,null,"I",null,null,null,{"$f":"Y20","v":16.042999999999999},null,null,{"$f":"IF(D39=\"\",\"\",(I39-H39)*24)","v":""},{"$f":"IF(D39=\"\",\"\",ROUND((I39-H39)*24*60,0))","v":""},null,{"$f":"IF(D39=\"\",\"\",IF(OR(L39=\"P\",L39=\"RP\"),\"--\",\"NO\"))","v":""},50,{"$f":"IF(L39=\"P\",G39*N39*ROUND(K39/60,2)*0.1,\"--\")","v":"--"},{"$f":"IF(AND(L39=\"F\",M39=\"NO\"),G39*N39,\"--\")","v":"--"},{"$f":"IF(L39=\"F\",G39*N39*ROUND(K39/60,2),\"--\")","v":"--"},null,null,null,null,{"$f":"IF(L39=\"RF\",G39*N39*ROUND(K39/60,2),\"--\")","v":"--"},null,{"$f":"IF(D39=\"\",\"\",\"SI\")","v":""},{"$f":"IF(D39=\"\",\"\",SUM(O39:V39)*IF(X39=\"SI\",1,2)*IF(F39=\"500/220\",0,1))","v":""}]
[]
[null,null,null,null,null,null,null,null,null,null,null,null,null,null,null,null,null,null,null,null,null,null,null,null,{"$f":"SUM(Y39:Y40)","v":0}]
[null,null,null,null,null,null,null,"SM=",{"$f":"Y35+Y41","v":111095.25036995998}]
[]
[null,null,"c) RM : es la remuneración que mensualmente recibiría el Transportista Independiente, si su servicio fuera valorizado conforme al régimen remuneratorio que se aplica a la Concesionaria."]
[]
[null,null,null,"Cargo por Capacidad","kV","km",null,null,"RM por Cap. Transporte",null,"RM por E. E. T.",null,null,null,null,null,null,null,null,null,null,null,null,"TOTAL"]
[]
[null,null,null,"PASO DE LOS LIBRES - MONTE CASEROS",132,100.7,null,null,{"$f":"F48*$J$19*$E$18/100","v":258846.11954400002},null,41472,null,{"$f":"\"(DTE \"&DATO!$G$14&DATO!$H$14&\")\"","v":"(DTE 0516)"},null,null,null,null,null,null,null,null,null,null,{"$f":"I48+I52","v":270782.11154400004}]
[]
[null,null,null,"E.T.","kV","SALIDA","SALIDA",null,"RM por Conexión"]
[]
[null,null,null,"PASO DE LOS LIBRES",132,"INTERRUPTOR TRAFO 1",null,null,{"$f":"Y20*E18","v":11935.992}]
[]
[]
[null,null,null,null,null,null,null,"RM =",{"$f":"X48+I52","v":282718.10354400007},null,null,null,"RM * =",null,null,null,null,null,null,null,null,null,null,118738.70157599999]
[]
[null,null,"d) CS: Es el cargo por Supervisión de la Operación que la Transportista percibe por supervisar la operación y mantenimiento del Transportista Independiente."]
[]
[null,null,null,"Cargo por Supervisión afectado a la sanción ",null,null,null,"CS =",{"$f":"E19*X55","v":2968.4675394000001},null,null,"RM* = VALOR EMPLEADO PARA CALCULAR CS"]
[]
[null,null,"e) SANCIÓN"]
[null,null,null,"Sanción Calculada",{"$f":"10*Y35*I59/I55","v":11664.716209212163}]
[]
[null,null,null,"TOTAL A PENALIZAR A TRANSNEA S.A. POR SUPERVISIÓN A  D.P.E.C."]
[]
[null,null,null,null,null,null,null,"SANCIÓN  =",{"$f":"IF(E62>3*I59,3*I59,$E$62)","v":8905.4026181999998}]

{"sheet":"DATO","index":7,"n_rows":27,"n_cols":29,"rows_kept":27,"cut":false,"hidden":false,"merged":[]}
["Mes","Mes","Dia","Año"]
["enero","01",31,2006]
["febrero","02",{"$f":"IF(MOD(E14,4)=0,29,28)","v":29},{"$f":"+D2+1","v":2007}]
["marzo","03",31,{"$f":"+D3+1","v":2008}]
["abril","04",30,{"$f":"+D4+1","v":2009}]
["mayo","05",31,2010]
["junio","06",30,2011]
["julio","07",31,2012]
["agosto","08",31,2013]
["septiembre","09",30,2014]
["octubre","10",31,2015]
["noviembre","11",30,2016]
["diciembre","12",31,null,null,null,null,null,"Total"]
[11,5,{"$f":"CELL(\"CONTENIDO\",OFFSET(A1,B14,0))","v":"mayo"},{"$f":"CELL(\"CONTENIDO\",OFFSET(C1,B14,0))","v":31},{"$f":"CELL(\"CONTENIDO\",OFFSET(D1,A14,0))","v":2016},{"$f":"\"Desde el 01 al \" & D14 & \" de \" & C14 & \" de \" & E14","v":"Desde el 01 al 31 de mayo de 2016"},{"$f":"CELL(\"CONTENIDO\",OFFSET(B1,B14,0))","v":"05"},{"$f":"RIGHT(E14,2)","v":"16"},"B14"]
[null,{"$f":"\"\\\\rugor\\files\\Transporte\\Transporte\\AA PROCESO AUT ARCHIVOS J\\TRANSNEA\\\" &E14","v":"\\\\rugor\\files\\Transporte\\Transporte\\AA PROCESO AUT ARCHIVOS J\\TRANSNEA\\2016"},null,null,null,null,{"$f":"\"J\"&G14&H14&\"NEA\"","v":"J0516NEA"}]
[null,{"$f":"\"\\\\rugor\\files\\Transporte\\transporte\\AA PROCESO AUT\\INTERCAMBIO\\\" &H14&G14","v":"\\\\rugor\\files\\Transporte\\transporte\\AA PROCESO AUT\\INTERCAMBIO\\1605"}]
["Hoja","FilaInicio","FilasPlantilla","Columnas","NombreHoja","OrigenDeDatos","Col00","Col01","Col02","Col03","Col04","Col05","Col06","Col07","Col08","Col09","Col10","Col11","Col12","Col13","Col14","Col15","FILHTOTAL","COLHTOTAL","FILHCALC","COLHCALC","FILTRANSP","COLTRANSP","COL TSAL"]
["MODELO L",23,20,11,{"$f":"\"LI-\" & $G$14","v":"LI-05"},"TRANSNEA_INDISPONIBILIDADES_LINEAS_TRANSNEA.XLS",3,5,4,6,7,8,0,10,11,14,0,26,0,0,0,0,20,9,44,27,21,27,14]
["MODELO T",22,20,13,{"$f":"\"T-\" & $G$14","v":"T-05"},"TRANSNEA_INDISPONIBILIDADES_TRAFOS_TRANSNEA.XLS",3,5,4,6,7,8,9,11,12,15,16,18,28,17,0,0,28,9,43,29,20,29,15]
["MODELO S",22,20,10,{"$f":"\"SA-\" & $G$14","v":"SA-05"},"TRANSNEA_INDISPONIBILIDADES_SALIDAS_TRANSNEA.XLS",3,5,4,6,7,8,10,11,14,15,21,0,0,0,0,0,32,9,43,22,20,22,14]
["MODELO L DPEC",23,20,11,{"$f":"\"LI-DPEC-\" & $G$14","v":"LI-DPEC-05"},"TRANSNEA_INDISPONIBILIDADES_LINEAS_DPEC.XLS",3,5,4,6,7,8,0,10,11,14,0,26,0,0,0,0,21,9,44,27,21,27,14]
["MODELO L ENECOR",23,20,11,{"$f":"\"LI-ENECOR-\" & $G$14","v":"LI-ENECOR-05"},"TRANSNEA_INDISPONIBILIDADES_LINEAS_ENECOR.XLS",3,5,4,6,7,8,0,10,11,14,0,26,0,0,0,0,22,9,44,27,21,27,14]
["MODELO L ELING",25,20,11,{"$f":"\"LI-ELECT-\" & $G$14","v":"LI-ELECT-05"},"TRANSNEA_INDISPONIBILIDADES_LINEAS_ELECTROINGENIERIA.XLS",3,5,4,6,7,8,0,10,11,14,0,26,0,0,0,0,23,9,44,27,21,27,14]
["MODELO T ELING",22,20,13,{"$f":"\"T-ELECT-\" & $G$14","v":"T-ELECT-05"},"TRANSNEA_INDISPONIBILIDADES_TRAFOS_ELECTROINGENIERIA.XLS",3,5,4,6,7,8,9,11,12,15,16,18,28,17,0,0,29,9,43,29,20,29,15]
["MODELO S ELING",22,20,10,{"$f":"\"SA-ELECT-\" & $G$14","v":"SA-ELECT-05"},"TRANSNEA_INDISPONIBILIDADES_SALIDAS_ELECTROINGENIERIA.XLS",3,5,4,6,7,8,10,11,14,15,21,0,0,0,0,0,33,9,43,22,20,22,14]
["SUP-DPEC",26,25,11,"SUP-DPEC","TRANSNEA_INDISPONIBILIDADES_LINEAS_DPEC.XLS",0,0,0,4,5,6,0,8,9,12,0,24,0,0,0,0,0,0,0,0,0,0,0]
["MODELO VST",19,24,4,{"$f":"\"CAUSAS-VST-\" & $G$14","v":"CAUSAS-VST-05"},"TRANSNEA_CAUSAS_VST.XLS",3,4,5,6,7,0,0,0,0,0,0,0,0,0,0,0,999,999,0,0,0,0,0]