{"text_format":"1","workbook":"xlsx","n_sheets":8,"sheets":["TOT-0216","LI-02 (1)","LI-DPEC-02 (1)","T-02 (1)","T-02 (2)","SA-12 (1)","SUP-DPEC","DATO"],"not_rendered":{"charts":0,"images":2,"macros":1,"external_links":3,"defined_names":25,"comments":0,"pivot_tables":0},"unopened":[],"bounds":{"document_bytes":16777216,"sheet_cells":100000,"rows_first":2000,"rows_last":500,"rows_between":2000,"halvings":0,"cell_chars":16384,"cell_head_chars":4096},"cells_cut":0,"cells_raw":0,"read":"whole","date_system":"1900"}

{"sheet":"TOT-0216","index":0,"n_rows":34,"n_cols":9,"rows_kept":34,"cut":false,"hidden":false,"merged":[]}
[]
[null,"ANEXO II al Memorandum D.T.E.E. N°   294  / 2017"]
[]
["ENTE NACIONAL REGULADOR "]
["DE LA ELECTRICIDAD"]
[]
[null,"SISTEMA DE TRANSPORTE DE ENERGÍA ELÉCTRICA POR DISTRIBUCIÓN TRONCAL"]
[]
[null,"TRANSNEA S.A."]
[]
[null,"TOTAL DE PENALIZACIONES"]
[]
[null,2]
[null,"Desde el 01 al 29 de Febrero de 2016"]
[]
[null,"Sanciones duplicadas por tasa de falla > 4 Sal. x año/100km."]
[]
[null,null,"1.-","LÍNEAS"]
[]
[null,null,null,"1.1.-","Equipamiento propio",null,null,null,{"$f":"'LI-02 (1)'!AA44","v":1756417.62}]
[null,null,null,"1.2.-","Transportista Independiente D.P.E.C.",null,null,null,{"$f":"'LI-DPEC-02 (1)'!AA44","v":8795.91}]
[]
[null,null,"2.-","CONEXIÓN"]
[]
[null,null,null,"2.1.-","Transformación Equipamiento propio",null,null,null,{"$f":"+'T-02 (2)'!$AC$43","v":223735.17}]
[null,null,null,"2.2.-","Salidas Equipamiento propio",null,null,null,{"$f":"+'SA-12 (1)'!$V$43","v":62586.06}]
[]
[null,null,"3.-","SUPERVISIÓN"]
[]
[null,null,null,"3.1.-","Transportista Independiente D.P.E.C.",null,null,null,{"$f":"'SUP-DPEC'!I63","v":2198.3182332388837}]
[]
[]
[]
[null,null,null,null,null,"TOTAL ",{"$f":"SUM(I20:I30)","v":2053733.078233239}]

{"sheet":"LI-02 (1)","index":1,"n_rows":44,"n_cols":27,"rows_kept":44,"cut":false,"hidden":false,"merged":[]}
[]
[null,{"$f":"+'TOT-0216'!B2","v":"ANEXO II al Memorandum D.T.E.E. N°   294  / 2017"}]
[]
[" ENTE NACIONAL REGULADOR "]
["         DE LA ELECTRICIDAD"]
[]
[]
[null,null,null,null,null,"SISTEMA DE TRANSPORTE DE ENERGÍA ELÉCTRICA POR DISTRIBUCIÓN TRONCAL - TRANSNEA S.A."]
[]
[null,null,null,null,null,"1.- LÍNEAS"]
[]
[null,null,null,null,null,"1.1.- Líneas propias"]
[]
[null,{"$f":"+'TOT-0216'!B14","v":"Desde el 01 al 29 de Febrero de 2016"}]
[]
[null,null,null,null,null,"$/100 km-h : LÍNEAS 220 kV ",360.92500000000001]
[null,null,null,null,null,"$/100 km-h : LÍNEAS 132 kV ",345.49299999999999,null,null,null,"FACTOR DE PENALIZACIÓN K =",{"$f":"30*'TOT-0216'!B13","v":60},{"$f":"IF(L17=30,\" \",IF(L17=60,\"Coeficiente duplicado por tasa de falla >4 Sal. x año/100 km.\",\"REVISAR COEFICIENTE\"))","v":"Coeficiente duplicado por tasa de falla >4 Sal. x año/100 km."}]
[null,null,null,null,null,"$/100 km-h : LÍNEAS 33 kV ",345.49299999999999]
[null,null,3,4,5,6,7,8,9,10,11,12,13,14,15,16,17,18,19,20,21,22,23,24,25,26,27]
[null,null,"N°","INDISP","ID EQUIPO","LÍNEAS","U\n[kV]","Long.\n[km]","$/h","Salida","Entrada","Hs.\nIndisp. ","Minutos\nIndisp.","Tipo \nSal.(²)","C.R.\n%","PENALIZAC.\nPROGRAM.","REDUCC.\nPROGRAM.","PENALIZACIÓN FORZADA\nPor Salida    1ras. 3 hs.  hs. Restantes",null,null,"REDUCC. FORZADA\nPor Salida    1ras. 3 hs.  hs. Restantes",null,null,"RESTANTE\nFORZADA","REDUCC.\nRESTANTE","Informó\nenTérm.","TOTAL\nPENALIZAC."]
[]
[]
[null,null,1,261606,748,"STA. CATALINA - RESISTENCIA",132,42,{"$f":"IF(H23>25,H23,25)*IF(G23=220,$G$16,IF(G23=132,$G$17,$G$18))/100","v":145.10705999999999},"2016-02-01","2016-02-29T23:59:59",{"$f":"IF(F23=\"\",\"\",(K23-J23)*24)","v":695.99972222215729},{"$f":"IF(F23=\"\",\"\",ROUND((K23-J23)*24*60,0))","v":41760},"P",{"$f":"IF(F23=\"\",\"\",\"--\")","v":"--"},{"$f":"IF(N23=\"P\",ROUND(M23/60,2)*I23*$L$17*0.01,\"--\")","v":60596.708255999991},{"$f":"IF(N23=\"RP\",ROUND(M23/60,2)*I23*$L$17*0.01*O23/100,\"--\")","v":"--"},{"$f":"IF(N23=\"F\",I23*$L$17,\"--\")","v":"--"},{"$f":"IF(AND(M23>10,N23=\"F\"),I23*$L$17*IF(M23>180,3,ROUND(M23/60,2)),\"--\")","v":"--"},{"$f":"IF(AND(N23=\"F\",M23>180),(ROUND(M23/60,2)-3)*I23*$L$17*0.1,\"--\")","v":"--"},{"$f":"IF(N23=\"R\",I23*$L$17*O23/100,\"--\")","v":"--"},{"$f":"IF(AND(M23>10,N23=\"R\"),I23*$L$17*O23/100*IF(M23>180,3,ROUND(M23/60,2)),\"--\")","v":"--"},{"$f":"IF(AND(N23=\"R\",M23>180),(ROUND(M23/60,2)-3)*I23*$L$17*0.1*O23/100,\"--\")","v":"--"},{"$f":"IF(N23=\"RF\",ROUND(M23/60,2)*I23*$L$17*0.1,\"--\")","v":"--"},{"$f":"IF(N23=\"RR\",ROUND(M23/60,2)*I23*$L$17*0.1*O23/100,\"--\")","v":"--"},"SI",{"$f":"IF(F23=\"\",\"\",SUM(P23:Y23)*IF(Z23=\"SI\",1,2))","v":60596.708255999991}]
[null,null,2,289100,1002,"BARRANQUERAS - CORRIENTES 1",33,11.800000190734863,{"$f":"IF(H24>25,H24,25)*IF(G24=220,$G$16,IF(G24=132,$G$17,$G$18))/100","v":86.373250000000013},"2016-02-01","2016-02-29T23:59:59",{"$f":"IF(F24=\"\",\"\",(K24-J24)*24)","v":695.99972222215729},{"$f":"IF(F24=\"\",\"\",ROUND((K24-J24)*24*60,0))","v":41760},"RF",{"$f":"IF(F24=\"\",\"\",\"--\")","v":"--"},{"$f":"IF(N24=\"P\",ROUND(M24/60,2)*I24*$L$17*0.01,\"--\")","v":"--"},{"$f":"IF(N24=\"RP\",ROUND(M24/60,2)*I24*$L$17*0.01*O24/100,\"--\")","v":"--"},{"$f":"IF(N24=\"F\",I24*$L$17,\"--\")","v":"--"},{"$f":"IF(AND(M24>10,N24=\"F\"),I24*$L$17*IF(M24>180,3,ROUND(M24/60,2)),\"--\")","v":"--"},{"$f":"IF(AND(N24=\"F\",M24>180),(ROUND(M24/60,2)-3)*I24*$L$17*0.1,\"--\")","v":"--"},{"$f":"IF(N24=\"R\",I24*$L$17*O24/100,\"--\")","v":"--"},{"$f":"IF(AND(M24>10,N24=\"R\"),I24*$L$17*O24/100*IF(M24>180,3,ROUND(M24/60,2)),\"--\")","v":"--"},{"$f":"IF(AND(N24=\"R\",M24>180),(ROUND(M24/60,2)-3)*I24*$L$17*0.1*O24/100,\"--\")","v":"--"},{"$f":"IF(N24=\"RF\",ROUND(M24/60,2)*I24*$L$17*0.1,\"--\")","v":360694.69200000004},{"$f":"IF(N24=\"RR\",ROUND(M24/60,2)*I24*$L$17*0.1*O24/100,\"--\")","v":"--"},"SI",{"$f":"IF(F24=\"\",\"\",SUM(P24:Y24)*IF(Z24=\"SI\",1,2))","v":360694.69200000004}]
[null,null,3,291181,946,"PASO DE LOS LIBRES - URUGUAYANA",132,3.9000000953674316,86.373250000000013,"2016-02-01","2016-02-29T23:59:59",695.99972222215729,41760,"RF","--","--","--","--","--","--","--","--","--",360694.69200000004,"--","SI",360694.69200000004]
[null,null,4,296379,1003,"BARRANQUERAS - CORRIENTES 2",33,11.800000190734863,86.373250000000013,"2016-02-01","2016-02-29T23:59:59",695.99972222215729,41760,"RF","--","--","--","--","--","--","--","--","--",360694.69200000004,"--","SI",360694.69200000004]
[null,null,5,298552,4317,"PIRANE - IBARRETA",132,91.800003051757813,317.16258454360963,"2016-02-02T21:16:00","2016-02-02T21:30:00",0.2333333333954215,14,"F","--","--","--",19029.755072616579,4376.8436667018132,"--","--","--","--","--","--","SI",23406.598739318393]
[null,null,6,298691,746,"MONTE CASEROS - CHAJARI",132,74.5,257.39228500000002,"2016-02-09T11:08:00","2016-02-09T11:15:00",0.11666666669771075,7,"F","--","--","--",15443.537100000001,"--","--","--","--","--","--","--","SI",15443.537100000001]
[null,null,7,298707,746,"MONTE CASEROS - CHAJARI",132,74.5,257.39228500000002,"2016-02-09T13:01:00","2016-02-09T13:07:00",9.9999999976716936E-2,6,"F","--","--","--",15443.537100000001,"--","--","--","--","--","--","--","SI",15443.537100000001]
[null,null,8,298723,746,"MONTE CASEROS - CHAJARI",132,74.5,257.39228500000002,"2016-02-09T13:46:00","2016-02-09T19:15:00",5.4833333333954215,329,"F","--","--","--",15443.537100000001,46330.611300000004,3829.9972008000013,"--","--","--","--","--","SI",65604.14560080001]
[null,null,9,298746,742,"CORRIENTES - RESISTENCIA",132,33,114.01269000000001,"2016-02-11T12:50:00","2016-02-13T20:22:00",55.533333333441988,3332,"F","--","--","--",6840.7614000000003,20522.284200000002,35934.519634200005,"--","--","--","--","--","SI",63297.56523420001]
[null,null,10,298772,5556,"FORMOSA I - MANSILLA   1",132,60.6,209.36875800000001,"2016-02-14T13:22:00","2016-02-14T14:17:00",0.91666666668606922,55,"F","--","--","--",12562.125480000001,11557.155441600002,"--","--","--","--","--","--","SI",24119.280921600002]
[null,null,11,299126,746,"MONTE CASEROS - CHAJARI",132,74.5,257.39228500000002,"2016-02-16T07:23:00","2016-02-16T08:03:00",0.66666666674427688,40,"F","--","--","--",15443.537100000001,10347.169857000001,"--","--","--","--","--","--","SI",25790.706957000002]
[null,null,12,299142,743,"SALTO GRANDE  AR - CHAJARI",132,60.900001525878906,210.40524227180481,"2016-02-17T07:55:00","2016-02-17T12:57:00",5.0333333333255723,302,"F","--","--","--",12624.314536308288,37872.943608924863,2562.7358508705829,"--","--","--","--","--","SI",53059.993996103731]
[null,null,13,299159,5047,"GRAN FORMOSA - CLORINDA   1",132,103.5,357.58525499999996,"2016-02-18T07:07:00","2016-02-18T11:58:00",4.8500000000931323,291,"P","--",1040.5730920499998,"--","--","--","--","--","--","--","--","--","SI",1040.5730920499998]
[null,null,14,299178,743,"SALTO GRANDE  AR - CHAJARI",132,60.900001525878906,210.40524227180481,"2016-02-19T09:12:00","2016-02-19T13:46:00",4.5666666667093523,274,"F","--","--","--",12624.314536308288,37872.943608924863,1982.0173822004017,"--","--","--","--","--","SI",52479.27552743355]
[null,null,15,299457,746,"MONTE CASEROS - CHAJARI",132,74.5,257.39228500000002,"2016-02-19T13:57:00","2016-02-22T20:30:00",78.549999999871943,4713,"F","--","--","--",15443.537100000001,46330.611300000004,116675.92279050002,"--","--","--","--","--","SI",178450.07119050002]
[null,null,16,299265,739,"BARRANQUERAS - RESISTENCIA   1",132,31.4,108.484802,"2016-02-19T14:34:00","2016-02-19T19:36:00",5.0333333333255723,302,"F","--","--","--",6509.0881200000003,19527.264360000001,1321.3448883600004,"--","--","--","--","--","SI",27357.697368360001]
[null,null,17,299266,4800,"RESISTENCIA - BARRANQUERAS   1(RESIS. NOR.)",132,12.6,86.373250000000013,"2016-02-19T14:34:00","2016-02-19T21:14:00",6.6666666667442769,400,"F","--","--","--",5182.3950000000004,15547.185000000001,1901.9389650000005,"--","--","--","--","--","SI",22631.518965000003]
[null,null,18,299295,742,"CORRIENTES - RESISTENCIA",132,33,114.01269000000001,"2016-02-21T01:57:00","2016-02-21T11:24:00",9.4499999998952262,567,"F","--","--","--",6840.7614000000003,20522.284200000002,4412.2911029999996,"--","--","--","--","--","SI",31775.336703000001]
[null,null,19,299570,4800,"RESISTENCIA - BARRANQUERAS   1(RESIS. NOR.)",132,12.6,{"$f":"IF(H41>25,H41,25)*IF(G41=220,$G$16,IF(G41=132,$G$17,$G$18))/100","v":86.373250000000013},"2016-02-22T11:50:00","2016-02-22T13:30:00",{"$f":"IF(F41=\"\",\"\",(K41-J41)*24)","v":1.6666666666860692},{"$f":"IF(F41=\"\",\"\",ROUND((K41-J41)*24*60,0))","v":100},"F",{"$f":"IF(F41=\"\",\"\",\"--\")","v":"--"},{"$f":"IF(N41=\"P\",ROUND(M41/60,2)*I41*$L$17*0.01,\"--\")","v":"--"},{"$f":"IF(N41=\"RP\",ROUND(M41/60,2)*I41*$L$17*0.01*O41/100,\"--\")","v":"--"},{"$f":"IF(N41=\"F\",I41*$L$17,\"--\")","v":5182.3950000000004},{"$f":"IF(AND(M41>10,N41=\"F\"),I41*$L$17*IF(M41>180,3,ROUND(M41/60,2)),\"--\")","v":8654.5996500000001},{"$f":"IF(AND(N41=\"F\",M41>180),(ROUND(M41/60,2)-3)*I41*$L$17*0.1,\"--\")","v":"--"},{"$f":"IF(N41=\"R\",I41*$L$17*O41/100,\"--\")","v":"--"},{"$f":"IF(AND(M41>10,N41=\"R\"),I41*$L$17*O41/100*IF(M41>180,3,ROUND(M41/60,2)),\"--\")","v":"--"},{"$f":"IF(AND(N41=\"R\",M41>180),(ROUND(M41/60,2)-3)*I41*$L$17*0.1*O41/100,\"--\")","v":"--"},{"$f":"IF(N41=\"RF\",ROUND(M41/60,2)*I41*$L$17*0.1,\"--\")","v":"--"},{"$f":"IF(N41=\"RR\",ROUND(M41/60,2)*I41*$L$17*0.1*O41/100,\"--\")","v":"--"},{"$f":"IF(F41=\"\",\"\",\"SI\")","v":"SI"},13836.994650000001]
[null,null,null,null,null,null,null,null,{"$f":"IF(H42>25,H42,25)*IF(G42=220,$G$16,IF(G42=132,$G$17,$G$18))/100","v":86.373250000000013},null,null,{"$f":"IF(F42=\"\",\"\",(K42-J42)*24)","v":""},{"$f":"IF(F42=\"\",\"\",ROUND((K42-J42)*24*60,0))","v":""},null,{"$f":"IF(F42=\"\",\"\",\"--\")","v":""},{"$f":"IF(N42=\"P\",ROUND(M42/60,2)*I42*$L$17*0.01,\"--\")","v":"--"},{"$f":"IF(N42=\"RP\",ROUND(M42/60,2)*I42*$L$17*0.01*O42/100,\"--\")","v":"--"},{"$f":"IF(N42=\"F\",I42*$L$17,\"--\")","v":"--"},{"$f":"IF(AND(M42>10,N42=\"F\"),I42*$L$17*IF(M42>180,3,ROUND(M42/60,2)),\"--\")","v":"--"},{"$f":"IF(AND(N42=\"F\",M42>180),(ROUND(M42/60,2)-3)*I42*$L$17*0.1,\"--\")","v":"--"},{"$f":"IF(N42=\"R\",I42*$L$17*O42/100,\"--\")","v":"--"},{"$f":"IF(AND(M42>10,N42=\"R\"),I42*$L$17*O42/100*IF(M42>180,3,ROUND(M42/60,2)),\"--\")","v":"--"},{"$f":"IF(AND(N42=\"R\",M42>180),(ROUND(M42/60,2)-3)*I42*$L$17*0.1*O42/100,\"--\")","v":"--"},{"$f":"IF(N42=\"RF\",ROUND(M42/60,2)*I42*$L$17*0.1,\"--\")","v":"--"},{"$f":"IF(N42=\"RR\",ROUND(M42/60,2)*I42*$L$17*0.1*O42/100,\"--\")","v":"--"},{"$f":"IF(F42=\"\",\"\",\"SI\")","v":""},""]
[]
[null,null,"(²)","P - PROGRAMADA  ; F - FORZADA  ; RF - RESTANTE FORZADA",null,null,null,null,null,null,null,null,null,null,null,{"$f":"SUM(P21:P43)","v":61637.28134804999},{"$f":"SUM(Q21:Q43)","v":0},{"$f":"SUM(R21:R43)","v":164613.59604523313},279461.89619315154,168620.76781493102,0,0,0,1082084.0760000001,0,null,{"$f":"ROUND(SUM(AA21:AA43),2)","v":1756417.62}]

{"sheet":"LI-DPEC-02 (1)","index":2,"n_rows":44,"n_cols":27,"rows_kept":44,"cut":false,"hidden":false,"merged":[]}
[]
[null,{"$f":"'TOT-0216'!B2","v":"ANEXO II al Memorandum D.T.E.E. N°   294  / 2017"}]
[]
[" ENTE NACIONAL REGULADOR "]
["       DE LA ELECTRICIDAD"]
[]
[]
[null,null,null,null,null,"SISTEMA DE TRANSPORTE DE ENERGÍA ELÉCTRICA POR DISTRIBUCIÓN TRONCAL - TRANSNEA S.A."]
[]
[null,null,null,null,null,"1.2.-Transportista Independiente - Dirección Provincial de Energía de Corrientes (D.P.E.C.)"]
[]
[null,{"$f":"'TOT-0216'!B14","v":"Desde el 01 al 29 de Febrero de 2016"}]
[]
[]
[null,null,null,null,null,"$/100 km-h : LÍNEAS 220 kV "," - "]
[null,null,null,null,null,"$/100 km-h : LÍNEAS 132 kV ",145.14699999999999,null,null,null,"FACTOR DE PENALIZACIÓN K =",{"$f":"30*'TOT-0216'!B13","v":60},{"$f":"IF(L16=30,\" \",IF(L16=60,\"Coeficiente duplicado por tasa de falla >4 Sal. x año/100 km.\",\"REVISAR COEFICIENTE\"))","v":"Coeficiente duplicado por tasa de falla >4 Sal. x año/100 km."}]
[null,null,null,null,null,"$/100 km-h : LÍNEAS 66 kV "," - "]
[]
[null,null,3,4,5,6,7,8,9,10,11,12,13,14,15,16,17,18,19,20,21,22,23,24,25,26,27]
[null,null,"N°","INDISP","ID EQUIPO","LÍNEAS","U\n[kV]","Long.\n[km]","$/h","Salida","Entrada","Hs.\nIndisp. ","Minutos\nIndisp.","Tipo \nSal.(²)","C.R.\n%","PENALIZAC.\nPROGRAM.","REDUCC.\nPROGRAM.","PENALIZACIÓN FORZADA\nPor Salida    1ras. 3 hs.  hs. Restantes",null,null,"REDUCC. FORZADA\nPor Salida    1ras. 3 hs.  hs. Restantes",null,null,"RESTANTE\nFORZADA","REDUCC.\nRESTANTE","Informó\nenTérm.","TOTAL\nPENALIZAC."]
[]
[]
[null,null,46,299321,1001,"PASO DE LOS LIBRES - MONTE CASEROS",132,101,{"$f":"IF(H23>25,H23,25)*IF(G23=220,$G$15,IF(G23=132,$G$16,$G$17))/100","v":146.59846999999999},"2016-02-21T22:33:00","2016-02-21T22:41:00",{"$f":"IF(F23=\"\",\"\",(K23-J23)*24)","v":0.13333333341870457},{"$f":"IF(F23=\"\",\"\",ROUND((K23-J23)*24*60,0))","v":8},"F",{"$f":"IF(F23=\"\",\"\",\"--\")","v":"--"},{"$f":"IF(N23=\"P\",ROUND(M23/60,2)*I23*$L$16*0.01,\"--\")","v":"--"},{"$f":"IF(N23=\"RP\",ROUND(M23/60,2)*I23*$L$16*0.01*O23/100,\"--\")","v":"--"},{"$f":"IF(N23=\"F\",I23*$L$16,\"--\")","v":8795.9081999999999},{"$f":"IF(AND(M23>10,N23=\"F\"),I23*$L$16*IF(M23>180,3,ROUND(M23/60,2)),\"--\")","v":"--"},{"$f":"IF(AND(N23=\"F\",M23>180),(ROUND(M23/60,2)-3)*I23*$L$16*0.1,\"--\")","v":"--"},{"$f":"IF(N23=\"R\",I23*$L$16*O23/100,\"--\")","v":"--"},{"$f":"IF(AND(M23>10,N23=\"R\"),I23*$L$16*O23/100*IF(M23>180,3,ROUND(M23/60,2)),\"--\")","v":"--"},{"$f":"IF(AND(N23=\"R\",M23>180),(ROUND(M23/60,2)-3)*I23*$L$16*0.1*O23/100,\"--\")","v":"--"},{"$f":"IF(N23=\"RF\",ROUND(M23/60,2)*I23*$L$16*0.1,\"--\")","v":"--"},{"$f":"IF(N23=\"RR\",ROUND(M23/60,2)*I23*$L$16*0.1*O23/100,\"--\")","v":"--"},"SI",{"$f":"IF(F23=\"\",\"\",SUM(P23:Y23)*IF(Z23=\"SI\",1,2))","v":8795.9081999999999}]
[null,null,null,null,null,null,null,null,{"$f":"IF(H24>25,H24,25)*IF(G24=220,$G$15,IF(G24=132,$G$16,$G$17))/100","v":{"$error":"#VALUE!"}},null,null,"",{"$f":"IF(F24=\"\",\"\",ROUND((K24-J24)*24*60,0))","v":""},null,"","--","--","--","--","--","--","--","--",{"$f":"IF(N24=\"RF\",ROUND(M24/60,2)*I24*$L$16*0.1,\"--\")","v":"--"},{"$f":"IF(N24=\"RR\",ROUND(M24/60,2)*I24*$L$16*0.1*O24/100,\"--\")","v":"--"},null,{"$f":"IF(F24=\"\",\"\",SUM(P24:Y24)*IF(Z24=\"SI\",1,2))","v":""}]
[null,null,null,null,null,null,null,null,{"$error":"#VALUE!"},null,null,"","",null,"","--","--","--","--","--","--","--","--","--","--",{"$f":"IF(F25=\"\",\"\",\"SI\")","v":""},""]
[null,null,null,null,null,null,null,null,{"$error":"#VALUE!"},null,null,"","",null,"","--","--","--","--","--","--","--","--","--","--","",""]
[null,null,null,null,null,null,null,null,{"$error":"#VALUE!"},null,null,"","",null,"","--","--","--","--","--","--","--","--","--","--","",""]
[null,null,null,null,null,null,null,null,{"$error":"#VALUE!"},null,null,"","",null,"","--","--","--","--","--","--","--","--","--","--","",""]
[null,null,null,null,null,null,null,null,{"$error":"#VALUE!"},null,null,"","",null,"","--","--","--","--","--","--","--","--","--","--","",""]
[null,null,null,null,null,null,null,null,{"$error":"#VALUE!"},null,null,"","",null,"","--","--","--","--","--","--","--","--","--","--","",""]
[null,null,null,null,null,null,null,null,{"$error":"#VALUE!"},null,null,"","",null,"","--","--","--","--","--","--","--","--","--","--","",""]
[null,null,null,null,null,null,null,null,{"$error":"#VALUE!"},null,null,"","",null,"","--","--","--","--","--","--","--","--","--","--","",""]
[null,null,null,null,null,null,null,null,{"$error":"#VALUE!"},null,null,"","",null,"","--","--","--","--","--","--","--","--","--","--","",""]
[null,null,null,null,null,null,null,null,{"$error":"#VALUE!"},null,null,"","",null,"","--","--","--","--","--","--","--","--","--","--","",""]
[null,null,null,null,null,null,null,null,{"$error":"#VALUE!"},null,null,"","",null,"","--","--","--","--","--","--","--","--","--","--","",""]
[null,null,null,null,null,null,null,null,{"$error":"#VALUE!"},null,null,"","",null,"","--","--","--","--","--","--","--","--","--","--","",""]
[null,null,null,null,null,null,null,null,{"$error":"#VALUE!"},null,null,"","",null,"","--","--","--","--","--","--","--","--","--","--","",""]
[null,null,null,null,null,null,null,null,{"$error":"#VALUE!"},null,null,"","",null,"","--","--","--","--","--","--","--","--","--","--","",""]
[null,null,null,null,null,null,null,null,{"$error":"#VALUE!"},null,null,"","",null,"","--","--","--","--","--","--","--","--","--","--","",""]
[null,null,null,null,null,null,null,null,{"$f":"IF(H40>25,H40,25)*IF(G40=220,$G$15,IF(G40=132,$G$16,$G$17))/100","v":{"$error":"#VALUE!"}},null,null,"",{"$f":"IF(F40=\"\",\"\",ROUND((K40-J40)*24*60,0))","v":""},null,"","--","--","--","--","--","--","--","--",{"$f":"IF(N40=\"RF\",ROUND(M40/60,2)*I40*$L$16*0.1,\"--\")","v":"--"},{"$f":"IF(N40=\"RR\",ROUND(M40/60,2)*I40*$L$16*0.1*O40/100,\"--\")","v":"--"},"",""]
[null,null,null,null,null,null,null,null,{"$f":"IF(H41>25,H41,25)*IF(G41=220,$G$15,IF(G41=132,$G$16,$G$17))/100","v":{"$error":"#VALUE!"}},null,null,"",{"$f":"IF(F41=\"\",\"\",ROUND((K41-J41)*24*60,0))","v":""},null,"","--","--","--","--","--","--","--","--",{"$f":"IF(N41=\"RF\",ROUND(M41/60,2)*I41*$L$16*0.1,\"--\")","v":"--"},{"$f":"IF(N41=\"RR\",ROUND(M41/60,2)*I41*$L$16*0.1*O41/100,\"--\")","v":"--"},"",""]
[null,null,null,null,null,null,null,null,{"$f":"IF(H42>25,H42,25)*IF(G42=220,$G$15,IF(G42=132,$G$16,$G$17))/100","v":{"$error":"#VALUE!"}},null,null,"",{"$f":"IF(F42=\"\",\"\",ROUND((K42-J42)*24*60,0))","v":""},null,"","--","--","--","--","--","--","--","--",{"$f":"IF(N42=\"RF\",ROUND(M42/60,2)*I42*$L$16*0.1,\"--\")","v":"--"},{"$f":"IF(N42=\"RR\",ROUND(M42/60,2)*I42*$L$16*0.1*O42/100,\"--\")","v":"--"},"",""]
[]
[null,null,"(²)","F - FORZADA",null,null,null,null,null,null,null,null,null,null,null,{"$f":"SUM(P21:P43)","v":0},0,8795.9081999999999,0,0,0,0,0,0,0,null,{"$f":"ROUND(SUM(AA21:AA43),2)","v":8795.91}]

{"sheet":"T-02 (1)","index":3,"n_rows":46,"n_cols":29,"rows_kept":46,"cut":false,"hidden":false,"merged":[]}
[]
[null,{"$f":"+'TOT-0216'!B2","v":"ANEXO II al Memorandum D.T.E.E. N°   294  / 2017"}]
[]
[" ENTE NACIONAL REGULADOR "]
["       DE LA ELECTRICIDAD"]
[]
[]
[null,null,null,null,null,"SISTEMA DE TRANSPORTE DE ENERGÍA ELÉCTRICA POR DISTRIBUCIÓN TRONCAL - TRANSNEA S.A."]
[]
[null,null,null,null,null,"2.- CONEXIÓN"]
[]
[null,null,null,null,null,"2.1.- Transformación"]
[]
[null,{"$f":"+'TOT-0216'!B14","v":"Desde el 01 al 29 de Febrero de 2016"}]
[]
[null,null,null,null,null,"Por Transformador  [$ / h - MVA]  =",null,null,1.2350000000000001]
[null,null,null,null,null,"Coeficiente de penalización por salida forzada   =",null,null,{"$f":"30*'TOT-0216'!B13","v":60},null,{"$f":"IF(I17=30,\" \",IF(I17=60,\"  Coeficiente duplicado por tasa de falla >4 Sal. x año/100 km.\",\"  REVISAR COEFICIENTE\"))","v":"  Coeficiente duplicado por tasa de falla >4 Sal. x año/100 km."}]
[null,null,3,4,5,6,7,8,9,10,11,12,13,14,15,16,17,18,19,20,21,22,23,24,25,26,27,28,29]
[null,null,"N°","INDISP","ID EQUIPO","ESTACIÓN\nTRANSFORMADORA","EQUIPO","POT.\n[MVA]","U\n[kV]","$/h","Salida","Entrada","Hs.\nIndisp.","Mtos.\nIndisp.","Tipo \nSal.(²)","AUT.","C.R.\n%","E.N.S.","K (P;ENS)","PENALIZ.\nPROGRAM.","REDUCC.\nPROGRAM.","PENALIZACIÓN FORZADA\nPor Salida    hs. Restantes",null,"REDUCC. FORZADA\nPor Salida    hs. Restantes",null,"RESTANTE\nFORZADA","REDUCC.\nRESTANTE","Informó\nenTérm.","TOTAL\nPENALIZAC."]
[]
[]
[null,null,20,296361,752,"BARRANQUERAS","TRAFO 7",30,"132/33/13,2",{"$f":"H22*$I$16","v":37.050000000000004},"2016-02-01","2016-02-19T14:33:00",{"$f":"IF(F22=\"\",\"\",(L22-K22)*24)","v":446.54999999993015},{"$f":"IF(F22=\"\",\"\",ROUND((L22-K22)*24*60,0))","v":26793},"RP",{"$f":"IF(F22=\"\",\"\",IF(OR(O22=\"P\",O22=\"RP\"),\"--\",\"NO\"))","v":"--"},50,{"$f":"IF(F22=\"\",\"\",\"NO\")","v":"NO"},{"$f":"$I$17*IF(OR(O22=\"P\",O22=\"RP\"),0.1,1)*IF(R22=\"SI\",1,0.1)","v":0.60000000000000009},{"$f":"IF(O22=\"P\",J22*S22*ROUND(N22/60,2),\"--\")","v":"--"},{"$f":"IF(O22=\"RP\",J22*S22*ROUND(N22/60,2)*Q22/100,\"--\")","v":4963.4032500000021},{"$f":"IF(AND(O22=\"F\",P22=\"NO\"),J22*S22,\"--\")","v":"--"},{"$f":"IF(O22=\"F\",J22*S22*ROUND(N22/60,2),\"--\")","v":"--"},{"$f":"IF(AND(O22=\"R\",P22=\"NO\"),J22*S22*Q22/100,\"--\")","v":"--"},{"$f":"IF(O22=\"R\",J22*S22*ROUND(N22/60,2)*Q22/100,\"--\")","v":"--"},{"$f":"IF(O22=\"RF\",J22*S22*ROUND(N22/60,2),\"--\")","v":"--"},{"$f":"IF(O22=\"RR\",J22*S22*ROUND(N22/60,2)*Q22/100,\"--\")","v":"--"},"SI",{"$f":"IF(F22=\"\",\"\",SUM(T22:AA22)*IF(AB22=\"SI\",1,2))","v":4963.4032500000021}]
[null,null,21,298565,768,"GOYA","TRAFO 2",15,"132/33/13,2",{"$f":"H23*$I$16","v":18.525000000000002},"2016-02-06T11:14:00","2016-02-06T11:38:00",{"$f":"IF(F23=\"\",\"\",(L23-K23)*24)","v":0.40000000008149073},{"$f":"IF(F23=\"\",\"\",ROUND((L23-K23)*24*60,0))","v":24},"F",{"$f":"IF(F23=\"\",\"\",IF(OR(O23=\"P\",O23=\"RP\"),\"--\",\"NO\"))","v":"NO"},"0,000","SI",{"$f":"$I$17*IF(OR(O23=\"P\",O23=\"RP\"),0.1,1)*IF(R23=\"SI\",1,0.1)","v":60},{"$f":"IF(O23=\"P\",J23*S23*ROUND(N23/60,2),\"--\")","v":"--"},{"$f":"IF(O23=\"RP\",J23*S23*ROUND(N23/60,2)*Q23/100,\"--\")","v":"--"},{"$f":"IF(AND(O23=\"F\",P23=\"NO\"),J23*S23,\"--\")","v":1111.5000000000002},{"$f":"IF(O23=\"F\",J23*S23*ROUND(N23/60,2),\"--\")","v":444.60000000000014},{"$f":"IF(AND(O23=\"R\",P23=\"NO\"),J23*S23*Q23/100,\"--\")","v":"--"},{"$f":"IF(O23=\"R\",J23*S23*ROUND(N23/60,2)*Q23/100,\"--\")","v":"--"},{"$f":"IF(O23=\"RF\",J23*S23*ROUND(N23/60,2),\"--\")","v":"--"},{"$f":"IF(O23=\"RR\",J23*S23*ROUND(N23/60,2)*Q23/100,\"--\")","v":"--"},"SI",{"$f":"IF(F23=\"\",\"\",SUM(T23:AA23)*IF(AB23=\"SI\",1,2))","v":1556.1000000000004}]
[null,null,"21a",298565,768,"GOYA","TRAFO 2",15,"132/33/13,2",{"$f":"H24*$I$16","v":18.525000000000002},"2016-02-06T11:38:00","2016-02-06T14:32:00",{"$f":"IF(F24=\"\",\"\",(L24-K24)*24)","v":2.9000000000232831},{"$f":"IF(F24=\"\",\"\",ROUND((L24-K24)*24*60,0))","v":174},"RF",{"$f":"IF(F24=\"\",\"\",IF(OR(O24=\"P\",O24=\"RP\"),\"--\",\"NO\"))","v":"NO"},"0,000","NO",{"$f":"$I$17*IF(OR(O24=\"P\",O24=\"RP\"),0.1,1)*IF(R24=\"SI\",1,0.1)","v":6},{"$f":"IF(O24=\"P\",J24*S24*ROUND(N24/60,2),\"--\")","v":"--"},{"$f":"IF(O24=\"RP\",J24*S24*ROUND(N24/60,2)*Q24/100,\"--\")","v":"--"},{"$f":"IF(AND(O24=\"F\",P24=\"NO\"),J24*S24,\"--\")","v":"--"},{"$f":"IF(O24=\"F\",J24*S24*ROUND(N24/60,2),\"--\")","v":"--"},{"$f":"IF(AND(O24=\"R\",P24=\"NO\"),J24*S24*Q24/100,\"--\")","v":"--"},{"$f":"IF(O24=\"R\",J24*S24*ROUND(N24/60,2)*Q24/100,\"--\")","v":"--"},{"$f":"IF(O24=\"RF\",J24*S24*ROUND(N24/60,2),\"--\")","v":322.33499999999998},{"$f":"IF(O24=\"RR\",J24*S24*ROUND(N24/60,2)*Q24/100,\"--\")","v":"--"},"SI",{"$f":"IF(F24=\"\",\"\",SUM(T24:AA24)*IF(AB24=\"SI\",1,2))","v":322.33499999999998}]
[null,null,22,298569,759,"CORRIENTES","TRAFO 3",30,"132/33/13,2",37.050000000000004,"2016-02-07T03:38:00","2016-02-07T04:29:00",0.84999999997671694,51,"R","NO",60,"SI",60,"--","--","--","--",1333.8000000000002,1133.7300000000002,"--","--","SI",2467.5300000000007]
[null,null,23,298570,3625,"CORRIENTES","TRAFO 4",50,"132/33/13,2",61.750000000000007,"2016-02-07T03:38:00","2016-02-07T04:29:00",0.84999999997671694,51,"R","NO",60,"SI",60,"--","--","--","--",2223.0000000000005,1889.5500000000002,"--","--","SI",4112.5500000000011]
[null,null,24,298739,4263,"BELLA VISTA","TRAFO 3",7.5,"132/33/13.2",9.2625000000000011,"2016-02-11T01:57:00","2016-02-11T02:04:00",0.11666666652308777,7,"F","NO","0,000","SI",60,"--","--",555.75000000000011,66.690000000000012,"--","--","--","--","SI",622.44000000000017]
[null,null,25,299160,4866,"CLORINDA","TRAFO 3",150,"220/132/13,2",185.25000000000003,"2016-02-18T23:51:00","2016-02-19T00:35:00",0.73333333327900618,44,"F","NO","0,000","SI",60,"--","--",11115.000000000002,8113.9500000000007,"--","--","--","--","SI",19228.950000000004]
[null,null,26,299243,771,"SANTA CATALINA","TRAFO 1",30,"132/33/13,2",37.050000000000004,"2016-02-19T13:59:00","2016-02-19T17:35:00",3.6000000000349246,216,"F","NO","0,000","SI",60,"--","--",2223.0000000000005,8002.800000000002,"--","--","--","--","SI",10225.800000000003]
[null,null,"26a",299243,771,"SANTA CATALINA","TRAFO 1",30,"132/33/13,2",{"$f":"H30*$I$16","v":37.050000000000004},"2016-02-19T17:35:00","2016-02-29T23:59:00",{"$f":"IF(F30=\"\",\"\",(L30-K30)*24)","v":246.39999999990687},{"$f":"IF(F30=\"\",\"\",ROUND((L30-K30)*24*60,0))","v":14784},"RF",{"$f":"IF(F30=\"\",\"\",IF(OR(O30=\"P\",O30=\"RP\"),\"--\",\"NO\"))","v":"NO"},"0,000","NO",{"$f":"$I$17*IF(OR(O30=\"P\",O30=\"RP\"),0.1,1)*IF(R30=\"SI\",1,0.1)","v":6},{"$f":"IF(O30=\"P\",J30*S30*ROUND(N30/60,2),\"--\")","v":"--"},{"$f":"IF(O30=\"RP\",J30*S30*ROUND(N30/60,2)*Q30/100,\"--\")","v":"--"},{"$f":"IF(AND(O30=\"F\",P30=\"NO\"),J30*S30,\"--\")","v":"--"},{"$f":"IF(O30=\"F\",J30*S30*ROUND(N30/60,2),\"--\")","v":"--"},{"$f":"IF(AND(O30=\"R\",P30=\"NO\"),J30*S30*Q30/100,\"--\")","v":"--"},{"$f":"IF(O30=\"R\",J30*S30*ROUND(N30/60,2)*Q30/100,\"--\")","v":"--"},{"$f":"IF(O30=\"RF\",J30*S30*ROUND(N30/60,2),\"--\")","v":54774.720000000001},{"$f":"IF(O30=\"RR\",J30*S30*ROUND(N30/60,2)*Q30/100,\"--\")","v":"--"},"SI",{"$f":"IF(F30=\"\",\"\",SUM(T30:AA30)*IF(AB30=\"SI\",1,2))","v":54774.720000000001}]
[null,null,27,299244,772,"SANTA CATALINA","TRAFO 2",30,"132/33/13,2",37.050000000000004,"2016-02-19T13:59:00","2016-02-19T17:35:00",3.6000000000349246,216,"F","NO","0,000","SI",60,"--","--",2223.0000000000005,8002.800000000002,"--","--","--","--","SI",10225.800000000003]
[null,null,28,299245,773,"SANTA CATALINA","TRAFO 3",30,"132/33/13,2",37.050000000000004,"2016-02-19T13:59:00","2016-02-19T17:35:00",3.6000000000349246,216,"F","NO","0,000","SI",60,"--","--",2223.0000000000005,8002.800000000002,"--","--","--","--","SI",10225.800000000003]
[null,null,29,299246,4072,"SANTA CATALINA","TRAFO 4",30,"132/33/13,2",37.050000000000004,"2016-02-19T13:59:00","2016-02-19T17:37:00",3.6333333333022892,218,"F","NO","0,000","SI",60,"--","--",2223.0000000000005,8069.4900000000016,"--","--","--","--","SI",10292.490000000002]
[null,null,30,299247,4719,"SANTA CATALINA","TRAFO 5",30,"132/33/13.2",37.050000000000004,"2016-02-19T13:59:00","2016-02-19T17:35:00",3.6000000000349246,216,"F","NO","0,000","SI",60,"--","--",2223.0000000000005,8002.800000000002,"--","--","--","--","SI",10225.800000000003]
[null,null,31,299125,752,"BARRANQUERAS","TRAFO 7",30,"132/33/13,2",37.050000000000004,"2016-02-19T17:37:00","2016-02-29T23:59:00",246.3666666666395,14782,"RP","--",50,"NO",0.60000000000000009,"--",2738.4025500000012,"--","--","--","--","--","--","SI",2738.4025500000012]
[null,null,32,299596,4263,"BELLA VISTA","TRAFO 3",7.5,"132/33/13.2",9.2625000000000011,"2016-02-24T15:18:00","2016-02-24T15:23:00",8.3333333430346102E-2,5,"R","NO",60,"SI",60,"--","--","--","--",333.45000000000005,26.676000000000002,"--","--","SI",360.12600000000003]
[null,null,33,299599,759,"CORRIENTES","TRAFO 3",30,"132/33/13,2",37.050000000000004,"2016-02-25T02:06:00","2016-02-25T02:48:00",0.70000000001164153,42,"F","NO","0,000","SI",60,"--","--",2223.0000000000005,1556.1000000000001,"--","--","--","--","SI",3779.1000000000004]
[null,null,"33a",299599,759,"CORRIENTES","TRAFO 3",30,"132/33/13,2",{"$f":"H38*$I$16","v":37.050000000000004},"2016-02-25T02:48:00","2016-02-25T06:49:00",{"$f":"IF(F38=\"\",\"\",(L38-K38)*24)","v":4.0166666666627862},{"$f":"IF(F38=\"\",\"\",ROUND((L38-K38)*24*60,0))","v":241},"RF",{"$f":"IF(F38=\"\",\"\",IF(OR(O38=\"P\",O38=\"RP\"),\"--\",\"NO\"))","v":"NO"},"0,000","NO",{"$f":"$I$17*IF(OR(O38=\"P\",O38=\"RP\"),0.1,1)*IF(R38=\"SI\",1,0.1)","v":6},{"$f":"IF(O38=\"P\",J38*S38*ROUND(N38/60,2),\"--\")","v":"--"},{"$f":"IF(O38=\"RP\",J38*S38*ROUND(N38/60,2)*Q38/100,\"--\")","v":"--"},{"$f":"IF(AND(O38=\"F\",P38=\"NO\"),J38*S38,\"--\")","v":"--"},{"$f":"IF(O38=\"F\",J38*S38*ROUND(N38/60,2),\"--\")","v":"--"},{"$f":"IF(AND(O38=\"R\",P38=\"NO\"),J38*S38*Q38/100,\"--\")","v":"--"},{"$f":"IF(O38=\"R\",J38*S38*ROUND(N38/60,2)*Q38/100,\"--\")","v":"--"},{"$f":"IF(O38=\"RF\",J38*S38*ROUND(N38/60,2),\"--\")","v":893.64599999999996},{"$f":"IF(O38=\"RR\",J38*S38*ROUND(N38/60,2)*Q38/100,\"--\")","v":"--"},"SI",{"$f":"IF(F38=\"\",\"\",SUM(T38:AA38)*IF(AB38=\"SI\",1,2))","v":893.64599999999996}]
[null,null,34,299600,3625,"CORRIENTES","TRAFO 4",50,"132/33/13,2",61.750000000000007,"2016-02-25T02:06:00","2016-02-25T02:48:00",0.70000000001164153,42,"R","NO",60,"SI",60,"--","--","--","--",2223.0000000000005,1556.1,"--","--","SI",3779.1000000000004]
[null,null,35,299618,3625,"CORRIENTES","TRAFO 4",50,"132/33/13,2",61.750000000000007,"2016-02-25T04:51:00","2016-02-25T05:04:00",0.21666666667442769,13,"R","NO",60,"SI",60,"--","--","--","--",2223.0000000000005,489.06000000000006,"--","--","SI",2712.0600000000004]
[null,null,36,299636,772,"SANTA CATALINA","TRAFO 2",30,"132/33/13,2",37.050000000000004,"2016-02-26T20:35:00","2016-02-26T22:28:00",1.8833333333604969,113,"R","NO",40,"SI",60,"--","--","--","--",889.20000000000016,1671.6960000000004,"--","--","SI",2560.8960000000006]
[null,null,37,299637,4072,"SANTA CATALINA","TRAFO 4",30,"132/33/13,2",{"$f":"H42*$I$16","v":37.050000000000004},"2016-02-26T20:35:00","2016-02-26T22:28:00",{"$f":"IF(F42=\"\",\"\",(L42-K42)*24)","v":1.8833333333604969},{"$f":"IF(F42=\"\",\"\",ROUND((L42-K42)*24*60,0))","v":113},"R","NO",60,"SI",{"$f":"$I$17*IF(OR(O42=\"P\",O42=\"RP\"),0.1,1)*IF(R42=\"SI\",1,0.1)","v":60},{"$f":"IF(O42=\"P\",J42*S42*ROUND(N42/60,2),\"--\")","v":"--"},{"$f":"IF(O42=\"RP\",J42*S42*ROUND(N42/60,2)*Q42/100,\"--\")","v":"--"},{"$f":"IF(AND(O42=\"F\",P42=\"NO\"),J42*S42,\"--\")","v":"--"},{"$f":"IF(O42=\"F\",J42*S42*ROUND(N42/60,2),\"--\")","v":"--"},{"$f":"IF(AND(O42=\"R\",P42=\"NO\"),J42*S42*Q42/100,\"--\")","v":1333.8000000000002},{"$f":"IF(O42=\"R\",J42*S42*ROUND(N42/60,2)*Q42/100,\"--\")","v":2507.5440000000003},{"$f":"IF(O42=\"RF\",J42*S42*ROUND(N42/60,2),\"--\")","v":"--"},{"$f":"IF(O42=\"RR\",J42*S42*ROUND(N42/60,2)*Q42/100,\"--\")","v":"--"},"SI",3841.3440000000005]
[null,null,38,299638,4719,"SANTA CATALINA","TRAFO 5",30,"132/33/13.2",{"$f":"H43*$I$16","v":37.050000000000004},"2016-02-26T20:35:00","2016-02-26T22:28:00",{"$f":"IF(F43=\"\",\"\",(L43-K43)*24)","v":1.8833333333604969},{"$f":"IF(F43=\"\",\"\",ROUND((L43-K43)*24*60,0))","v":113},"R","NO",50,"SI",{"$f":"$I$17*IF(OR(O43=\"P\",O43=\"RP\"),0.1,1)*IF(R43=\"SI\",1,0.1)","v":60},{"$f":"IF(O43=\"P\",J43*S43*ROUND(N43/60,2),\"--\")","v":"--"},{"$f":"IF(O43=\"RP\",J43*S43*ROUND(N43/60,2)*Q43/100,\"--\")","v":"--"},{"$f":"IF(AND(O43=\"F\",P43=\"NO\"),J43*S43,\"--\")","v":"--"},{"$f":"IF(O43=\"F\",J43*S43*ROUND(N43/60,2),\"--\")","v":"--"},{"$f":"IF(AND(O43=\"R\",P43=\"NO\"),J43*S43*Q43/100,\"--\")","v":1111.5000000000002},{"$f":"IF(O43=\"R\",J43*S43*ROUND(N43/60,2)*Q43/100,\"--\")","v":2089.6200000000003},{"$f":"IF(O43=\"RF\",J43*S43*ROUND(N43/60,2),\"--\")","v":"--"},{"$f":"IF(O43=\"RR\",J43*S43*ROUND(N43/60,2)*Q43/100,\"--\")","v":"--"},"SI",3201.1200000000008]
[null,null,null,null,null,null,null,null,null,{"$f":"H44*$I$16","v":0},null,null,{"$f":"IF(F44=\"\",\"\",(L44-K44)*24)","v":""},{"$f":"IF(F44=\"\",\"\",ROUND((L44-K44)*24*60,0))","v":""},null,"",{"$f":"IF(F44=\"\",\"\",\"--\")","v":""},{"$f":"IF(F44=\"\",\"\",\"NO\")","v":""},{"$f":"$I$17*IF(OR(O44=\"P\",O44=\"RP\"),0.1,1)*IF(R44=\"SI\",1,0.1)","v":6},{"$f":"IF(O44=\"P\",J44*S44*ROUND(N44/60,2),\"--\")","v":"--"},{"$f":"IF(O44=\"RP\",J44*S44*ROUND(N44/60,2)*Q44/100,\"--\")","v":"--"},{"$f":"IF(AND(O44=\"F\",P44=\"NO\"),J44*S44,\"--\")","v":"--"},{"$f":"IF(O44=\"F\",J44*S44*ROUND(N44/60,2),\"--\")","v":"--"},{"$f":"IF(AND(O44=\"R\",P44=\"NO\"),J44*S44*Q44/100,\"--\")","v":"--"},{"$f":"IF(O44=\"R\",J44*S44*ROUND(N44/60,2)*Q44/100,\"--\")","v":"--"},{"$f":"IF(O44=\"RF\",J44*S44*ROUND(N44/60,2),\"--\")","v":"--"},{"$f":"IF(O44=\"RR\",J44*S44*ROUND(N44/60,2)*Q44/100,\"--\")","v":"--"},{"$f":"IF(F44=\"\",\"\",\"SI\")","v":""},""]
[]
[null,null,"(²)","F - FORZADA  ; RP - REDUCCIÓN PROGRAMADA  ; R - REDUCCIÓN FORZADA  ; RF - RESTANTE FORZADA",null,null,null,null,null,null,null,null,null,null,null,null,null,null,null,{"$f":"SUM(T20:T45)","v":0},{"$f":"SUM(U20:U45)","v":7701.8058000000037},26120.250000000004,50262.030000000013,11670.750000000004,11363.976000000002,55990.701000000001,0,null,{"$f":"ROUND(SUM(AC20:AC45),2)","v":163109.51}]

{"sheet":"T-02 (2)","index":4,"n_rows":43,"n_cols":29,"rows_kept":43,"cut":false,"hidden":false,"merged":[]}
[]
[null,{"$f":"+'TOT-0216'!B2","v":"ANEXO II al Memorandum D.T.E.E. N°   294  / 2017"}]
[]
[" ENTE NACIONAL REGULADOR "]
["       DE LA ELECTRICIDAD"]
[]
[]
[null,null,null,null,null,"SISTEMA DE TRANSPORTE DE ENERGÍA ELÉCTRICA POR DISTRIBUCIÓN TRONCAL - TRANSNEA S.A."]
[]
[null,null,null,null,null,"2.- CONEXIÓN"]
[]
[null,null,null,null,null,"2.1.- Transformación"]
[]
[null,{"$f":"+'TOT-0216'!B14","v":"Desde el 01 al 29 de Febrero de 2016"}]
[]
[null,null,null,null,null,"Por Transformador  [$ / h - MVA]  =",null,null,1.2350000000000001]
[null,null,null,null,null,"Coeficiente de penalización por salida forzada   =",null,null,{"$f":"30*'TOT-0216'!B13","v":60},null,{"$f":"IF(I17=30,\" \",IF(I17=60,\"  Coeficiente duplicado por tasa de falla >4 Sal. x año/100 km.\",\"  REVISAR COEFICIENTE\"))","v":"  Coeficiente duplicado por tasa de falla >4 Sal. x año/100 km."}]
[null,null,3,4,5,6,7,8,9,10,11,12,13,14,15,16,17,18,19,20,21,22,23,24,25,26,27,28,29]
[null,null,"N°","INDISP","ID EQUIPO","ESTACIÓN\nTRANSFORMADORA","EQUIPO","POT.\n[MVA]","U\n[kV]","$/h","Salida","Entrada","Hs.\nIndisp.","Mtos.\nIndisp.","Tipo \nSal.(²)","AUT.","C.R.\n%","E.N.S.","K (P;ENS)","PENALIZ.\nPROGRAM.","REDUCC.\nPROGRAM.","PENALIZACIÓN FORZADA\nPor Salida    hs. Restantes",null,"REDUCC. FORZADA\nPor Salida    hs. Restantes",null,"RESTANTE\nFORZADA","REDUCC.\nRESTANTE","Informó\nenTérm.","TOTAL\nPENALIZAC."]
[null,null,null,null,null,null,null,null,null,null,null,null,null,null,null,null,null,null,null,null,null,null,null,null,null,null,null,null,{"$f":"'T-02 (1)'!AC46","v":163109.51}]
[]
[null,null,39,299646,772,"SANTA CATALINA","TRAFO 2",30,"132/33/13,2",{"$f":"H22*$I$16","v":37.050000000000004},"2016-02-29T14:07:00","2016-02-29T14:21:00",{"$f":"IF(F22=\"\",\"\",(L22-K22)*24)","v":0.2333333333954215},{"$f":"IF(F22=\"\",\"\",ROUND((L22-K22)*24*60,0))","v":14},"R",{"$f":"IF(F22=\"\",\"\",IF(OR(O22=\"P\",O22=\"RP\"),\"--\",\"NO\"))","v":"NO"},40,"SI",{"$f":"$I$17*IF(OR(O22=\"P\",O22=\"RP\"),0.1,1)*IF(R22=\"SI\",1,0.1)","v":60},{"$f":"IF(O22=\"P\",J22*S22*ROUND(N22/60,2),\"--\")","v":"--"},{"$f":"IF(O22=\"RP\",J22*S22*ROUND(N22/60,2)*Q22/100,\"--\")","v":"--"},{"$f":"IF(AND(O22=\"F\",P22=\"NO\"),J22*S22,\"--\")","v":"--"},{"$f":"IF(O22=\"F\",J22*S22*ROUND(N22/60,2),\"--\")","v":"--"},{"$f":"IF(AND(O22=\"R\",P22=\"NO\"),J22*S22*Q22/100,\"--\")","v":889.20000000000016},{"$f":"IF(O22=\"R\",J22*S22*ROUND(N22/60,2)*Q22/100,\"--\")","v":204.51600000000005},{"$f":"IF(O22=\"RF\",J22*S22*ROUND(N22/60,2),\"--\")","v":"--"},{"$f":"IF(O22=\"RR\",J22*S22*ROUND(N22/60,2)*Q22/100,\"--\")","v":"--"},"SI",{"$f":"IF(F22=\"\",\"\",SUM(T22:AA22)*IF(AB22=\"SI\",1,2))","v":1093.7160000000001}]
[null,null,40,299647,4072,"SANTA CATALINA","TRAFO 4",30,"132/33/13,2",{"$f":"H23*$I$16","v":37.050000000000004},"2016-02-29T14:07:00","2016-02-29T14:21:00",{"$f":"IF(F23=\"\",\"\",(L23-K23)*24)","v":0.2333333333954215},{"$f":"IF(F23=\"\",\"\",ROUND((L23-K23)*24*60,0))","v":14},"R",{"$f":"IF(F23=\"\",\"\",IF(OR(O23=\"P\",O23=\"RP\"),\"--\",\"NO\"))","v":"NO"},60,"SI",{"$f":"$I$17*IF(OR(O23=\"P\",O23=\"RP\"),0.1,1)*IF(R23=\"SI\",1,0.1)","v":60},{"$f":"IF(O23=\"P\",J23*S23*ROUND(N23/60,2),\"--\")","v":"--"},{"$f":"IF(O23=\"RP\",J23*S23*ROUND(N23/60,2)*Q23/100,\"--\")","v":"--"},{"$f":"IF(AND(O23=\"F\",P23=\"NO\"),J23*S23,\"--\")","v":"--"},{"$f":"IF(O23=\"F\",J23*S23*ROUND(N23/60,2),\"--\")","v":"--"},{"$f":"IF(AND(O23=\"R\",P23=\"NO\"),J23*S23*Q23/100,\"--\")","v":1333.8000000000002},{"$f":"IF(O23=\"R\",J23*S23*ROUND(N23/60,2)*Q23/100,\"--\")","v":306.77400000000011},{"$f":"IF(O23=\"RF\",J23*S23*ROUND(N23/60,2),\"--\")","v":"--"},{"$f":"IF(O23=\"RR\",J23*S23*ROUND(N23/60,2)*Q23/100,\"--\")","v":"--"},"SI",{"$f":"IF(F23=\"\",\"\",SUM(T23:AA23)*IF(AB23=\"SI\",1,2))","v":1640.5740000000003}]
[null,null,41,299648,4719,"SANTA CATALINA","TRAFO 5",30,"132/33/13.2",37.050000000000004,"2016-02-29T14:07:00","2016-02-29T14:21:00",0.2333333333954215,14,"R","NO",50,"SI",60,"--","--","--","--",1111.5000000000002,255.64500000000007,"--","--","SI",1367.1450000000002]
[null,null,42,"298565b",768,"GOYA","TRAFO 2",15,"132/33/13,2",18.525000000000002,"2016-02-06T11:39:00","2016-02-06T14:32:00",2.8833333333022892,173,"F",{"$f":"IF(F25=\"\",\"\",IF(OR(O25=\"P\",O25=\"RP\"),\"--\",\"NO\"))","v":"NO"},{"$f":"IF(F25=\"\",\"\",\"--\")","v":"--"},"NO",{"$f":"$I$17*IF(OR(O25=\"P\",O25=\"RP\"),0.1,1)*IF(R25=\"SI\",1,0.1)","v":6},{"$f":"IF(O25=\"P\",J25*S25*ROUND(N25/60,2),\"--\")","v":"--"},{"$f":"IF(O25=\"RP\",J25*S25*ROUND(N25/60,2)*Q25/100,\"--\")","v":"--"},{"$f":"IF(AND(O25=\"F\",P25=\"NO\"),J25*S25,\"--\")","v":111.15},{"$f":"IF(O25=\"F\",J25*S25*ROUND(N25/60,2),\"--\")","v":320.11200000000002},{"$f":"IF(AND(O25=\"R\",P25=\"NO\"),J25*S25*Q25/100,\"--\")","v":"--"},{"$f":"IF(O25=\"R\",J25*S25*ROUND(N25/60,2)*Q25/100,\"--\")","v":"--"},{"$f":"IF(O25=\"RF\",J25*S25*ROUND(N25/60,2),\"--\")","v":"--"},{"$f":"IF(O25=\"RR\",J25*S25*ROUND(N25/60,2)*Q25/100,\"--\")","v":"--"},{"$f":"IF(F25=\"\",\"\",\"SI\")","v":"SI"},431.26200000000006]
[null,null,43,"299243b",771,"SANTA CATALINA","TRAFO 1",30,"132/33/13,2",37.050000000000004,"2016-02-19T17:39:00","2016-02-29T23:59:00",246.33333333319752,14780,"F","NO","--",{"$f":"IF(F26=\"\",\"\",\"NO\")","v":"NO"},6,"--","--",222.3,54759.159000000007,"--","--","--","--","SI",54981.45900000001]
[null,null,44,"299599b",759,"CORRIENTES","TRAFO 3",30,"132/33/13,2",37.050000000000004,"2016-02-25T02:49:00","2016-02-25T06:49:00",4.0000000001164153,240,"F","NO","--","NO",6,"--","--",222.3,889.2,"--","--","--","--","SI",1111.5]
[null,null,null,null,null,null,null,null,null,0,null,null,"","",null,"","","",6,"--","--","--","--","--","--","--","--","",""]
[null,null,null,null,null,null,null,null,null,0,null,null,"","",null,"","","",6,"--","--","--","--","--","--","--","--","",""]
[null,null,null,null,null,null,null,null,null,0,null,null,"","",null,"","","",6,"--","--","--","--","--","--","--","--","",""]
[null,null,null,null,null,null,null,null,null,0,null,null,"","",null,"",{"$f":"IF(F31=\"\",\"\",\"--\")","v":""},{"$f":"IF(F31=\"\",\"\",\"NO\")","v":""},6,"--","--","--","--","--","--","--","--",{"$f":"IF(F31=\"\",\"\",\"SI\")","v":""},""]
[null,null,null,null,null,null,null,null,null,0,null,null,"","",null,"","","",6,"--","--","--","--","--","--","--","--","",""]
[null,null,null,null,null,null,null,null,null,0,null,null,"","",null,"","","",6,"--","--","--","--","--","--","--","--","",""]
[null,null,null,null,null,null,null,null,null,0,null,null,"","",null,"","","",6,"--","--","--","--","--","--","--","--","",""]
[null,null,null,null,null,null,null,null,null,0,null,null,"","",null,"","","",6,"--","--","--","--","--","--","--","--","",""]
[null,null,null,null,null,null,null,null,null,0,null,null,"","",null,"","","",6,"--","--","--","--","--","--","--","--","",""]
[null,null,null,null,null,null,null,null,null,0,null,null,"","",null,"","","",6,"--","--","--","--","--","--","--","--","",""]
[null,null,null,null,null,null,null,null,null,0,null,null,"","",null,"","","",6,"--","--","--","--","--","--","--","--","",""]
[null,null,null,null,null,null,null,null,null,{"$f":"H39*$I$16","v":0},null,null,{"$f":"IF(F39=\"\",\"\",(L39-K39)*24)","v":""},{"$f":"IF(F39=\"\",\"\",ROUND((L39-K39)*24*60,0))","v":""},null,"",{"$f":"IF(F39=\"\",\"\",\"--\")","v":""},{"$f":"IF(F39=\"\",\"\",\"NO\")","v":""},{"$f":"$I$17*IF(OR(O39=\"P\",O39=\"RP\"),0.1,1)*IF(R39=\"SI\",1,0.1)","v":6},{"$f":"IF(O39=\"P\",J39*S39*ROUND(N39/60,2),\"--\")","v":"--"},{"$f":"IF(O39=\"RP\",J39*S39*ROUND(N39/60,2)*Q39/100,\"--\")","v":"--"},{"$f":"IF(AND(O39=\"F\",P39=\"NO\"),J39*S39,\"--\")","v":"--"},{"$f":"IF(O39=\"F\",J39*S39*ROUND(N39/60,2),\"--\")","v":"--"},{"$f":"IF(AND(O39=\"R\",P39=\"NO\"),J39*S39*Q39/100,\"--\")","v":"--"},{"$f":"IF(O39=\"R\",J39*S39*ROUND(N39/60,2)*Q39/100,\"--\")","v":"--"},{"$f":"IF(O39=\"RF\",J39*S39*ROUND(N39/60,2),\"--\")","v":"--"},{"$f":"IF(O39=\"RR\",J39*S39*ROUND(N39/60,2)*Q39/100,\"--\")","v":"--"},{"$f":"IF(F39=\"\",\"\",\"SI\")","v":""},""]
[null,null,null,null,null,null,null,null,null,{"$f":"H40*$I$16","v":0},null,null,{"$f":"IF(F40=\"\",\"\",(L40-K40)*24)","v":""},{"$f":"IF(F40=\"\",\"\",ROUND((L40-K40)*24*60,0))","v":""},null,"",{"$f":"IF(F40=\"\",\"\",\"--\")","v":""},{"$f":"IF(F40=\"\",\"\",\"NO\")","v":""},{"$f":"$I$17*IF(OR(O40=\"P\",O40=\"RP\"),0.1,1)*IF(R40=\"SI\",1,0.1)","v":6},{"$f":"IF(O40=\"P\",J40*S40*ROUND(N40/60,2),\"--\")","v":"--"},{"$f":"IF(O40=\"RP\",J40*S40*ROUND(N40/60,2)*Q40/100,\"--\")","v":"--"},{"$f":"IF(AND(O40=\"F\",P40=\"NO\"),J40*S40,\"--\")","v":"--"},{"$f":"IF(O40=\"F\",J40*S40*ROUND(N40/60,2),\"--\")","v":"--"},{"$f":"IF(AND(O40=\"R\",P40=\"NO\"),J40*S40*Q40/100,\"--\")","v":"--"},{"$f":"IF(O40=\"R\",J40*S40*ROUND(N40/60,2)*Q40/100,\"--\")","v":"--"},{"$f":"IF(O40=\"RF\",J40*S40*ROUND(N40/60,2),\"--\")","v":"--"},{"$f":"IF(O40=\"RR\",J40*S40*ROUND(N40/60,2)*Q40/100,\"--\")","v":"--"},{"$f":"IF(F40=\"\",\"\",\"SI\")","v":""},""]
[null,null,null,null,null,null,null,null,null,{"$f":"H41*$I$16","v":0},null,null,{"$f":"IF(F41=\"\",\"\",(L41-K41)*24)","v":""},{"$f":"IF(F41=\"\",\"\",ROUND((L41-K41)*24*60,0))","v":""},null,"",{"$f":"IF(F41=\"\",\"\",\"--\")","v":""},{"$f":"IF(F41=\"\",\"\",\"NO\")","v":""},{"$f":"$I$17*IF(OR(O41=\"P\",O41=\"RP\"),0.1,1)*IF(R41=\"SI\",1,0.1)","v":6},{"$f":"IF(O41=\"P\",J41*S41*ROUND(N41/60,2),\"--\")","v":"--"},{"$f":"IF(O41=\"RP\",J41*S41*ROUND(N41/60,2)*Q41/100,\"--\")","v":"--"},{"$f":"IF(AND(O41=\"F\",P41=\"NO\"),J41*S41,\"--\")","v":"--"},{"$f":"IF(O41=\"F\",J41*S41*ROUND(N41/60,2),\"--\")","v":"--"},{"$f":"IF(AND(O41=\"R\",P41=\"NO\"),J41*S41*Q41/100,\"--\")","v":"--"},{"$f":"IF(O41=\"R\",J41*S41*ROUND(N41/60,2)*Q41/100,\"--\")","v":"--"},{"$f":"IF(O41=\"RF\",J41*S41*ROUND(N41/60,2),\"--\")","v":"--"},{"$f":"IF(O41=\"RR\",J41*S41*ROUND(N41/60,2)*Q41/100,\"--\")","v":"--"},{"$f":"IF(F41=\"\",\"\",\"SI\")","v":""},""]
[]
[null,null,"(²)","R - REDUCCIÓN FORZADA",null,null,null,null,null,null,null,null,null,null,null,null,null,null,null,{"$f":"SUM(T20:T42)","v":0},{"$f":"SUM(U20:U42)","v":0},555.75,55968.471000000005,3334.5000000000009,766.93500000000029,0,0,null,{"$f":"ROUND(SUM(AC20:AC42),2)","v":223735.17}]

{"sheet":"SA-12 (1)","index":5,"n_rows":43,"n_cols":22,"rows_kept":43,"cut":false,"hidden":false,"merged":[]}
[]
[null,{"$f":"'TOT-0216'!B2","v":"ANEXO II al Memorandum D.T.E.E. N°   294  / 2017"}]
[]
[" ENTE NACIONAL REGULADOR "]
["       DE LA ELECTRICIDAD"]
[]
[]
[null,null,null,null,null,"SISTEMA DE TRANSPORTE DE ENERGÍA ELÉCTRICA POR DISTRIBUCIÓN TRONCAL - TRANSNEA S.A."]
[]
[null,null,null,null,null,"2.2.- Salidas"]
[]
[null,{"$f":"'TOT-0216'!B14","v":"Desde el 01 al 29 de Febrero de 2016"}]
[]
[null,null,null,null,null,"Salida en 220 kV"," - ",{"$f":"60*'TOT-0216'!B13","v":120},null,{"$f":"IF(H14=60,\" \",IF(H14=120,\"  Coeficiente duplicado por tasa de falla >4 Sal. x año/100 km.\",\"  REVISAR COEFICIENTE\"))","v":"  Coeficiente duplicado por tasa de falla >4 Sal. x año/100 km."}]
[null,null,null,null,null,"Salida en 132 kV o 66 kV = ",16.042999999999999,{"$f":"50*'TOT-0216'!B13","v":100},null,{"$f":"IF(H15=50,\" \",IF(H15=100,\"  Coeficiente duplicado por tasa de falla >4 Sal. x año/100 km.\",\"  REVISAR COEFICIENTE\"))","v":"  Coeficiente duplicado por tasa de falla >4 Sal. x año/100 km."}]
[null,null,null,null,null,"Salida en 33 kV ",12.029,{"$f":"25*'TOT-0216'!B13","v":50},null,{"$f":"IF(H16=25,\" \",IF(H16=50,\"  Coeficiente duplicado por tasa de falla >4 Sal. x año/100 km.\",\"  REVISAR COEFICIENTE\"))","v":"  Coeficiente duplicado por tasa de falla >4 Sal. x año/100 km."}]
[null,null,null,null,null,"Salida en 13,2 kV =",12.029,{"$f":"20*'TOT-0216'!B13","v":40},null,{"$f":"IF(H17=20,\" \",IF(H17=40,\"  Coeficiente duplicado por tasa de falla >4 Sal. x año/100 km.\",\"  REVISAR COEFICIENTE\"))","v":"  Coeficiente duplicado por tasa de falla >4 Sal. x año/100 km."}]
[null,null,3,4,5,6,7,8,9,10,11,12,13,14,15,16,17,18,19,20,21,22]
[null,null,"N°","INDISP","ID EQUIPO","ESTACIÓN\nTRANSFORMADORA","EQUIPO","U\n[kV]","$/h","Salida","Entrada","Hs.\nIndisp.","Mtos.\nIndisp.","Tipo \nSal.(²)","AUT.","K","PENALIZ.\nPROGRAM.","PENALIZACIÓN FORZADA\nPor Salida    hs. Restantes",null,"RESTANTE\nFORZADA","Informó\nenTérm.","TOTAL\nPENALIZAC."]
[]
[]
[null,null,42,298548,855,"SALTO GRANDE","LINEA CONCORDIA",132,{"$f":"IF(H22=220,$G$14,IF(AND(H22<=132,H22>=66),$G$15,IF(AND(H22<66,H22>=33),$G$16,$G$17)))","v":16.042999999999999},"2016-02-01T10:41:00","2016-02-01T10:49:00",{"$f":"IF(F22=\"\",\"\",(K22-J22)*24)","v":0.13333333324408159},{"$f":"IF(F22=\"\",\"\",ROUND((K22-J22)*24*60,0))","v":8},"F",{"$f":"IF(F22=\"\",\"\",IF(OR(N22=\"P\",N22=\"RP\"),\"--\",\"NO\"))","v":"NO"},{"$f":"IF(H22=220,$H$14,IF(AND(H22<=132,H22>=66),$H$15,IF(AND(H22<66,H22>=33),$H$16,$H$17)))","v":100},{"$f":"IF(N22=\"P\",I22*P22*ROUND(M22/60,2)*0.1,\"--\")","v":"--"},{"$f":"IF(AND(N22=\"F\",O22=\"NO\"),I22*P22,\"--\")","v":1604.3},{"$f":"IF(N22=\"F\",I22*P22*ROUND(M22/60,2),\"--\")","v":208.559},{"$f":"IF(N22=\"RF\",I22*P22*ROUND(M22/60,2),\"--\")","v":"--"},"SI",{"$f":"IF(F22=\"\",\"\",SUM(Q22:T22)*IF(U22=\"SI\",1,2)*IF(H22=\"500/220\",0,1))","v":1812.8589999999999}]
[null,null,43,298579,815,"CORRIENTES","SALIDA DISTRIBUIDOR 73 (37)",13.2,{"$f":"IF(H23=220,$G$14,IF(AND(H23<=132,H23>=66),$G$15,IF(AND(H23<66,H23>=33),$G$16,$G$17)))","v":12.029},"2016-02-07T03:38:00","2016-02-11T14:05:00",{"$f":"IF(F23=\"\",\"\",(K23-J23)*24)","v":106.45000000001164},{"$f":"IF(F23=\"\",\"\",ROUND((K23-J23)*24*60,0))","v":6387},"F","NO",{"$f":"IF(H23=220,$H$14,IF(AND(H23<=132,H23>=66),$H$15,IF(AND(H23<66,H23>=33),$H$16,$H$17)))","v":40},{"$f":"IF(N23=\"P\",I23*P23*ROUND(M23/60,2)*0.1,\"--\")","v":"--"},{"$f":"IF(AND(N23=\"F\",O23=\"NO\"),I23*P23,\"--\")","v":481.15999999999997},{"$f":"IF(N23=\"F\",I23*P23*ROUND(M23/60,2),\"--\")","v":51219.481999999996},{"$f":"IF(N23=\"RF\",I23*P23*ROUND(M23/60,2),\"--\")","v":"--"},"SI",{"$f":"IF(F23=\"\",\"\",SUM(Q23:T23)*IF(U23=\"SI\",1,2)*IF(H23=\"500/220\",0,1))","v":51700.642}]
[null,null,44,299177,3761,"SALTO GRANDE","SALIDA A TRAFO 2",132,16.042999999999999,"2016-02-19T09:12:00","2016-02-19T09:47:00",0.58333333331393078,35,"F","NO",100,"--",1604.3,930.49399999999991,"--",{"$f":"IF(F24=\"\",\"\",\"SI\")","v":"SI"},2534.7939999999999]
[null,null,45,299650,849,"SANTA CATALINA","SALIDA TIPOITI",33,12.029,"2016-02-29T14:07:00","2016-02-29T23:59:00",9.8666666666977108,592,"F","NO",50,"--",601.45000000000005,5936.3114999999998,"--","SI",6537.7614999999996]
[null,null,null,null,null,null,null,null,12.029,null,null,"","",null,"",40,"--","--","--","--","",""]
[null,null,null,null,null,null,null,null,12.029,null,null,"","",null,"",40,"--","--","--","--","",""]
[null,null,null,null,null,null,null,null,12.029,null,null,"","",null,"",40,"--","--","--","--","",""]
[null,null,null,null,null,null,null,null,12.029,null,null,"","",null,"",40,"--","--","--","--","",""]
[null,null,null,null,null,null,null,null,12.029,null,null,"","",null,"",40,"--","--","--","--","",""]
[null,null,null,null,null,null,null,null,12.029,null,null,"","",null,"",40,"--","--","--","--","",""]
[null,null,null,null,null,null,null,null,12.029,null,null,"","",null,"",40,"--","--","--","--","",""]
[null,null,null,null,null,null,null,null,12.029,null,null,"","",null,"",40,"--","--","--","--","",""]
[null,null,null,null,null,null,null,null,12.029,null,null,"","",null,"",40,"--","--","--","--","",""]
[null,null,null,null,null,null,null,null,12.029,null,null,"","",null,"",40,"--","--","--","--","",""]
[null,null,null,null,null,null,null,null,12.029,null,null,"","",null,"",40,"--","--","--","--","",""]
[null,null,null,null,null,null,null,null,12.029,null,null,"","",null,"",40,"--","--","--","--","",""]
[null,null,null,null,null,null,null,null,12.029,null,null,"","",null,"",40,"--","--","--","--","",""]
[null,null,null,null,null,null,null,null,{"$f":"IF(H39=220,$G$14,IF(AND(H39<=132,H39>=66),$G$15,IF(AND(H39<66,H39>=33),$G$16,$G$17)))","v":12.029},null,null,{"$f":"IF(F39=\"\",\"\",(K39-J39)*24)","v":""},{"$f":"IF(F39=\"\",\"\",ROUND((K39-J39)*24*60,0))","v":""},null,"",{"$f":"IF(H39=220,$H$14,IF(AND(H39<=132,H39>=66),$H$15,IF(AND(H39<66,H39>=33),$H$16,$H$17)))","v":40},{"$f":"IF(N39=\"P\",I39*P39*ROUND(M39/60,2)*0.1,\"--\")","v":"--"},{"$f":"IF(AND(N39=\"F\",O39=\"NO\"),I39*P39,\"--\")","v":"--"},{"$f":"IF(N39=\"F\",I39*P39*ROUND(M39/60,2),\"--\")","v":"--"},{"$f":"IF(N39=\"RF\",I39*P39*ROUND(M39/60,2),\"--\")","v":"--"},{"$f":"IF(F39=\"\",\"\",\"SI\")","v":""},""]
[null,null,null,null,null,null,null,null,{"$f":"IF(H40=220,$G$14,IF(AND(H40<=132,H40>=66),$G$15,IF(AND(H40<66,H40>=33),$G$16,$G$17)))","v":12.029},null,null,{"$f":"IF(F40=\"\",\"\",(K40-J40)*24)","v":""},{"$f":"IF(F40=\"\",\"\",ROUND((K40-J40)*24*60,0))","v":""},null,"",{"$f":"IF(H40=220,$H$14,IF(AND(H40<=132,H40>=66),$H$15,IF(AND(H40<66,H40>=33),$H$16,$H$17)))","v":40},{"$f":"IF(N40=\"P\",I40*P40*ROUND(M40/60,2)*0.1,\"--\")","v":"--"},{"$f":"IF(AND(N40=\"F\",O40=\"NO\"),I40*P40,\"--\")","v":"--"},{"$f":"IF(N40=\"F\",I40*P40*ROUND(M40/60,2),\"--\")","v":"--"},{"$f":"IF(N40=\"RF\",I40*P40*ROUND(M40/60,2),\"--\")","v":"--"},{"$f":"IF(F40=\"\",\"\",\"SI\")","v":""},""]
[null,null,null,null,null,null,null,null,{"$f":"IF(H41=220,$G$14,IF(AND(H41<=132,H41>=66),$G$15,IF(AND(H41<66,H41>=33),$G$16,$G$17)))","v":12.029},null,null,{"$f":"IF(F41=\"\",\"\",(K41-J41)*24)","v":""},{"$f":"IF(F41=\"\",\"\",ROUND((K41-J41)*24*60,0))","v":""},null,"",{"$f":"IF(H41=220,$H$14,IF(AND(H41<=132,H41>=66),$H$15,IF(AND(H41<66,H41>=33),$H$16,$H$17)))","v":40},{"$f":"IF(N41=\"P\",I41*P41*ROUND(M41/60,2)*0.1,\"--\")","v":"--"},{"$f":"IF(AND(N41=\"F\",O41=\"NO\"),I41*P41,\"--\")","v":"--"},{"$f":"IF(N41=\"F\",I41*P41*ROUND(M41/60,2),\"--\")","v":"--"},{"$f":"IF(N41=\"RF\",I41*P41*ROUND(M41/60,2),\"--\")","v":"--"},{"$f":"IF(F41=\"\",\"\",\"SI\")","v":""},""]
[]
[null,null,"(²)","F - FORZADA",null,null,null,null,null,null,null,null,null,null,null,null,{"$f":"SUM(Q20:Q42)","v":0},{"$f":"SUM(R20:R42)","v":4291.21},{"$f":"SUM(S20:S42)","v":58294.8465},{"$f":"SUM(T20:T42)","v":0},null,{"$f":"ROUND(SUM(V20:V42),2)","v":62586.06}]

{"sheet":"SUP-DPEC","index":6,"n_rows":63,"n_cols":26,"rows_kept":63,"cut":false,"hidden":false,"merged":[[11,1,11,25]]}
[]
[null,{"$f":"'TOT-0216'!B2","v":"ANEXO II al Memorandum D.T.E.E. N°   294  / 2017"}]
[]
["ENTE NACIONAL REGULADOR "]
["DE LA ELECTRICIDAD"]
[]
[]
[null,null,null,"SISTEMA DE TRANSPORTE DE ENERGÍA ELÉCTRICA POR DISTRIBUCIÓN TRONCAL - TRANSNEA S.A."]
[]
[null,null,null,"3.1.-SUPERVISIÓN - Transportista Independiente D.P.E.C."]
[]
[null,{"$f":"'TOT-0216'!B14","v":"Desde el 01 al 29 de Febrero de 2016"}]
[]
[]
[]
[null,null,"a) Datos"]
[null,null,null,null,null,null,null,null,null,null,"K"]
[null,null,null,"Tiempo de servicio =",{"$f":"MID(B12,16,2)*24","v":696},"hs",null,"$/100 km-h : LÍNEAS 220 kV ",null," - ",{"$f":"30*'TOT-0216'!B13","v":60}]
[null,null,null,"Porcentaje por Supervisión  =",2.5000000000000001E-2,null,null,"$/100 km-h : LÍNEAS 132 kV ",null,345.49299999999999,null,null,"RM por Transformador =",null,null,null,null,null,null,null,null,null,null,null," - ","$/h-MVA"]
[null,null,null,null,null,null,null,"$/100 km-h : LÍNEAS 66 kV ",null," - ",null,null,"RM Salidas 132 kV =",null,null,null,null,null,null,null,null,null,null,null,16.042999999999999,"$/hs."]
[]
[null,null,"b) SM:  es la suma de las sanciones a que en cada mes se hiciere pasible el Transportista Independiente, valorizadas con idénticos criterios que los que se aplican a la Concesionaria."]
[]
[null,null,"N°","LÍNEAS","U\n[kV]","Long.\n[km]","$/h","Salida","Entrada","Hs.\nIndisp. ","Minutos\nIndisp.","Tipo \nSal.(²)","C.R.\n%","PENALIZAC.\nPROGRAM.","REDUCC.\nPROGRAM.","PENALIZACIÓN FORZADA\nPor Salida    1ras. 3 hs.  hs. Restantes",null,null,"REDUCC. FORZADA\nPor Salida    1ras. 3 hs.  hs. Restantes",null,null,"RESTANTE\nFORZADA","REDUCC.\nRESTANTE","Informó\nenTérm.","TOTAL\nPENALIZAC."]
[]
[null,null,"I","PASO DE LOS LIBRES - MONTE CASEROS",132,101,{"$f":"IF(F26>25,F26,25)*IF(E26=220,$J$18,IF(E26=132,$J$19,$J$20))/100","v":348.94792999999999},"2016-02-21T22:33:00","2016-02-21T22:41:00",{"$f":"IF(D26=\"\",\"\",(I26-H26)*24)","v":0.13333333341870457},{"$f":"IF(D26=\"\",\"\",ROUND((I26-H26)*24*60,0))","v":8},"F",{"$f":"IF(D26=\"\",\"\",\"--\")","v":"--"},{"$f":"IF(L26=\"P\",ROUND(K26/60,2)*G26*$K$18*0.01,\"--\")","v":"--"},{"$f":"IF(L26=\"RP\",ROUND(K26/60,2)*G26*$K$18*0.01*M26/100,\"--\")","v":"--"},{"$f":"IF(L26=\"F\",G26*$K$18,\"--\")","v":20936.875799999998},{"$f":"IF(AND(K26>10,L26=\"F\"),G26*$K$18*IF(K26>180,3,ROUND(K26/60,2)),\"--\")","v":"--"},{"$f":"IF(AND(L26=\"F\",K26>180),(ROUND(K26/60,2)-3)*G26*$K$18*0.1,\"--\")","v":"--"},{"$f":"IF(L26=\"R\",G26*$K$18*M26/100,\"--\")","v":"--"},{"$f":"IF(AND(K26>10,L26=\"R\"),G26*$K$18*M26/100*IF(K26>180,3,ROUND(K26/60,2)),\"--\")","v":"--"},{"$f":"IF(AND(L26=\"R\",K26>180),(ROUND(K26/60,2)-3)*G26*$K$18*0.1*M26/100,\"--\")","v":"--"},{"$f":"IF(L26=\"RF\",ROUND(K26/60,2)*G26*$K$18*0.1,\"--\")","v":"--"},{"$f":"IF(L26=\"RR\",ROUND(K26/60,2)*G26*$K$18*0.1*M26/100,\"--\")","v":"--"},"SI",{"$f":"IF(D26=\"\",\"\",SUM(N26:W26)*IF(X26=\"SI\",1,2))","v":20936.875799999998}]
[null,null,"II",null,null,null,{"$f":"IF(F27>25,F27,25)*IF(E27=220,$J$18,IF(E27=132,$J$19,$J$20))/100","v":{"$error":"#VALUE!"}},null,null,{"$f":"IF(D27=\"\",\"\",(I27-H27)*24)","v":""},{"$f":"IF(D27=\"\",\"\",ROUND((I27-H27)*24*60,0))","v":""},null,{"$f":"IF(D27=\"\",\"\",\"--\")","v":""},{"$f":"IF(L27=\"P\",ROUND(K27/60,2)*G27*$K$18*0.01,\"--\")","v":"--"},{"$f":"IF(L27=\"RP\",ROUND(K27/60,2)*G27*$K$18*0.01*M27/100,\"--\")","v":"--"},{"$f":"IF(L27=\"F\",G27*$K$18,\"--\")","v":"--"},{"$f":"IF(AND(K27>10,L27=\"F\"),G27*$K$18*IF(K27>180,3,ROUND(K27/60,2)),\"--\")","v":"--"},{"$f":"IF(AND(L27=\"F\",K27>180),(ROUND(K27/60,2)-3)*G27*$K$18*0.1,\"--\")","v":"--"},{"$f":"IF(L27=\"R\",G27*$K$18*M27/100,\"--\")","v":"--"},{"$f":"IF(AND(K27>10,L27=\"R\"),G27*$K$18*M27/100*IF(K27>180,3,ROUND(K27/60,2)),\"--\")","v":"--"},{"$f":"IF(AND(L27=\"R\",K27>180),(ROUND(K27/60,2)-3)*G27*$K$18*0.1*M27/100,\"--\")","v":"--"},{"$f":"IF(L27=\"RF\",ROUND(K27/60,2)*G27*$K$18*0.1,\"--\")","v":"--"},{"$f":"IF(L27=\"RR\",ROUND(K27/60,2)*G27*$K$18*0.1*M27/100,\"--\")","v":"--"},{"$f":"IF(D27=\"\",\"\",\"SI\")","v":""},{"$f":"IF(D27=\"\",\"\",SUM(N27:W27)*IF(X27=\"SI\",1,2))","v":""}]
[null,null,"III",null,null,null,{"$f":"IF(F28>25,F28,25)*IF(E28=220,$J$18,IF(E28=132,$J$19,$J$20))/100","v":{"$error":"#VALUE!"}},null,null,{"$f":"IF(D28=\"\",\"\",(I28-H28)*24)","v":""},{"$f":"IF(D28=\"\",\"\",ROUND((I28-H28)*24*60,0))","v":""},null,{"$f":"IF(D28=\"\",\"\",\"--\")","v":""},{"$f":"IF(L28=\"P\",ROUND(K28/60,2)*G28*$K$18*0.01,\"--\")","v":"--"},{"$f":"IF(L28=\"RP\",ROUND(K28/60,2)*G28*$K$18*0.01*M28/100,\"--\")","v":"--"},{"$f":"IF(L28=\"F\",G28*$K$18,\"--\")","v":"--"},{"$f":"IF(AND(K28>10,L28=\"F\"),G28*$K$18*IF(K28>180,3,ROUND(K28/60,2)),\"--\")","v":"--"},{"$f":"IF(AND(L28=\"F\",K28>180),(ROUND(K28/60,2)-3)*G28*$K$18*0.1,\"--\")","v":"--"},{"$f":"IF(L28=\"R\",G28*$K$18*M28/100,\"--\")","v":"--"},{"$f":"IF(AND(K28>10,L28=\"R\"),G28*$K$18*M28/100*IF(K28>180,3,ROUND(K28/60,2)),\"--\")","v":"--"},{"$f":"IF(AND(L28=\"R\",K28>180),(ROUND(K28/60,2)-3)*G28*$K$18*0.1*M28/100,\"--\")","v":"--"},{"$f":"IF(L28=\"RF\",ROUND(K28/60,2)*G28*$K$18*0.1,\"--\")","v":"--"},{"$f":"IF(L28=\"RR\",ROUND(K28/60,2)*G28*$K$18*0.1*M28/100,\"--\")","v":"--"},{"$f":"IF(D28=\"\",\"\",\"SI\")","v":""},{"$f":"IF(D28=\"\",\"\",SUM(N28:W28)*IF(X28=\"SI\",1,2))","v":""}]
[null,null,null,null,null,null,null,null,null,{"$f":"IF(D29=\"\",\"\",(I29-H29)*24)","v":""},{"$f":"IF(D29=\"\",\"\",ROUND((I29-H29)*24*60,0))","v":""},null,{"$f":"IF(D29=\"\",\"\",\"--\")","v":""},null,null,null,null,null,null,null,null,null,null,{"$f":"IF(D29=\"\",\"\",\"SI\")","v":""},{"$f":"IF(D29=\"\",\"\",SUM(N29:W29)*IF(X29=\"SI\",1,2))","v":""}]
[null,null,null,null,null,null,null,null,null,null,null,null,null,null,null,null,null,null,null,null,null,null,null,null,{"$f":"SUM(Y26:Y29)","v":20936.875799999998}]
[]
[null,null,"N°","ESTACIÓN\nTRANSFORMADORA","EQUIPO","U\n[kV]","$/h","Salida","Entrada","Hs.\nIndisp.","Mtos.\nIndisp.","Tipo \nSal.(²)","AUT.","K","PENALIZ.\nPROGRAM.","PENALIZACIÓN FORZADA\nPor Salida    hs. Restantes",null,null,null,null,null,"RESTANTE\nFORZADA",null,"Informó\nenTérm.","TOTAL\nPENALIZAC."]
[]
[null,null,"I",null,null,null,{"$f":"Y20","v":16.042999999999999},null,null,{"$f":"IF(D34=\"\",\"\",(I34-H34)*24)","v":""},{"$f":"IF(D34=\"\",\"\",ROUND((I34-H34)*24*60,0))","v":""},null,{"$f":"IF(D34=\"\",\"\",IF(OR(L34=\"P\",L34=\"RP\"),\"--\",\"NO\"))","v":""},50,{"$f":"IF(L34=\"P\",G34*N34*ROUND(K34/60,2)*0.1,\"--\")","v":"--"},{"$f":"IF(AND(L34=\"F\",M34=\"NO\"),G34*N34,\"--\")","v":"--"},{"$f":"IF(L34=\"F\",G34*N34*ROUND(K34/60,2),\"--\")","v":"--"},null,null,null,null,{"$f":"IF(L34=\"RF\",G34*N34*ROUND(K34/60,2),\"--\")","v":"--"},null,{"$f":"IF(D34=\"\",\"\",\"SI\")","v":""},{"$f":"IF(D34=\"\",\"\",SUM(O34:V34)*IF(X34=\"SI\",1,2)*IF(F34=\"500/220\",0,1))","v":""}]
[null,null,"II",null,null,null,{"$f":"Y20","v":16.042999999999999},null,null,{"$f":"IF(D35=\"\",\"\",(I35-H35)*24)","v":""},{"$f":"IF(D35=\"\",\"\",ROUND((I35-H35)*24*60,0))","v":""},null,{"$f":"IF(D35=\"\",\"\",IF(OR(L35=\"P\",L35=\"RP\"),\"--\",\"NO\"))","v":""},50,{"$f":"IF(L35=\"P\",G35*N35*ROUND(K35/60,2)*0.1,\"--\")","v":"--"},{"$f":"IF(AND(L35=\"F\",M35=\"NO\"),G35*N35,\"--\")","v":"--"},{"$f":"IF(L35=\"F\",G35*N35*ROUND(K35/60,2),\"--\")","v":"--"},null,null,null,null,{"$f":"IF(L35=\"RF\",G35*N35*ROUND(K35/60,2),\"--\")","v":"--"},null,{"$f":"IF(D35=\"\",\"\",\"SI\")","v":""},{"$f":"IF(D35=\"\",\"\",SUM(O35:V35)*IF(X35=\"SI\",1,2)*IF(F35=\"500/220\",0,1))","v":""}]
[null,null,"III",null,null,null,{"$f":"Y20","v":16.042999999999999},null,null,{"$f":"IF(D36=\"\",\"\",(I36-H36)*24)","v":""},{"$f":"IF(D36=\"\",\"\",ROUND((I36-H36)*24*60,0))","v":""},null,{"$f":"IF(D36=\"\",\"\",IF(OR(L36=\"P\",L36=\"RP\"),\"--\",\"NO\"))","v":""},50,{"$f":"IF(L36=\"P\",G36*N36*ROUND(K36/60,2)*0.1,\"--\")","v":"--"},{"$f":"IF(AND(L36=\"F\",M36=\"NO\"),G36*N36,\"--\")","v":"--"},{"$f":"IF(L36=\"F\",G36*N36*ROUND(K36/60,2),\"--\")","v":"--"},null,null,null,null,{"$f":"IF(L36=\"RF\",G36*N36*ROUND(K36/60,2),\"--\")","v":"--"},null,{"$f":"IF(D36=\"\",\"\",\"SI\")","v":""},{"$f":"IF(D36=\"\",\"\",SUM(O36:V36)*IF(X36=\"SI\",1,2)*IF(F36=\"500/220\",0,1))","v":""}]
[]
[null,null,null,null,null,null,null,null,null,null,null,null,null,null,null,null,null,null,null,null,null,null,null,null,{"$f":"SUM(Y34:Y37)","v":0}]
[null,null,null,null,null,null,null,"SM=",{"$f":"Y30+Y38","v":20936.875799999998}]
[]
[null,null,"c) RM : es la remuneración que mensualmente recibiría el Transportista Independiente, si su servicio fuera valorizado conforme al régimen remuneratorio que se aplica a la Concesionaria."]
[]
[null,null,null,"Cargo por Capacidad","kV","km",null,null,"RM por Cap. Transporte",null,"RM por E. E. T.",null,null,null,null,null,null,null,null,null,null,null,null,"TOTAL"]
[]
[null,null,null,"PASO DE LOS LIBRES - MONTE CASEROS",132,100.7,null,null,{"$f":"F45*$J$19*$E$18/100","v":242146.36989600002},null,33702,null,{"$f":"\"(DTE \"&[3]DATO!$G$14&[3]DATO!$H$14&\")\"","v":"(DTE 0216)"},null,null,null,null,null,null,null,null,null,null,{"$f":"I45+I49","v":253312.29789600003}]
[]
[null,null,null,"E.T.","kV","SALIDA","SALIDA",null,"RM por Conexión"]
[]
[null,null,null,"PASO DE LOS LIBRES",132,"INTERRUPTOR TRAFO 1",null,null,{"$f":"Y20*E18","v":11165.928}]
[]
[]
[null,null,null,null,null,null,null,"RM =",{"$f":"X45+I49","v":264478.22589600005},null,null,null,"RM * =",null,null,null,null,null,null,null,null,null,null,111078.14018399999]
[]
[null,null,"d) CS: Es el cargo por Supervisión de la Operación que la Transportista percibe por supervisar la operación y mantenimiento del Transportista Independiente."]
[]
[null,null,null,"Cargo por Supervisión afectado a la sanción ",null,null,null,"CS =",{"$f":"E19*X52","v":2776.9535046000001},null,null,"RM* = VALOR EMPLEADO PARA CALCULAR CS"]
[]
[null,null,"e) SANCIÓN"]
[null,null,null,"Sanción Calculada",{"$f":"10*Y30*I56/I52","v":2198.3182332388837}]
[]
[null,null,null,"TOTAL A PENALIZAR A TRANSNEA S.A. POR SUPERVISIÓN A  D.P.E.C."]
[]
[null,null,null,null,null,null,null,"SANCIÓN  =",{"$f":"IF(E59>3*I56,3*I56,$E$59)","v":2198.3182332388837}]

{"sheet":"DATO","index":7,"n_rows":27,"n_cols":29,"rows_kept":27,"cut":false,"hidden":false,"merged":[]}
["Mes","Mes","Dia","Año"]
["enero","01",31,2006]
["febrero","02",{"$f":"IF(MOD(E14,4)=0,29,28)","v":29},{"$f":"+D2+1","v":2007}]
["marzo","03",31,{"$f":"+D3+1","v":2008}]
["abril","04",30,{"$f":"+D4+1","v":2009}]
["mayo","05",31,2010]
["junio","06",30,2011]
["julio","07",31,2012]
["agosto","08",31,2013]
["septiembre","09",30,2014]
["octubre","10",31,2015]
["noviembre","11",30,2016]
["diciembre","12",31,null,null,null,null,null,"Total"]
[11,2,{"$f":"CELL(\"CONTENIDO\",OFFSET(A1,B14,0))","v":"febrero"},{"$f":"CELL(\"CONTENIDO\",OFFSET(C1,B14,0))","v":29},{"$f":"CELL(\"CONTENIDO\",OFFSET(D1,A14,0))","v":2016},{"$f":"\"Desde el 01 al \" & D14 & \" de \" & C14 & \" de \" & E14","v":"Desde el 01 al 29 de febrero de 2016"},{"$f":"CELL(\"CONTENIDO\",OFFSET(B1,B14,0))","v":"02"},{"$f":"RIGHT(E14,2)","v":"16"},"B14"]
[null,{"$f":"\"\\\\rugor\\files\\Transporte\\Transporte\\AA PROCESO AUT ARCHIVOS J\\TRANSNEA\\\" &E14","v":"\\\\rugor\\files\\Transporte\\Transporte\\AA PROCESO AUT ARCHIVOS J\\TRANSNEA\\2016"},null,null,null,null,{"$f":"\"J\"&G14&H14&\"NEA\"","v":"J0216NEA"}]
[null,{"$f":"\"\\\\rugor\\files\\Transporte\\transporte\\AA PROCESO AUT\\INTERCAMBIO\\\" &H14&G14","v":"\\\\rugor\\files\\Transporte\\transporte\\AA PROCESO AUT\\INTERCAMBIO\\1602"}]
["Hoja","FilaInicio","FilasPlantilla","Columnas","NombreHoja","OrigenDeDatos","Col00","Col01","Col02","Col03","Col04","Col05","Col06","Col07","Col08","Col09","Col10","Col11","Col12","Col13","Col14","Col15","FILHTOTAL","COLHTOTAL","FILHCALC","COLHCALC","FILTRANSP","COLTRANSP","COL TSAL"]
["MODELO L",23,20,11,{"$f":"\"LI-\" & $G$14","v":"LI-02"},"TRANSNEA_INDISPONIBILIDADES_LINEAS_TRANSNEA.XLS",3,5,4,6,7,8,0,10,11,14,0,26,0,0,0,0,20,9,44,27,21,27,14]
["MODELO T",22,20,13,{"$f":"\"T-\" & $G$14","v":"T-02"},"TRANSNEA_INDISPONIBILIDADES_TRAFOS_TRANSNEA.XLS",3,5,4,6,7,8,9,11,12,15,16,18,28,17,0,0,28,9,43,29,20,29,15]
["MODELO S",22,20,10,{"$f":"\"SA-\" & $G$14","v":"SA-02"},"TRANSNEA_INDISPONIBILIDADES_SALIDAS_TRANSNEA.XLS",3,5,4,6,7,8,10,11,14,15,21,0,0,0,0,0,32,9,43,22,20,22,14]
["MODELO L DPEC",23,20,11,{"$f":"\"LI-DPEC-\" & $G$14","v":"LI-DPEC-02"},"TRANSNEA_INDISPONIBILIDADES_LINEAS_DPEC.XLS",3,5,4,6,7,8,0,10,11,14,0,26,0,0,0,0,21,9,44,27,21,27,14]
["MODELO L ENECOR",23,20,11,{"$f":"\"LI-ENECOR-\" & $G$14","v":"LI-ENECOR-02"},"TRANSNEA_INDISPONIBILIDADES_LINEAS_ENECOR.XLS",3,5,4,6,7,8,0,10,11,14,0,26,0,0,0,0,22,9,44,27,21,27,14]
["MODELO L ELING",25,20,11,{"$f":"\"LI-ELECT-\" & $G$14","v":"LI-ELECT-02"},"TRANSNEA_INDISPONIBILIDADES_LINEAS_ELECTROINGENIERIA.XLS",3,5,4,6,7,8,0,10,11,14,0,26,0,0,0,0,23,9,44,27,21,27,14]
["MODELO T ELING",22,20,13,{"$f":"\"T-ELECT-\" & $G$14","v":"T-ELECT-02"},"TRANSNEA_INDISPONIBILIDADES_TRAFOS_ELECTROINGENIERIA.XLS",3,5,4,6,7,8,9,11,12,15,16,18,28,17,0,0,29,9,43,29,20,29,15]
["MODELO S ELING",22,20,10,{"$f":"\"SA-ELECT-\" & $G$14","v":"SA-ELECT-02"},"TRANSNEA_INDISPONIBILIDADES_SALIDAS_ELECTROINGENIERIA.XLS",3,5,4,6,7,8,10,11,14,15,21,0,0,0,0,0,33,9,43,22,20,22,14]
["SUP-DPEC",26,25,11,"SUP-DPEC","TRANSNEA_INDISPONIBILIDADES_LINEAS_DPEC.XLS",0,0,0,4,5,6,0,8,9,12,0,24,0,0,0,0,0,0,0,0,0,0,0]
["MODELO VST",19,24,4,{"$f":"\"CAUSAS-VST-\" & $G$14","v":"CAUSAS-VST-02"},"TRANSNEA_CAUSAS_VST.XLS",3,4,5,6,7,0,0,0,0,0,0,0,0,0,0,0,999,999,0,0,0,0,0]